{"text_format":"1","workbook":"xlsx","n_sheets":3,"sheets":["Список сотрудников","итог","Лист8"],"not_rendered":{"charts":0,"images":0,"macros":0,"external_links":0,"defined_names":6,"comments":0,"pivot_tables":0},"unopened":[],"bounds":{"document_bytes":16777216,"sheet_cells":100000,"rows_first":2000,"rows_last":500,"rows_between":2000,"halvings":0,"cell_chars":16384,"cell_head_chars":4096},"cells_cut":0,"cells_raw":0,"read":"whole","date_system":"1900"}

{"sheet":"Список сотрудников","index":0,"n_rows":743,"n_cols":8,"rows_kept":743,"cut":false,"hidden":false,"merged":[]}
["Фамилия, имя, отчество","Дата рождения","Дата поступления на работу","Предыдущая должность","Новая должность","Дата перевода"]
["Бган Наталья Евгеньевна","29.01.1990","27.11.2013","менеджер по обслуживанию","Старший менеджер по обслуживанию","2015-12-09"]
["Бебик Ольга Николаевна","07.06.1982","06.03.2013","Ведущий специалист по обслуживанию частных лиц","Заместитель руководителя дополнительного офиса","2015-07-22"]
["Бебик Ольга Николаевна","07.06.1982","06.03.2013","Заместитель руководителя дополнительного офиса","Руководитель дополнительного офиса","2015-09-01"]
["Бебик Ольга Николаевна","07.06.1982","06.03.2013","Руководитель дополнительного офиса","Старший менеджер по обслуживанию","2015-10-01"]
["Бебихова Ирина Владимировна","28.10.1959","03.02.2003","Старший специалист","Старший специалист","2014-09-12"]
["Бевзюк Наталья Игоревна","13.08.1992","15.12.2014","Специалист по прямым продажам","Старший специалист","2015-06-01"]
["Бегас Людмила Сергеевна","16.01.1989","17.09.2014","Консультант по банковским продуктам","Консультант по банковским продуктам","2014-10-08"]
["Бегас Людмила Сергеевна","16.01.1989","17.09.2014","Консультант по банковским продуктам","Консультант по банковским продуктам","2015-02-02"]
["Бегас Людмила Сергеевна","16.01.1989","17.09.2014","Консультант по банковским продуктам","Консультант по банковским продуктам","2015-02-03"]
["Бегас Людмила Сергеевна","16.01.1989","17.09.2014","Консультант по банковским продуктам","Консультант по банковским продуктам","2015-02-16"]
["Бегас Людмила Сергеевна","16.01.1989","17.09.2014","Консультант по банковским продуктам","Консультант","2015-10-01"]
["Бегас Людмила Сергеевна","16.01.1989","17.09.2014","Консультант","Консультант","2015-11-10"]
["Бегас Людмила Сергеевна","16.01.1989","17.09.2014","Консультант","Консультант","2015-11-21"]
["Бегиль Наталья Анатольевна","21.10.1983","07.02.2003","Начальник сектора","Начальник сектора","2016-02-01"]
["Бегун Анастасия Евгеньевна","21.11.1989","12.07.2013","Ведущий специалист по обслуживанию частных лиц","Заместитель руководителя дополнительного офиса","2015-02-02"]
["Бегун Анастасия Евгеньевна","21.11.1989","12.07.2013","Ведущий специалист по обслуживанию частных лиц","Заместитель руководителя дополнительного офиса","2015-05-12"]
["Бегун Анастасия Евгеньевна","21.11.1989","12.07.2013","Ведущий специалист по обслуживанию частных лиц","Заместитель руководителя дополнительного офиса","2015-07-15"]
["Бегун Анастасия Евгеньевна","21.11.1989","12.07.2013","Заместитель руководителя дополнительного офиса","Ведущий специалист по обслуживанию частных лиц","2015-08-10"]
["Бегун Анастасия Евгеньевна","21.11.1989","12.07.2013","Ведущий специалист по обслуживанию частных лиц","Заместитель руководителя дополнительного офиса","2015-09-15"]
["Бегун Анастасия Евгеньевна","21.11.1989","12.07.2013","Заместитель руководителя дополнительного офиса","Старший менеджер по обслуживанию","2015-10-16"]
["Бегунова Наталья Валентиновна","31.10.1983","24.12.2012","Ведущий специалист по обслуживанию частных лиц","Ведущий специалист по обслуживанию частных лиц","2015-08-01"]
["Бегунова Наталья Валентиновна","31.10.1983","24.12.2012","Ведущий специалист по обслуживанию частных лиц","Старший менеджер по обслуживанию","2015-10-01"]
["Бедина Ольга Андреевна","20.02.1985","15.08.2007","Ведущий специалист по обслуживанию частных лиц","Старший менеджер по обслуживанию","2015-10-01"]
["Беднарская Юлия Геннадьевна","02.11.1978","01.08.2001","Начальник отдела","Начальник управления","2016-02-01"]
["Бедношеева Юлия Игоревна","21.07.1988","01.09.2012","Ведущий специалист по обслуживанию частных лиц","Старший менеджер по обслуживанию","2015-10-01"]
["Бедулина Наталья Алексеевна","27.07.1991","29.07.2013","Старший специалист","Старший специалист","2014-12-29"]
["Бежина Елена Игоревна","15.12.1994","05.02.2016","Консультант по банковским продуктам","Консультант","2015-10-01"]
["Бежина Елена Игоревна","15.12.1994","05.02.2016","Консультант","Консультант","2016-02-18"]
["Безверхая Елена Васильевна","13.01.1984","29.03.2011","Специалист по обслуживанию корпоративных клиентов","Специалист по обслуживанию корпоративных клиентов","2014-11-01"]
["Безверхая Елена Васильевна","13.01.1984","29.03.2011","Специалист по обслуживанию корпоративных клиентов","Ведущий специалист по обслуживанию корпоративных клиентов","2015-02-26"]
["Безденежных Тамара Владимировна","20.08.1974","28.12.2012","Ведущий специалист по обслуживанию частных лиц","Старший менеджер по обслуживанию","2015-10-01"]
["Безденежных Юлия Олеговна","11.07.1992","18.11.2014","Консультант по банковским продуктам","Консультант по банковским продуктам","2015-01-12"]
["Безденежных Юлия Олеговна","11.07.1992","18.11.2014","Консультант по банковским продуктам","Специалист по обслуживанию частных лиц","2015-07-01"]
["Безденежных Юлия Олеговна","11.07.1992","18.11.2014","Специалист по обслуживанию частных лиц","Менеджер по обслуживанию","2015-10-01"]
["Безденежных Юлия Олеговна","11.07.1992","18.11.2014","менеджер по обслуживанию","Старший менеджер по обслуживанию","2015-10-07"]
["Беззуб Татьяна Леонидовна","05.06.1961","14.08.2006","Ведущий специалист по обслуживанию частных лиц","Ведущий специалист по обслуживанию частных лиц","2015-09-07"]
["Беззуб Татьяна Леонидовна","05.06.1961","14.08.2006","Ведущий специалист по обслуживанию частных лиц","Старший менеджер по обслуживанию","2015-10-01"]
["Беззубов Виталий Анатольевич","08.07.1972","17.09.2009","Инкассатор","Инкассатор","2015-07-01"]
["Безлюдская Екатерина Андреевна","22.01.1991","15.01.2013","Старший специалист","Ведущий специалист","2015-05-05"]
["Безматерных Любовь Владимировна","25.12.1977","10.09.2014","Кассир","Кассир","2015-02-24"]
["Безматерных Любовь Владимировна","25.12.1977","10.09.2014","Кассир","Кассир","2015-07-01"]
["Безматерных Любовь Владимировна","25.12.1977","10.09.2014","Кассир","Кассир","2015-10-01"]
["Безносова Анжелика Николаевна","24.02.1970","16.09.2002","Главный специалист","Старший специалист","2014-10-01"]
["Безносова Анжелика Николаевна","24.02.1970","16.09.2002","Старший специалист","Ведущий специалист","2014-10-02"]
["Безпальченко Татьяна Борисовна","09.02.1973","18.01.1999","Ведущий специалист","Главный специалист","2014-09-15"]
["Безпальченко Татьяна Борисовна","09.02.1973","18.01.1999","Главный специалист","Главный специалист","2015-10-20"]
["Безрукова Анна Олеговна","24.10.1993","10.07.2014","Консультант по банковским продуктам","Консультант по банковским продуктам","2014-10-01"]
["Безрукова Анна Олеговна","24.10.1993","10.07.2014","Консультант по банковским продуктам","Менеджер по продажам","2014-11-11"]
["Безрукова Анна Олеговна","24.10.1993","10.07.2014","Менеджер по продажам","Менеджер по продажам","2014-11-25"]
["Безрукова Анна Олеговна","24.10.1993","10.07.2014","Менеджер по продажам","Менеджер по продажам","2014-12-10"]
["Безрукова Анна Олеговна","24.10.1993","10.07.2014","Менеджер по продажам","Специалист по обслуживанию частных лиц","2015-01-14"]
["Безрукова Анна Олеговна","24.10.1993","10.07.2014","Специалист по обслуживанию частных лиц","Ведущий специалист по обслуживанию частных лиц","2015-07-15"]
["Безрукова Анна Олеговна","24.10.1993","10.07.2014","Ведущий специалист по обслуживанию частных лиц","Менеджер по продажам","2015-10-01"]
["Безрукова Елена Владимировна","18.11.1981","22.04.2004","Начальник отдела","Начальник отдела","2014-10-01"]
["Безрукова Елена Владимировна","18.11.1981","22.04.2004","Начальник отдела","Начальник отдела","2016-02-01"]
["Безрукова Елена Владимировна","18.11.1981","22.04.2004","Начальник отдела","Заместитель директора управления","2016-02-02"]
["Безрукова Надежда Александровна","25.04.1983","16.05.2014","Специалист по обслуживанию частных лиц","Менеджер по продажам","2014-09-29"]
["Безрукова Надежда Александровна","25.04.1983","16.05.2014","Менеджер по продажам","Менеджер по продажам","2014-09-30"]
["Безрукова Надежда Александровна","25.04.1983","16.05.2014","Менеджер по продажам","Менеджер по продажам","2015-11-23"]
["Безрукова Надежда Александровна","25.04.1983","16.05.2014","Менеджер по продажам","Менеджер по продажам","2015-11-24"]
["Безрукова Яна Сергеевна","18.03.1984","09.06.2011","Специалист по обслуживанию частных лиц","Ведущий специалист по обслуживанию частных лиц","2015-07-21"]
["Безрукова Яна Сергеевна","18.03.1984","09.06.2011","Ведущий специалист по обслуживанию частных лиц","Старший менеджер по обслуживанию","2015-10-01"]
["Безуглов Иван Георгиевич","07.03.1973","01.07.2011","Ведущий инженер","Ведущий инженер","2015-10-01"]
["Безуглов Иван Георгиевич","07.03.1973","01.07.2011","Ведущий инженер","Ведущий инженер","2016-03-18"]
["Безуглов Павел Яковлевич","23.12.1971","25.06.2012","Начальник отдела","Руководитель операционного офиса","2015-07-01"]
["Бейсенова Ольга Александровна","24.02.1975","09.01.2001","Начальник сектора","Начальник сектора кредитования малого бизнеса","2014-11-01"]
["Бекерова Наргиз Пироглан Кызы","12.07.1988","20.09.2012","Аналитик","Ведущий специалист","2015-02-16"]
["Бекерова Наргиз Пироглан Кызы","12.07.1988","20.09.2012","Ведущий специалист","Ведущий специалист","2016-01-21"]
["Бекетов Александр Александрович","23.08.1989","02.02.2015","Инкассатор","Инкассатор","2015-07-01"]
["Бекетов Александр Александрович","23.08.1989","02.02.2015","Инкассатор","Водитель-инкассатор","2016-02-01"]
["Бекетова Галина Сергеевна","24.07.1990","01.09.2014","Специалист по обслуживанию частных лиц","Специалист по обслуживанию частных лиц","2014-12-13"]
["Бекетова Галина Сергеевна","24.07.1990","01.09.2014","Специалист по обслуживанию частных лиц","Ведущий специалист по обслуживанию частных лиц","2015-07-15"]
["Бекетова Галина Сергеевна","24.07.1990","01.09.2014","Ведущий специалист по обслуживанию частных лиц","Старший менеджер по обслуживанию","2015-10-01"]
["Бекина Екатерина Юрьевна","31.07.1982","04.08.2006","Специалист по обслуживанию частных лиц","Ведущий специалист по обслуживанию частных лиц","2015-07-09"]
["Бекина Екатерина Юрьевна","31.07.1982","04.08.2006","Ведущий специалист по обслуживанию частных лиц","Старший менеджер по обслуживанию","2015-10-01"]
["Беккаева Галина Михайловна","08.10.1971","28.08.1991","Ведущий специалист по обслуживанию частных лиц","Ведущий специалист по обслуживанию частных лиц","2015-09-04"]
["Беккаева Галина Михайловна","08.10.1971","28.08.1991","Ведущий специалист по обслуживанию частных лиц","Старший менеджер по обслуживанию","2015-10-01"]
["Беккер Полина Павловна","30.08.1991","09.01.2013","Консультант по банковским продуктам","Консультант","2015-10-01"]
["Беклешева Валентина Владимировна","15.02.1991","02.07.2014","Клиентский менеджер","Клиентский менеджер","2014-10-08"]
["Беклешева Валентина Владимировна","15.02.1991","02.07.2014","Клиентский менеджер","Клиентский менеджер","2014-12-08"]
["Беклешева Валентина Владимировна","15.02.1991","02.07.2014","Клиентский менеджер","Клиентский менеджер","2015-02-02"]
["Беклешева Валентина Владимировна","15.02.1991","02.07.2014","Клиентский менеджер","Начальник отдела","2015-07-01"]
["Беклешева Валентина Владимировна","15.02.1991","02.07.2014","Начальник отдела","Начальник отдела","2015-10-21"]
["Беклешева Валентина Владимировна","15.02.1991","02.07.2014","Начальник отдела","Клиентский менеджер","2015-10-26"]
["Беклешева Валентина Владимировна","15.02.1991","02.07.2014","Клиентский менеджер","Клиентский менеджер","2016-02-04"]
["Белая Анастасия Жановна","17.05.1985","25.08.2014","Клиентский менеджер","Клиентский менеджер","2015-08-10"]
["Белая Анастасия Жановна","17.05.1985","25.08.2014","Клиентский менеджер","Клиентский менеджер","2016-01-11"]
["Белая Анастасия Константиновна","12.05.1987","11.09.2015","Менеджер по продажам (подменный фонд)","Консультант","2015-10-01"]
["Белая Анастасия Константиновна","12.05.1987","11.09.2015","Консультант","Консультант","2016-02-04"]
["Белевич Ольга Валерьевна","17.10.1971","08.11.2011","Старший специалист","Старший специалист","2014-10-01"]
["Беленикина Татьяна Павловна","15.07.1987","13.04.2009","Главный специалист","Аудитор","2015-09-14"]
["Беленко Елена Ивановна","23.10.1990","22.04.2014","Консультант по банковским продуктам","Консультант","2015-10-01"]
["Белецкая Елена Леонидовна","22.09.1973","01.02.2001","Ведущий экономист","Менеджер по продажам платежных сервисов","2015-05-18"]
["Белецкая Елена Леонидовна","22.09.1973","01.02.2001","Менеджер по продажам платежных сервисов","Менеджер по продажам платежных сервисов","2015-10-12"]
["Белецкая Елена Леонидовна","22.09.1973","01.02.2001","Менеджер по продажам и сопровождению платежных сервисов","Менеджер по продажам и сопровождению платежных сервисов","2016-01-12"]
["Белецкая Полина Васильевна","03.09.1990","07.10.2010","Ведущий специалист","Ведущий специалист","2014-09-15"]
["Белецкая Регина Владимировна","16.07.1995","24.03.2015","Специалист по обслуживанию частных лиц","Специалист по обслуживанию частных лиц","2015-08-17"]
["Белецкая Регина Владимировна","16.07.1995","24.03.2015","Специалист по обслуживанию частных лиц","Менеджер по обслуживания","2015-10-01"]
["Беликова Оксана Александровна","21.09.1974","01.06.2001","Специалист по обслуживанию корпоративных клиентов","Специалист по обслуживанию корпоративных клиентов","2014-12-30"]
["Беликова Оксана Александровна","21.09.1974","01.06.2001","Специалист по обслуживанию корпоративных клиентов","Ведущий специалист по обслуживанию частных лиц","2015-01-01"]
["Беликова Оксана Александровна","21.09.1974","01.06.2001","Ведущий специалист по обслуживанию частных лиц","Старший менеджер по обслуживанию","2015-10-01"]
["Белимов Сергей Александрович","17.02.1972","21.05.2012","Начальник сектора","Ведущий специалист","2016-01-21"]
["Белицкая Кристина Игоревна","23.06.1992","27.11.2014","Специалист по обслуживанию частных лиц","Менеджер по обслуживанию","2015-10-01"]
["Беличенко Анна Владимировна","17.07.1989","16.05.2011","Главный специалист","Менеджер по поддержке продаж сложных продуктов","2015-02-24"]
["Беличенко Анна Владимировна","17.07.1989","16.05.2011","Менеджер по поддержке продаж сложных продуктов","Эксперт","2016-01-11"]
["Беличенко Анна Владимировна","17.07.1989","16.05.2011","Эксперт","Менеджер по поддержке продаж сложных продуктов","2016-01-20"]
["Беличенко Мария Александровна","05.02.1983","08.07.2013","Клиентский менеджер","Клиентский менеджер","2014-11-01"]
["Беличенко Роман Александрович","30.05.1989","14.03.2016","Начальник сектора","Заместитель начальника отдела","2015-08-24"]
["Беличенко Роман Александрович","30.05.1989","14.03.2016","Заместитель начальника отдела","Начальник отдела","2015-11-02"]
["Белкина Елена Станиславовна","23.01.1990","17.12.2010","Ведущий специалист по обслуживанию частных лиц","Старший менеджер по обслуживанию","2015-10-01"]
["Белобородов Андрей Александрович","18.01.1988","01.11.2011","Ведущий инженер","Ведущий инженер","2015-10-01"]
["Белобородов Андрей Александрович","18.01.1988","01.11.2011","Ведущий инженер","Главный инженер","2015-10-27"]
["Белобородов Максим Анатольевич","15.06.1977","10.01.2002","Клиентский менеджер","Клиентский менеджер","2014-12-01"]
["Белобородова Елена Владимировна","11.02.1996","25.08.2015","Консультант по банковским продуктам","Консультант","2015-10-01"]
["Белобородова Татьяна Владимировна","01.12.1992","25.07.2013","Консультант по банковским продуктам","Консультант","2015-10-01"]
["Белов Александр Николаевич","08.12.1965","01.12.2009","Главный инспектор","Руководитель операционного офиса","2015-07-01"]
["Белов Андрей Васильевич","28.12.1970","01.03.1999","Начальник сектора","Начальник сектора","2015-10-01"]
["Белов Денис Владимирович","18.08.1990","02.04.2015","Старший специалист","Старший специалист","2016-01-12"]
["Белова Евгения Владимировна","30.12.1987","30.08.2010","Менеджер по обучению","Эксперт","2015-12-04"]
{"$rows_left_out":624}
{"sheet":"итог","index":1,"n_rows":4,"n_cols":7,"rows_kept":4,"cut":false,"hidden":false,"merged":[]}
["ФИО","Дата рождения","Текущая должность","Стаж"]
["Белова Нина Александровна","27.02.1983","Риск - аналитик",{"$f":"IF(MIN(IF(($A2='Список сотрудников'!$A$2:$A$1245)*('Список сотрудников'!$E$2:$E$1245=$C2),'Список сотрудников'!$F$2:$F$1245))=0,0,TEXT(MIN(IF(($A2='Список сотрудников'!$A$2:$A$1245)*('Список сотрудников'!$E$2:$E$1245=$C2),'Список сотрудников'!$F$2:$F$1245)),\"ДД.ММ.ГГГГ\"))","v":"10.11.2014"},{"$f":"IF(MAX(IF(($A2='Список сотрудников'!$A$2:$A$1245)*('Список сотрудников'!$E$2:$E$1245=$C2),'Список сотрудников'!$F$2:$F$1245))=0,0,TEXT(MAX(IF(($A2='Список сотрудников'!$A$2:$A$1245)*('Список сотрудников'!$E$2:$E$1245=$C2),'Список сотрудников'!$F$2:$F$1245)),\"ДД.ММ.ГГГГ\"))","v":"10.11.2014"},{"$f":"E2-D2","v":0},{"$f":"IF(MAX(IF(($A2='Список сотрудников'!$A$2:$A$1245)*('Список сотрудников'!$E$2:$E$1245=$C2),'Список сотрудников'!$F$2:$F$1245))=0,0,TEXT(MAX(IF(($A2='Список сотрудников'!$A$2:$A$1245)*('Список сотрудников'!$E$2:$E$1245=$C2),'Список сотрудников'!$F$2:$F$1245)),\"ДД.ММ.ГГГГ\"))-IF(MIN(IF(($A2='Список сотрудников'!$A$2:$A$1245)*('Список сотрудников'!$E$2:$E$1245=$C2),'Список сотрудников'!$F$2:$F$1245))=0,0,TEXT(MIN(IF(($A2='Список сотрудников'!$A$2:$A$1245)*('Список сотрудников'!$E$2:$E$1245=$C2),'Список сотрудников'!$F$2:$F$1245)),\"ДД.ММ.ГГГГ\"))","v":0}]
["Болдин Тимур Васильевич","08.05.1985","Риск - аналитик",{"$f":"IF(MIN(IF(($A3='Список сотрудников'!$A$2:$A$1245)*('Список сотрудников'!$E$2:$E$1245=$C3),'Список сотрудников'!$F$2:$F$1245))=0,0,TEXT(MIN(IF(($A3='Список сотрудников'!$A$2:$A$1245)*('Список сотрудников'!$E$2:$E$1245=$C3),'Список сотрудников'!$F$2:$F$1245)),\"ДД.ММ.ГГГГ\"))","v":"10.11.2014"},{"$f":"IF(MAX(IF(($A3='Список сотрудников'!$A$2:$A$1245)*('Список сотрудников'!$E$2:$E$1245=$C3),'Список сотрудников'!$F$2:$F$1245))=0,0,TEXT(MAX(IF(($A3='Список сотрудников'!$A$2:$A$1245)*('Список сотрудников'!$E$2:$E$1245=$C3),'Список сотрудников'!$F$2:$F$1245)),\"ДД.ММ.ГГГГ\"))","v":"10.11.2014"},{"$f":"E3-D3","v":0},{"$f":"IF(MAX(IF(($A3='Список сотрудников'!$A$2:$A$1245)*('Список сотрудников'!$E$2:$E$1245=$C3),'Список сотрудников'!$F$2:$F$1245))=0,0,TEXT(MAX(IF(($A3='Список сотрудников'!$A$2:$A$1245)*('Список сотрудников'!$E$2:$E$1245=$C3),'Список сотрудников'!$F$2:$F$1245)),\"ДД.ММ.ГГГГ\"))-IF(MIN(IF(($A3='Список сотрудников'!$A$2:$A$1245)*('Список сотрудников'!$E$2:$E$1245=$C3),'Список сотрудников'!$F$2:$F$1245))=0,0,TEXT(MIN(IF(($A3='Список сотрудников'!$A$2:$A$1245)*('Список сотрудников'!$E$2:$E$1245=$C3),'Список сотрудников'!$F$2:$F$1245)),\"ДД.ММ.ГГГГ\"))","v":0}]
["Васильева Анастасия Юрьевна","23.06.1988","Менеджер по продажам",{"$f":"IF(MIN(IF(($A4='Список сотрудников'!$A$2:$A$1245)*('Список сотрудников'!$E$2:$E$1245=$C4),'Список сотрудников'!$F$2:$F$1245))=0,0,TEXT(MIN(IF(($A4='Список сотрудников'!$A$2:$A$1245)*('Список сотрудников'!$E$2:$E$1245=$C4),'Список сотрудников'!$F$2:$F$1245)),\"ДД.ММ.ГГГГ\"))","v":"06.03.2015"},{"$f":"IF(MAX(IF(($A4='Список сотрудников'!$A$2:$A$1245)*('Список сотрудников'!$E$2:$E$1245=$C4),'Список сотрудников'!$F$2:$F$1245))=0,0,TEXT(MAX(IF(($A4='Список сотрудников'!$A$2:$A$1245)*('Список сотрудников'!$E$2:$E$1245=$C4),'Список сотрудников'!$F$2:$F$1245)),\"ДД.ММ.ГГГГ\"))","v":"10.08.2015"},{"$f":"E4-D4","v":157},{"$f":"IF(MAX(IF(($A4='Список сотрудников'!$A$2:$A$1245)*('Список сотрудников'!$E$2:$E$1245=$C4),'Список сотрудников'!$F$2:$F$1245))=0,0,TEXT(MAX(IF(($A4='Список сотрудников'!$A$2:$A$1245)*('Список сотрудников'!$E$2:$E$1245=$C4),'Список сотрудников'!$F$2:$F$1245)),\"ДД.ММ.ГГГГ\"))-IF(MIN(IF(($A4='Список сотрудников'!$A$2:$A$1245)*('Список сотрудников'!$E$2:$E$1245=$C4),'Список сотрудников'!$F$2:$F$1245))=0,0,TEXT(MIN(IF(($A4='Список сотрудников'!$A$2:$A$1245)*('Список сотрудников'!$E$2:$E$1245=$C4),'Список сотрудников'!$F$2:$F$1245)),\"ДД.ММ.ГГГГ\"))","v":157}]

{"sheet":"Лист8","index":2,"n_rows":13,"n_cols":7,"rows_kept":13,"cut":false,"hidden":false,"merged":[]}
["Фамилия, имя, отчество","Дата рождения","Дата поступления на работу","Предыдущая должность","Новая должность","Дата перевода","Текущая должность"]
["Литвинцев Илья Петрович","18.04.1988","16.07.2013","Старший инженер","Ведущий инженер","2015-02-10","Ведущий инженер"]
["Литвинцев Илья Петрович","18.04.1988","16.07.2013","Ведущий инженер","Ведущий инженер","2015-10-01","Ведущий инженер"]
[]
["Есть сотрудник на листе \"Итог\". Он несколько раз переводился из одной должности в другую. На примере данного сотрудника считаем дни в текущей должности. "]
["Текущая должность \"Ведущий инженер\". На эту должность он перевелся 10.02.2015. Потом он перевелся на такую же должность в другой отдел. Стаж в этой должности у него не прерывается."]
["Необходимо посчитать этот стаж. Например, у данного сотрудника стаж будет составлять 231 день."]
["Мы от даты последнего перевода (01.10.2015) отнимаем дату первого перевода на текущую должность (10.02.2015)"]
["В колонку \"Стаж\" на листе \"Итог\" необходимо проставить дату стажа - получаем ее как дату последнего перевода на текущую должность минус дней в должности"]
["получается 01.10.2015 - 231 день = 12.02.2015 - эту дату необходимо проставить в колонку \"Стаж\" на листе \"Итог\" "]
[]
["Кузнецов Максим Викторович","07.12.1980","07.08.2015","Начальник сектора","Менеджер","2015-10-01",{"$f":"INDEX(итог!C:C,MATCH('Список сотрудников'!#REF!,итог!A:A,0))","v":{"$error":"#REF!"}}]
["В данном случае, когда был только один перевод, в колонку \"Стаж\" на листе \"Итог\" необходимо проставлять просто дату перевода"]