{"text_format":"1","workbook":"xlsx","n_sheets":3,"sheets":["Сценарии","User","BPN2 Mode"],"not_rendered":{"charts":0,"images":0,"macros":1,"external_links":0,"defined_names":1,"comments":0,"pivot_tables":0},"unopened":[],"bounds":{"document_bytes":16777216,"sheet_cells":100000,"rows_first":2000,"rows_last":500,"rows_between":2000,"halvings":0,"cell_chars":16384,"cell_head_chars":4096},"cells_cut":0,"cells_raw":0,"read":"whole","date_system":"1900"}

{"sheet":"Сценарии","index":0,"n_rows":22,"n_cols":13,"rows_kept":22,"cut":false,"hidden":true,"merged":[[2,1,3,1],[2,2,3,2],[2,4,2,8],[2,9,2,12],[19,9,19,12],[19,4,19,8]]}
[null,"MAIN"]
[]
[null,"№","Mode","GSM","UMTS",null,null,null,null,"LTE"]
[null,null,null,"TRX","CS","CE","HSDPA Code","UL \nThroughput","DL Throughput","Cell","UL \nThroughput","DL Throughput","RRC"]
[null,1,"G",72,0,0,0,0,0,0,0,0,0]
[null,2,"U",0,12,1024,180,138,518.4,0,0,0,0]
[null,3,"L",0,0,0,0,0,0,12,600,1200,7200]
[null,4,"GU1",12,12,768,180,138,518.4,0,0,0,0]
[null,5,"GU2",24,9,640,135,103.5,388.8,0,0,0,0]
[null,6,"GU3",36,6,512,90,69,259.2,0,0,0,0]
[null,7,"GU4",48,6,256,90,69,259.2,0,0,0,0]
[null,8,"GL",36,0,0,0,0,0,6,300,600,3600]
[null,9,"UL",0,6,512,90,69,259.2,6,300,600,3600]
[null,10,"GUL1",12,6,256,90,69,259.2,6,300,600,3600]
[null,11,"GUL2",24,3,128,45,34.5,129.6,6,300,600,3600]
[]
[null,null,null,{"$f":"СуммЦвет(D5:D15,B1)","v":{"$error":"#NAME?"}}]
[]
[]
[null,null,null,"2G","3G",null,null,null,null,"4G"]
[null,null,null,"trx","cs","ce",null,"thpulu","thpdlu","cells","thpull","thpdll","rrc"]
[null,null,null,24,9,{"$f":"E22*150","v":1350},null,{"$f":"E22*5.6","v":50.4},{"$f":"E22*21","v":189},3,{"$f":"J22*50","v":150},{"$f":"J22*150","v":450},{"$f":"J22*192","v":576}]

{"sheet":"User","index":1,"n_rows":31,"n_cols":25,"rows_kept":31,"cut":false,"hidden":false,"merged":[[23,23,24,23],[23,24,24,24],[17,22,17,34],[18,22,18,28],[16,22,16,24],[26,23,27,24],[26,15,27,22],[10,9,10,12],[9,13,11,13],[4,3,4,6],[9,1,9,12],[5,12,5,13],[23,4,24,4],[23,5,24,5],[23,7,24,7],[23,6,24,6],[10,1,11,1],[10,2,11,2],[10,4,10,8],[23,13,24,13],[7,13,8,13],[5,1,5,2],[7,8,8,8],[7,9,8,9],[7,10,8,10],[7,11,8,11],[7,1,8,2],[7,3,8,3],[7,4,8,4],[7,5,8,5],[7,6,8,6],[23,11,24,11],[23,12,24,12],[0,3,0,12],[1,4,1,8],[1,9,1,12],[7,7,8,7],[7,12,8,12],[23,1,24,2],[23,3,24,3],[23,8,24,8],[23,9,24,9],[23,10,24,10]]}
[null,null,null,"Задайте необходимые параметры:"]
[null,null,null,"GMS","UMTS",null,null,null,null,"LTE",null,null,null,"Mode"]
[null,null,null,"TRX","CS","CE","HSDPA Code","UL \nThroughput","DL Throughput","Cell","UL \nThroughput","DL Throughput","RRC"]
[null,null,null,25,null,1500,null,null,null,null,null,null,3600]
[null,null,null,"*Обязательны для заполнения!"]
[null,"Нужно добрать ",null,null,null,null,null,null,null,null,null,null,"Избыток"]
[null,null,null,{"$f":"D8-D4","v":-25},null,{"$f":"F8-F4","v":-1500},null,null,null,null,null,null,{"$f":"M8-M4","v":-3600}]
[null,"Сумма значений:",null,{"$f":"D24","v":0},{"$f":"E24","v":0},0,0,0,0,0,0,0,0,0]
[]
[null,"Результат",null,null,null,null,null,null,null,null,null,null,null,"Кол-во плат"]
[null,"№","Mode","GSM","UMTS",null,null,null,null,"LTE"]
[null,null,null,"TRX","CS","CE","HSDPA Code","UL \nThroughput","DL Throughput","Cell","UL \nThroughput","DL Throughput","RRC"]
[null,1,"G",72,0,0,0,0,0,0,0,0,0,{"$f":"COUNTIF($P$26:$S$26,$C13)","v":0}]
[null,2,"U",0,12,1024,180,138,518.4,0,0,0,0,{"$f":"COUNTIF($P$26:$S$26,$C14)","v":0}]
[null,3,"L",0,0,0,0,0,0,12,600,1200,7200,0]
[null,4,"GU1",12,12,768,180,138,518.4,0,0,0,0,0]
[null,5,"GU2",24,9,640,135,103.5,388.8,0,0,0,0,0,null,null,null,null,null,null,null,null,"Вставить в Макрос9"]
[null,6,"GU3",36,6,512,90,69,259.2,0,0,0,0,0,null,null,null,null,null,null,null,null,"ЕСЛИ($N$4=\"GU\";КОРЕНЬ(T30^2+U30^2);ЕСЛИ($N$4=\"GL\";КОРЕНЬ(T30^2+V30^2);ЕСЛИ($N$4=\"UL\";КОРЕНЬ(U30^2+V30^2))))"]
[null,7,"GU4",48,6,256,90,69,259.2,0,0,0,0,0,null,null,null,null,null,null,null,null,"ЕСЛИ($N$4=\"G\";T30;ЕСЛИ($N$4=\"U\";U30;ЕСЛИ($N$4=\"L\";V30)))"]
[null,8,"GL",36,0,0,0,0,0,6,300,600,3600,0]
[null,9,"UL",0,6,512,90,69,259.2,6,300,600,3600,0]
[null,10,"GUL1",12,6,256,90,69,259.2,6,300,600,3600,0]
[null,11,"GUL2",24,3,128,45,34.5,129.6,6,300,600,3600,0]
[null,"Сумма значений:",null,{"$f":"SUMPRODUCT(D13:D23,N13:N23)","v":0},{"$f":"SUMPRODUCT(E13:E23,N13:N23)","v":0},{"$f":"SUMPRODUCT(F13:F23,N13:N23)","v":0},{"$f":"SUMPRODUCT(G13:G23,N13:N23)","v":0},{"$f":"SUMPRODUCT(H13:H23,N13:N23)","v":0},{"$f":"SUMPRODUCT(I13:I23,N13:N23)","v":0},{"$f":"SUMPRODUCT(J13:J23,N13:N23)","v":0},{"$f":"SUMPRODUCT(K13:K23,N13:N23)","v":0},{"$f":"SUMPRODUCT(L13:L23,N13:N23)","v":0},{"$f":"SUMPRODUCT(M13:M23,N13:N23)","v":0},{"$f":"SUM(N13:N23)","v":0},null,null,null,null,null,null,null,null,null,"Первую в этот столбик","Вторую (короткую) в этот столбик"]
[]
[]
[null,null,null,null,null,null,null,null,null,null,null,null,null,null,null,"Возможные варианты",null,null,null,null,null,null,null,"Optim"]
[]
[null,null,null,null,null,null,null,null,null,null,null,null,null,null,null,"bp1","bp2","bp3","bp4","trx","ce","rrc","N","MULTI","SINGLE"]
[null,null,null,null,null,null,null,null,null,null,null,null,null,null,null,null,null,null,null,null,null,null,null,{"$f":"IF($N$4=\"GU\",SQRT(T30^2+U30^2),IF($N$4=\"GL\",SQRT(T30^2+V30^2),IF($N$4=\"UL\",SQRT(U30^2+V30^2))))","v":false},{"$f":"IF($N$4=\"G\",T30,IF($N$4=\"U\",U30,IF($N$4=\"L\",V30)))","v":false}]
["asdas",null,null,null,null,null,null,null,null,null,null,null,null,null,null,null,null,null,null,null,null,null,null,false,false]

{"sheet":"BPN2 Mode","index":2,"n_rows":563,"n_cols":9,"rows_kept":563,"cut":false,"hidden":false,"merged":[[0,1,0,4],[0,5,0,7],[0,8,1,8],[0,9,1,9]]}
[null,"BPN2 mode",null,null,null,"Total capacity",null,null,"N кол-во плат"]
[null,"BP 1","BP 2","BP 3","BP 4","TRX","CE","RRC"]
[null,"G",null,null,null,{"$f":"VLOOKUP($B3,Сценарии!$C$5:$M$15,2,0)","v":72},{"$f":"VLOOKUP($B3,Сценарии!$C$5:$M$15,4,0)","v":0},{"$f":"VLOOKUP($B3,Сценарии!$C$5:$M$15,11,0)","v":0},{"$f":"COUNTA(B3,C3,D3,E3)","v":1}]
[null,"U",null,null,null,{"$f":"VLOOKUP($B4,Сценарии!$C$5:$M$15,2,0)","v":0},{"$f":"VLOOKUP($B4,Сценарии!$C$5:$M$15,4,0)","v":1024},{"$f":"VLOOKUP($B4,Сценарии!$C$5:$M$15,11,0)","v":0},1]
[null,"L",null,null,null,{"$f":"VLOOKUP($B5,Сценарии!$C$5:$M$15,2,0)","v":0},{"$f":"VLOOKUP($B5,Сценарии!$C$5:$M$15,4,0)","v":0},{"$f":"VLOOKUP($B5,Сценарии!$C$5:$M$15,11,0)","v":7200},1]
[null,"GU1",null,null,null,{"$f":"VLOOKUP($B6,Сценарии!$C$5:$M$15,2,0)","v":12},{"$f":"VLOOKUP($B6,Сценарии!$C$5:$M$15,4,0)","v":768},{"$f":"VLOOKUP($B6,Сценарии!$C$5:$M$15,11,0)","v":0},1]
[null,"GU2",null,null,null,{"$f":"VLOOKUP($B7,Сценарии!$C$5:$M$15,2,0)","v":24},{"$f":"VLOOKUP($B7,Сценарии!$C$5:$M$15,4,0)","v":640},{"$f":"VLOOKUP($B7,Сценарии!$C$5:$M$15,11,0)","v":0},1]
[null,"GU3",null,null,null,{"$f":"VLOOKUP($B8,Сценарии!$C$5:$M$15,2,0)","v":36},{"$f":"VLOOKUP($B8,Сценарии!$C$5:$M$15,4,0)","v":512},{"$f":"VLOOKUP($B8,Сценарии!$C$5:$M$15,11,0)","v":0},1]
[null,"GU4",null,null,null,{"$f":"VLOOKUP($B9,Сценарии!$C$5:$M$15,2,0)","v":48},{"$f":"VLOOKUP($B9,Сценарии!$C$5:$M$15,4,0)","v":256},{"$f":"VLOOKUP($B9,Сценарии!$C$5:$M$15,11,0)","v":0},1]
[null,"GL",null,null,null,{"$f":"VLOOKUP($B10,Сценарии!$C$5:$M$15,2,0)","v":36},{"$f":"VLOOKUP($B10,Сценарии!$C$5:$M$15,4,0)","v":0},{"$f":"VLOOKUP($B10,Сценарии!$C$5:$M$15,11,0)","v":3600},1]
[null,"UL",null,null,null,{"$f":"VLOOKUP($B11,Сценарии!$C$5:$M$15,2,0)","v":0},{"$f":"VLOOKUP($B11,Сценарии!$C$5:$M$15,4,0)","v":512},{"$f":"VLOOKUP($B11,Сценарии!$C$5:$M$15,11,0)","v":3600},1]
[null,"GUL1",null,null,null,{"$f":"VLOOKUP($B12,Сценарии!$C$5:$M$15,2,0)","v":12},{"$f":"VLOOKUP($B12,Сценарии!$C$5:$M$15,4,0)","v":256},{"$f":"VLOOKUP($B12,Сценарии!$C$5:$M$15,11,0)","v":3600},1]
[null,"GUL2",null,null,null,{"$f":"VLOOKUP($B13,Сценарии!$C$5:$M$15,2,0)","v":24},{"$f":"VLOOKUP($B13,Сценарии!$C$5:$M$15,4,0)","v":128},{"$f":"VLOOKUP($B13,Сценарии!$C$5:$M$15,11,0)","v":3600},1]
[null,"G","U",null,null,{"$f":"VLOOKUP($B14,Сценарии!$C$5:$M$15,2,0)+VLOOKUP($C14,Сценарии!$C$5:$M$15,2,0)","v":72},{"$f":"VLOOKUP($B14,Сценарии!$C$5:$M$15,4,0)+VLOOKUP($C14,Сценарии!$C$5:$M$15,4,0)","v":1024},{"$f":"VLOOKUP($B14,Сценарии!$C$5:$M$15,11,0)+VLOOKUP($C14,Сценарии!$C$5:$M$15,11,0)","v":0},2]
[null,"G","L",null,null,{"$f":"VLOOKUP($B15,Сценарии!$C$5:$M$15,2,0)+VLOOKUP($C15,Сценарии!$C$5:$M$15,2,0)","v":72},{"$f":"VLOOKUP($B15,Сценарии!$C$5:$M$15,4,0)+VLOOKUP($C15,Сценарии!$C$5:$M$15,4,0)","v":0},{"$f":"VLOOKUP($B15,Сценарии!$C$5:$M$15,11,0)+VLOOKUP($C15,Сценарии!$C$5:$M$15,11,0)","v":7200},2]
[null,"G","GU1",null,null,{"$f":"VLOOKUP($B16,Сценарии!$C$5:$M$15,2,0)+VLOOKUP($C16,Сценарии!$C$5:$M$15,2,0)","v":84},{"$f":"VLOOKUP($B16,Сценарии!$C$5:$M$15,4,0)+VLOOKUP($C16,Сценарии!$C$5:$M$15,4,0)","v":768},{"$f":"VLOOKUP($B16,Сценарии!$C$5:$M$15,11,0)+VLOOKUP($C16,Сценарии!$C$5:$M$15,11,0)","v":0},2]
[null,"G","GU2",null,null,{"$f":"VLOOKUP($B17,Сценарии!$C$5:$M$15,2,0)+VLOOKUP($C17,Сценарии!$C$5:$M$15,2,0)","v":96},{"$f":"VLOOKUP($B17,Сценарии!$C$5:$M$15,4,0)+VLOOKUP($C17,Сценарии!$C$5:$M$15,4,0)","v":640},{"$f":"VLOOKUP($B17,Сценарии!$C$5:$M$15,11,0)+VLOOKUP($C17,Сценарии!$C$5:$M$15,11,0)","v":0},2]
[null,"G","GU3",null,null,{"$f":"VLOOKUP($B18,Сценарии!$C$5:$M$15,2,0)+VLOOKUP($C18,Сценарии!$C$5:$M$15,2,0)","v":108},{"$f":"VLOOKUP($B18,Сценарии!$C$5:$M$15,4,0)+VLOOKUP($C18,Сценарии!$C$5:$M$15,4,0)","v":512},{"$f":"VLOOKUP($B18,Сценарии!$C$5:$M$15,11,0)+VLOOKUP($C18,Сценарии!$C$5:$M$15,11,0)","v":0},2]
[null,"G","GU4",null,null,{"$f":"VLOOKUP($B19,Сценарии!$C$5:$M$15,2,0)+VLOOKUP($C19,Сценарии!$C$5:$M$15,2,0)","v":120},{"$f":"VLOOKUP($B19,Сценарии!$C$5:$M$15,4,0)+VLOOKUP($C19,Сценарии!$C$5:$M$15,4,0)","v":256},{"$f":"VLOOKUP($B19,Сценарии!$C$5:$M$15,11,0)+VLOOKUP($C19,Сценарии!$C$5:$M$15,11,0)","v":0},2]
[null,"G","GL",null,null,{"$f":"VLOOKUP($B20,Сценарии!$C$5:$M$15,2,0)+VLOOKUP($C20,Сценарии!$C$5:$M$15,2,0)","v":108},{"$f":"VLOOKUP($B20,Сценарии!$C$5:$M$15,4,0)+VLOOKUP($C20,Сценарии!$C$5:$M$15,4,0)","v":0},{"$f":"VLOOKUP($B20,Сценарии!$C$5:$M$15,11,0)+VLOOKUP($C20,Сценарии!$C$5:$M$15,11,0)","v":3600},2]
[null,"G","UL",null,null,{"$f":"VLOOKUP($B21,Сценарии!$C$5:$M$15,2,0)+VLOOKUP($C21,Сценарии!$C$5:$M$15,2,0)","v":72},{"$f":"VLOOKUP($B21,Сценарии!$C$5:$M$15,4,0)+VLOOKUP($C21,Сценарии!$C$5:$M$15,4,0)","v":512},{"$f":"VLOOKUP($B21,Сценарии!$C$5:$M$15,11,0)+VLOOKUP($C21,Сценарии!$C$5:$M$15,11,0)","v":3600},2]
[null,"G","GUL1",null,null,{"$f":"VLOOKUP($B22,Сценарии!$C$5:$M$15,2,0)+VLOOKUP($C22,Сценарии!$C$5:$M$15,2,0)","v":84},{"$f":"VLOOKUP($B22,Сценарии!$C$5:$M$15,4,0)+VLOOKUP($C22,Сценарии!$C$5:$M$15,4,0)","v":256},{"$f":"VLOOKUP($B22,Сценарии!$C$5:$M$15,11,0)+VLOOKUP($C22,Сценарии!$C$5:$M$15,11,0)","v":3600},2]
[null,"G","GUL2",null,null,{"$f":"VLOOKUP($B23,Сценарии!$C$5:$M$15,2,0)+VLOOKUP($C23,Сценарии!$C$5:$M$15,2,0)","v":96},{"$f":"VLOOKUP($B23,Сценарии!$C$5:$M$15,4,0)+VLOOKUP($C23,Сценарии!$C$5:$M$15,4,0)","v":128},{"$f":"VLOOKUP($B23,Сценарии!$C$5:$M$15,11,0)+VLOOKUP($C23,Сценарии!$C$5:$M$15,11,0)","v":3600},2]
[null,"U","L",null,null,{"$f":"VLOOKUP($B24,Сценарии!$C$5:$M$15,2,0)+VLOOKUP($C24,Сценарии!$C$5:$M$15,2,0)","v":0},{"$f":"VLOOKUP($B24,Сценарии!$C$5:$M$15,4,0)+VLOOKUP($C24,Сценарии!$C$5:$M$15,4,0)","v":1024},{"$f":"VLOOKUP($B24,Сценарии!$C$5:$M$15,11,0)+VLOOKUP($C24,Сценарии!$C$5:$M$15,11,0)","v":7200},2]
[null,"U","GU1",null,null,{"$f":"VLOOKUP($B25,Сценарии!$C$5:$M$15,2,0)+VLOOKUP($C25,Сценарии!$C$5:$M$15,2,0)","v":12},{"$f":"VLOOKUP($B25,Сценарии!$C$5:$M$15,4,0)+VLOOKUP($C25,Сценарии!$C$5:$M$15,4,0)","v":1792},{"$f":"VLOOKUP($B25,Сценарии!$C$5:$M$15,11,0)+VLOOKUP($C25,Сценарии!$C$5:$M$15,11,0)","v":0},2]
[null,"U","GU2",null,null,{"$f":"VLOOKUP($B26,Сценарии!$C$5:$M$15,2,0)+VLOOKUP($C26,Сценарии!$C$5:$M$15,2,0)","v":24},{"$f":"VLOOKUP($B26,Сценарии!$C$5:$M$15,4,0)+VLOOKUP($C26,Сценарии!$C$5:$M$15,4,0)","v":1664},{"$f":"VLOOKUP($B26,Сценарии!$C$5:$M$15,11,0)+VLOOKUP($C26,Сценарии!$C$5:$M$15,11,0)","v":0},2]
[null,"U","GU3",null,null,{"$f":"VLOOKUP($B27,Сценарии!$C$5:$M$15,2,0)+VLOOKUP($C27,Сценарии!$C$5:$M$15,2,0)","v":36},{"$f":"VLOOKUP($B27,Сценарии!$C$5:$M$15,4,0)+VLOOKUP($C27,Сценарии!$C$5:$M$15,4,0)","v":1536},{"$f":"VLOOKUP($B27,Сценарии!$C$5:$M$15,11,0)+VLOOKUP($C27,Сценарии!$C$5:$M$15,11,0)","v":0},2]
[null,"U","GU4",null,null,{"$f":"VLOOKUP($B28,Сценарии!$C$5:$M$15,2,0)+VLOOKUP($C28,Сценарии!$C$5:$M$15,2,0)","v":48},{"$f":"VLOOKUP($B28,Сценарии!$C$5:$M$15,4,0)+VLOOKUP($C28,Сценарии!$C$5:$M$15,4,0)","v":1280},{"$f":"VLOOKUP($B28,Сценарии!$C$5:$M$15,11,0)+VLOOKUP($C28,Сценарии!$C$5:$M$15,11,0)","v":0},2]
[null,"U","GL",null,null,{"$f":"VLOOKUP($B29,Сценарии!$C$5:$M$15,2,0)+VLOOKUP($C29,Сценарии!$C$5:$M$15,2,0)","v":36},{"$f":"VLOOKUP($B29,Сценарии!$C$5:$M$15,4,0)+VLOOKUP($C29,Сценарии!$C$5:$M$15,4,0)","v":1024},{"$f":"VLOOKUP($B29,Сценарии!$C$5:$M$15,11,0)+VLOOKUP($C29,Сценарии!$C$5:$M$15,11,0)","v":3600},2]
[null,"U","UL",null,null,{"$f":"VLOOKUP($B30,Сценарии!$C$5:$M$15,2,0)+VLOOKUP($C30,Сценарии!$C$5:$M$15,2,0)","v":0},{"$f":"VLOOKUP($B30,Сценарии!$C$5:$M$15,4,0)+VLOOKUP($C30,Сценарии!$C$5:$M$15,4,0)","v":1536},{"$f":"VLOOKUP($B30,Сценарии!$C$5:$M$15,11,0)+VLOOKUP($C30,Сценарии!$C$5:$M$15,11,0)","v":3600},2]
[null,"U","GUL1",null,null,{"$f":"VLOOKUP($B31,Сценарии!$C$5:$M$15,2,0)+VLOOKUP($C31,Сценарии!$C$5:$M$15,2,0)","v":12},{"$f":"VLOOKUP($B31,Сценарии!$C$5:$M$15,4,0)+VLOOKUP($C31,Сценарии!$C$5:$M$15,4,0)","v":1280},{"$f":"VLOOKUP($B31,Сценарии!$C$5:$M$15,11,0)+VLOOKUP($C31,Сценарии!$C$5:$M$15,11,0)","v":3600},2]
[null,"U","GUL2",null,null,{"$f":"VLOOKUP($B32,Сценарии!$C$5:$M$15,2,0)+VLOOKUP($C32,Сценарии!$C$5:$M$15,2,0)","v":24},{"$f":"VLOOKUP($B32,Сценарии!$C$5:$M$15,4,0)+VLOOKUP($C32,Сценарии!$C$5:$M$15,4,0)","v":1152},{"$f":"VLOOKUP($B32,Сценарии!$C$5:$M$15,11,0)+VLOOKUP($C32,Сценарии!$C$5:$M$15,11,0)","v":3600},2]
[null,"L","GU1",null,null,{"$f":"VLOOKUP($B33,Сценарии!$C$5:$M$15,2,0)+VLOOKUP($C33,Сценарии!$C$5:$M$15,2,0)","v":12},{"$f":"VLOOKUP($B33,Сценарии!$C$5:$M$15,4,0)+VLOOKUP($C33,Сценарии!$C$5:$M$15,4,0)","v":768},{"$f":"VLOOKUP($B33,Сценарии!$C$5:$M$15,11,0)+VLOOKUP($C33,Сценарии!$C$5:$M$15,11,0)","v":7200},2]
[null,"L","GU2",null,null,{"$f":"VLOOKUP($B34,Сценарии!$C$5:$M$15,2,0)+VLOOKUP($C34,Сценарии!$C$5:$M$15,2,0)","v":24},{"$f":"VLOOKUP($B34,Сценарии!$C$5:$M$15,4,0)+VLOOKUP($C34,Сценарии!$C$5:$M$15,4,0)","v":640},{"$f":"VLOOKUP($B34,Сценарии!$C$5:$M$15,11,0)+VLOOKUP($C34,Сценарии!$C$5:$M$15,11,0)","v":7200},2]
[null,"L","GU3",null,null,{"$f":"VLOOKUP($B35,Сценарии!$C$5:$M$15,2,0)+VLOOKUP($C35,Сценарии!$C$5:$M$15,2,0)","v":36},{"$f":"VLOOKUP($B35,Сценарии!$C$5:$M$15,4,0)+VLOOKUP($C35,Сценарии!$C$5:$M$15,4,0)","v":512},{"$f":"VLOOKUP($B35,Сценарии!$C$5:$M$15,11,0)+VLOOKUP($C35,Сценарии!$C$5:$M$15,11,0)","v":7200},2]
[null,"L","GU4",null,null,{"$f":"VLOOKUP($B36,Сценарии!$C$5:$M$15,2,0)+VLOOKUP($C36,Сценарии!$C$5:$M$15,2,0)","v":48},{"$f":"VLOOKUP($B36,Сценарии!$C$5:$M$15,4,0)+VLOOKUP($C36,Сценарии!$C$5:$M$15,4,0)","v":256},{"$f":"VLOOKUP($B36,Сценарии!$C$5:$M$15,11,0)+VLOOKUP($C36,Сценарии!$C$5:$M$15,11,0)","v":7200},2]
[null,"L","GL",null,null,{"$f":"VLOOKUP($B37,Сценарии!$C$5:$M$15,2,0)+VLOOKUP($C37,Сценарии!$C$5:$M$15,2,0)","v":36},{"$f":"VLOOKUP($B37,Сценарии!$C$5:$M$15,4,0)+VLOOKUP($C37,Сценарии!$C$5:$M$15,4,0)","v":0},{"$f":"VLOOKUP($B37,Сценарии!$C$5:$M$15,11,0)+VLOOKUP($C37,Сценарии!$C$5:$M$15,11,0)","v":10800},2]
[null,"L","UL",null,null,{"$f":"VLOOKUP($B38,Сценарии!$C$5:$M$15,2,0)+VLOOKUP($C38,Сценарии!$C$5:$M$15,2,0)","v":0},{"$f":"VLOOKUP($B38,Сценарии!$C$5:$M$15,4,0)+VLOOKUP($C38,Сценарии!$C$5:$M$15,4,0)","v":512},{"$f":"VLOOKUP($B38,Сценарии!$C$5:$M$15,11,0)+VLOOKUP($C38,Сценарии!$C$5:$M$15,11,0)","v":10800},2]
[null,"L","GUL1",null,null,{"$f":"VLOOKUP($B39,Сценарии!$C$5:$M$15,2,0)+VLOOKUP($C39,Сценарии!$C$5:$M$15,2,0)","v":12},{"$f":"VLOOKUP($B39,Сценарии!$C$5:$M$15,4,0)+VLOOKUP($C39,Сценарии!$C$5:$M$15,4,0)","v":256},{"$f":"VLOOKUP($B39,Сценарии!$C$5:$M$15,11,0)+VLOOKUP($C39,Сценарии!$C$5:$M$15,11,0)","v":10800},2]
[null,"L","GUL2",null,null,{"$f":"VLOOKUP($B40,Сценарии!$C$5:$M$15,2,0)+VLOOKUP($C40,Сценарии!$C$5:$M$15,2,0)","v":24},{"$f":"VLOOKUP($B40,Сценарии!$C$5:$M$15,4,0)+VLOOKUP($C40,Сценарии!$C$5:$M$15,4,0)","v":128},{"$f":"VLOOKUP($B40,Сценарии!$C$5:$M$15,11,0)+VLOOKUP($C40,Сценарии!$C$5:$M$15,11,0)","v":10800},2]
[null,"GU1","GU2",null,null,{"$f":"VLOOKUP($B41,Сценарии!$C$5:$M$15,2,0)+VLOOKUP($C41,Сценарии!$C$5:$M$15,2,0)","v":36},{"$f":"VLOOKUP($B41,Сценарии!$C$5:$M$15,4,0)+VLOOKUP($C41,Сценарии!$C$5:$M$15,4,0)","v":1408},{"$f":"VLOOKUP($B41,Сценарии!$C$5:$M$15,11,0)+VLOOKUP($C41,Сценарии!$C$5:$M$15,11,0)","v":0},2]
[null,"GU1","GU3",null,null,{"$f":"VLOOKUP($B42,Сценарии!$C$5:$M$15,2,0)+VLOOKUP($C42,Сценарии!$C$5:$M$15,2,0)","v":48},{"$f":"VLOOKUP($B42,Сценарии!$C$5:$M$15,4,0)+VLOOKUP($C42,Сценарии!$C$5:$M$15,4,0)","v":1280},{"$f":"VLOOKUP($B42,Сценарии!$C$5:$M$15,11,0)+VLOOKUP($C42,Сценарии!$C$5:$M$15,11,0)","v":0},2]
[null,"GU1","GU4",null,null,{"$f":"VLOOKUP($B43,Сценарии!$C$5:$M$15,2,0)+VLOOKUP($C43,Сценарии!$C$5:$M$15,2,0)","v":60},{"$f":"VLOOKUP($B43,Сценарии!$C$5:$M$15,4,0)+VLOOKUP($C43,Сценарии!$C$5:$M$15,4,0)","v":1024},{"$f":"VLOOKUP($B43,Сценарии!$C$5:$M$15,11,0)+VLOOKUP($C43,Сценарии!$C$5:$M$15,11,0)","v":0},2]
[null,"GU1","GL",null,null,{"$f":"VLOOKUP($B44,Сценарии!$C$5:$M$15,2,0)+VLOOKUP($C44,Сценарии!$C$5:$M$15,2,0)","v":48},{"$f":"VLOOKUP($B44,Сценарии!$C$5:$M$15,4,0)+VLOOKUP($C44,Сценарии!$C$5:$M$15,4,0)","v":768},{"$f":"VLOOKUP($B44,Сценарии!$C$5:$M$15,11,0)+VLOOKUP($C44,Сценарии!$C$5:$M$15,11,0)","v":3600},2]
[null,"GU1","UL",null,null,{"$f":"VLOOKUP($B45,Сценарии!$C$5:$M$15,2,0)+VLOOKUP($C45,Сценарии!$C$5:$M$15,2,0)","v":12},{"$f":"VLOOKUP($B45,Сценарии!$C$5:$M$15,4,0)+VLOOKUP($C45,Сценарии!$C$5:$M$15,4,0)","v":1280},{"$f":"VLOOKUP($B45,Сценарии!$C$5:$M$15,11,0)+VLOOKUP($C45,Сценарии!$C$5:$M$15,11,0)","v":3600},2]
[null,"GU1","GUL1",null,null,{"$f":"VLOOKUP($B46,Сценарии!$C$5:$M$15,2,0)+VLOOKUP($C46,Сценарии!$C$5:$M$15,2,0)","v":24},{"$f":"VLOOKUP($B46,Сценарии!$C$5:$M$15,4,0)+VLOOKUP($C46,Сценарии!$C$5:$M$15,4,0)","v":1024},{"$f":"VLOOKUP($B46,Сценарии!$C$5:$M$15,11,0)+VLOOKUP($C46,Сценарии!$C$5:$M$15,11,0)","v":3600},2]
[null,"GU1","GUL2",null,null,{"$f":"VLOOKUP($B47,Сценарии!$C$5:$M$15,2,0)+VLOOKUP($C47,Сценарии!$C$5:$M$15,2,0)","v":36},{"$f":"VLOOKUP($B47,Сценарии!$C$5:$M$15,4,0)+VLOOKUP($C47,Сценарии!$C$5:$M$15,4,0)","v":896},{"$f":"VLOOKUP($B47,Сценарии!$C$5:$M$15,11,0)+VLOOKUP($C47,Сценарии!$C$5:$M$15,11,0)","v":3600},2]
[null,"GU2","GU3",null,null,{"$f":"VLOOKUP($B48,Сценарии!$C$5:$M$15,2,0)+VLOOKUP($C48,Сценарии!$C$5:$M$15,2,0)","v":60},{"$f":"VLOOKUP($B48,Сценарии!$C$5:$M$15,4,0)+VLOOKUP($C48,Сценарии!$C$5:$M$15,4,0)","v":1152},{"$f":"VLOOKUP($B48,Сценарии!$C$5:$M$15,11,0)+VLOOKUP($C48,Сценарии!$C$5:$M$15,11,0)","v":0},2]
[null,"GU2","GU4",null,null,{"$f":"VLOOKUP($B49,Сценарии!$C$5:$M$15,2,0)+VLOOKUP($C49,Сценарии!$C$5:$M$15,2,0)","v":72},{"$f":"VLOOKUP($B49,Сценарии!$C$5:$M$15,4,0)+VLOOKUP($C49,Сценарии!$C$5:$M$15,4,0)","v":896},{"$f":"VLOOKUP($B49,Сценарии!$C$5:$M$15,11,0)+VLOOKUP($C49,Сценарии!$C$5:$M$15,11,0)","v":0},2]
[null,"GU2","GL",null,null,{"$f":"VLOOKUP($B50,Сценарии!$C$5:$M$15,2,0)+VLOOKUP($C50,Сценарии!$C$5:$M$15,2,0)","v":60},{"$f":"VLOOKUP($B50,Сценарии!$C$5:$M$15,4,0)+VLOOKUP($C50,Сценарии!$C$5:$M$15,4,0)","v":640},{"$f":"VLOOKUP($B50,Сценарии!$C$5:$M$15,11,0)+VLOOKUP($C50,Сценарии!$C$5:$M$15,11,0)","v":3600},2]
[null,"GU2","UL",null,null,{"$f":"VLOOKUP($B51,Сценарии!$C$5:$M$15,2,0)+VLOOKUP($C51,Сценарии!$C$5:$M$15,2,0)","v":24},{"$f":"VLOOKUP($B51,Сценарии!$C$5:$M$15,4,0)+VLOOKUP($C51,Сценарии!$C$5:$M$15,4,0)","v":1152},{"$f":"VLOOKUP($B51,Сценарии!$C$5:$M$15,11,0)+VLOOKUP($C51,Сценарии!$C$5:$M$15,11,0)","v":3600},2]
[null,"GU2","GUL1",null,null,{"$f":"VLOOKUP($B52,Сценарии!$C$5:$M$15,2,0)+VLOOKUP($C52,Сценарии!$C$5:$M$15,2,0)","v":36},{"$f":"VLOOKUP($B52,Сценарии!$C$5:$M$15,4,0)+VLOOKUP($C52,Сценарии!$C$5:$M$15,4,0)","v":896},{"$f":"VLOOKUP($B52,Сценарии!$C$5:$M$15,11,0)+VLOOKUP($C52,Сценарии!$C$5:$M$15,11,0)","v":3600},2]
[null,"GU2","GUL2",null,null,{"$f":"VLOOKUP($B53,Сценарии!$C$5:$M$15,2,0)+VLOOKUP($C53,Сценарии!$C$5:$M$15,2,0)","v":48},{"$f":"VLOOKUP($B53,Сценарии!$C$5:$M$15,4,0)+VLOOKUP($C53,Сценарии!$C$5:$M$15,4,0)","v":768},{"$f":"VLOOKUP($B53,Сценарии!$C$5:$M$15,11,0)+VLOOKUP($C53,Сценарии!$C$5:$M$15,11,0)","v":3600},2]
[null,"GU3","GU4",null,null,{"$f":"VLOOKUP($B54,Сценарии!$C$5:$M$15,2,0)+VLOOKUP($C54,Сценарии!$C$5:$M$15,2,0)","v":84},{"$f":"VLOOKUP($B54,Сценарии!$C$5:$M$15,4,0)+VLOOKUP($C54,Сценарии!$C$5:$M$15,4,0)","v":768},{"$f":"VLOOKUP($B54,Сценарии!$C$5:$M$15,11,0)+VLOOKUP($C54,Сценарии!$C$5:$M$15,11,0)","v":0},2]
[null,"GU3","GL",null,null,{"$f":"VLOOKUP($B55,Сценарии!$C$5:$M$15,2,0)+VLOOKUP($C55,Сценарии!$C$5:$M$15,2,0)","v":72},{"$f":"VLOOKUP($B55,Сценарии!$C$5:$M$15,4,0)+VLOOKUP($C55,Сценарии!$C$5:$M$15,4,0)","v":512},{"$f":"VLOOKUP($B55,Сценарии!$C$5:$M$15,11,0)+VLOOKUP($C55,Сценарии!$C$5:$M$15,11,0)","v":3600},2]
[null,"GU3","UL",null,null,{"$f":"VLOOKUP($B56,Сценарии!$C$5:$M$15,2,0)+VLOOKUP($C56,Сценарии!$C$5:$M$15,2,0)","v":36},{"$f":"VLOOKUP($B56,Сценарии!$C$5:$M$15,4,0)+VLOOKUP($C56,Сценарии!$C$5:$M$15,4,0)","v":1024},{"$f":"VLOOKUP($B56,Сценарии!$C$5:$M$15,11,0)+VLOOKUP($C56,Сценарии!$C$5:$M$15,11,0)","v":3600},2]
[null,"GU3","GUL1",null,null,{"$f":"VLOOKUP($B57,Сценарии!$C$5:$M$15,2,0)+VLOOKUP($C57,Сценарии!$C$5:$M$15,2,0)","v":48},{"$f":"VLOOKUP($B57,Сценарии!$C$5:$M$15,4,0)+VLOOKUP($C57,Сценарии!$C$5:$M$15,4,0)","v":768},{"$f":"VLOOKUP($B57,Сценарии!$C$5:$M$15,11,0)+VLOOKUP($C57,Сценарии!$C$5:$M$15,11,0)","v":3600},2]
[null,"GU3","GUL2",null,null,{"$f":"VLOOKUP($B58,Сценарии!$C$5:$M$15,2,0)+VLOOKUP($C58,Сценарии!$C$5:$M$15,2,0)","v":60},{"$f":"VLOOKUP($B58,Сценарии!$C$5:$M$15,4,0)+VLOOKUP($C58,Сценарии!$C$5:$M$15,4,0)","v":640},{"$f":"VLOOKUP($B58,Сценарии!$C$5:$M$15,11,0)+VLOOKUP($C58,Сценарии!$C$5:$M$15,11,0)","v":3600},2]
[null,"GU4","GL",null,null,{"$f":"VLOOKUP($B59,Сценарии!$C$5:$M$15,2,0)+VLOOKUP($C59,Сценарии!$C$5:$M$15,2,0)","v":84},{"$f":"VLOOKUP($B59,Сценарии!$C$5:$M$15,4,0)+VLOOKUP($C59,Сценарии!$C$5:$M$15,4,0)","v":256},{"$f":"VLOOKUP($B59,Сценарии!$C$5:$M$15,11,0)+VLOOKUP($C59,Сценарии!$C$5:$M$15,11,0)","v":3600},2]
[null,"GU4","UL",null,null,{"$f":"VLOOKUP($B60,Сценарии!$C$5:$M$15,2,0)+VLOOKUP($C60,Сценарии!$C$5:$M$15,2,0)","v":48},{"$f":"VLOOKUP($B60,Сценарии!$C$5:$M$15,4,0)+VLOOKUP($C60,Сценарии!$C$5:$M$15,4,0)","v":768},{"$f":"VLOOKUP($B60,Сценарии!$C$5:$M$15,11,0)+VLOOKUP($C60,Сценарии!$C$5:$M$15,11,0)","v":3600},2]
{"$rows_left_out":503}