{"text_format":"1","workbook":"xlsx","n_sheets":3,"sheets":["Исходные данные","Итог","Работники"],"not_rendered":{"charts":0,"images":0,"macros":1,"external_links":0,"defined_names":1,"comments":0,"pivot_tables":0},"unopened":[],"bounds":{"document_bytes":16777216,"sheet_cells":100000,"rows_first":2000,"rows_last":500,"rows_between":2000,"halvings":0,"cell_chars":16384,"cell_head_chars":4096},"cells_cut":0,"cells_raw":0,"read":"whole","date_system":"1900"}

{"sheet":"Исходные данные","index":0,"n_rows":93,"n_cols":3,"rows_kept":93,"cut":false,"hidden":false,"merged":[]}
["Дата учета","ФИО","Отработано часов"]
["2016-02-01","Алексеев Алексей Алексеевич",4]
["2016-02-01","Алексеев Алексей Алексеевич",8]
["2016-02-01","Алексеев Алексей Алексеевич",4]
["2016-02-01","Алексеев Алексей Алексеевич",8]
["2016-02-02","Алексеев Алексей Алексеевич",4]
["2016-02-03","Алексеев Алексей Алексеевич",8]
["2016-02-01","Александров Александр Александрович",8]
["2016-02-01","Александров Александр Александрович",8]
["2016-02-01","Александров Александр Александрович",8]
["2016-02-01","Алексеев Алексей Алексеевич",8]
["2016-02-01","Сидоров Федор Ивенович",8]
["2016-02-01","Сидоров Федор Ивенович",8]
["2016-02-01","Петров Пётр Петрович",8]
["2016-02-01","Петров Пётр Петрович",8]
["2016-02-02","Сидоров Федор Ивенович",8]
["2016-02-03","Сидоров Федор Ивенович",3]
["2016-02-01","Иванов Иван Иванович",8]
["2016-02-02","Иванов Иван Иванович",8]
["2016-02-03","Иванов Иван Иванович",8]
["2016-02-01","Петров Пётр Петрович",8]
["2016-02-02","Петров Пётр Петрович",8]
["2016-02-03","Петров Пётр Петрович",4]
["2016-02-04","Петров Пётр Петрович",5]
["2016-02-01","Александров Александр Александрович",8]
["2016-02-02","Александров Александр Александрович",6]
["2016-02-03","Александров Александр Александрович",8]
["2016-02-04","Александров Александр Александрович",8]
["2016-02-03","Сидоров Федор Ивенович",5]
["2016-02-04","Алексеев Алексей Алексеевич",8]
["2016-02-04","Иванов Иван Иванович",8]
["2016-02-04","Сидоров Федор Ивенович",8]
["2016-02-05","Иванов Иван Иванович",4]
["2016-02-05","Алексеев Алексей Алексеевич",8]
["2016-02-05","Сидоров Федор Ивенович",8]
["2016-02-08","Сидоров Федор Ивенович",8]
["2016-02-09","Сидоров Федор Ивенович",8]
["2016-02-08","Александров Александр Александрович",8]
["2016-02-08","Алексеев Алексей Алексеевич",8]
["2016-02-08","Иванов Иван Иванович",8]
["2016-02-09","Иванов Иван Иванович",8]
["2016-02-09","Александров Александр Александрович",8]
["2016-02-09","Алексеев Алексей Алексеевич",8]
["2016-02-05","Александров Александр Александрович",4]
["2016-02-08","Петров Пётр Петрович",2]
["2016-02-08","Петров Пётр Петрович",6]
["2016-02-09","Петров Пётр Петрович",8]
["2016-02-10","Петров Пётр Петрович",8]
["2016-02-10","Сидоров Федор Ивенович",8]
["2016-02-10","Иванов Иван Иванович",3]
["2016-02-10","Александров Александр Александрович",3]
["2016-02-10","Александров Александр Александрович",5]
["2016-02-10","Иванов Иван Иванович",5]
["2016-02-11","Сидоров Федор Ивенович",8]
["2016-02-12","Сидоров Федор Ивенович",8]
["2016-02-10","Алексеев Алексей Алексеевич",8]
["2016-02-11","Алексеев Алексей Алексеевич",8]
["2016-02-12","Алексеев Алексей Алексеевич",8]
["2016-02-11","Иванов Иван Иванович",3]
["2016-02-11","Александров Александр Александрович",8]
["2016-02-11","Петров Пётр Петрович",8]
["2016-02-12","Иванов Иван Иванович",8]
["2016-02-12","Александров Александр Александрович",8]
["2016-02-15","Александров Александр Александрович",8]
["2016-02-15","Петров Пётр Петрович",8]
["2016-02-16","Петров Пётр Петрович",2]
["2016-02-17","Александров Александр Александрович",8]
["2016-02-17","Сидоров Федор Ивенович",1]
["2016-02-17","Сидоров Федор Ивенович",1]
["2016-02-18","Сидоров Федор Ивенович",1]
["2016-02-19","Алексеев Алексей Алексеевич",5]
["2016-02-17","Сидоров Федор Ивенович",6]
["2016-02-18","Сидоров Федор Ивенович",7]
["2016-02-19","Сидоров Федор Ивенович",8]
["2016-02-20","Сидоров Федор Ивенович",7]
["2016-02-18","Алексеев Алексей Алексеевич",8]
["2016-02-18","Александров Александр Александрович",8]
["2016-02-19","Петров Пётр Петрович",8]
["2016-02-20","Петров Пётр Петрович",2]
["2016-02-20","Алексеев Алексей Алексеевич",7]
["2016-02-22","Алексеев Алексей Алексеевич",11]
["2016-02-24","Алексеев Алексей Алексеевич",8]
["2016-02-24","Сидоров Федор Ивенович",4]
["2016-02-22","Петров Пётр Петрович",11]
["2016-02-24","Петров Пётр Петрович",8]
["2016-02-22","Иванов Иван Иванович",11]
["2016-02-24","Иванов Иван Иванович",8]
["2016-02-24","Сидоров Федор Ивенович",4]
["2016-02-25","Алексеев Алексей Алексеевич",8]
["2016-02-25","Петров Пётр Петрович",8]
["2016-02-25","Иванов Иван Иванович",8]
["2016-02-25","Сидоров Федор Ивенович",8]
["2016-02-25","Александров Александр Александрович",8]

{"sheet":"Итог","index":1,"n_rows":201,"n_cols":3,"rows_kept":201,"cut":false,"hidden":false,"merged":[[1,0,1,2]]}
[null,"Алексеев Алексей Алексеевич"]
["Отработанное время"]
["Дата учета","ФИО","Отработанные"]
[{"$f":"IFERROR(INDEX('Исходные данные'!$A$2:$A$93,SMALL(IF(Итог!$B$1='Исходные данные'!B2:B93,ROW('Исходные данные'!A2:A93)-1,\"\"),ROW()-3)),\"\")","v":"2016-02-01"},{"$f":"IFERROR(INDEX('Исходные данные'!$B$2:$B$93,SMALL(IF(Итог!$B$1='Исходные данные'!B2:B93,ROW('Исходные данные'!B2:B93)-1,\"\"),ROW()-3)),\"\")","v":"Алексеев Алексей Алексеевич"},{"$f":"IFERROR(INDEX('Исходные данные'!$C$2:$C$93,SMALL(IF(Итог!$B$1='Исходные данные'!B2:B93,ROW('Исходные данные'!C2:C93)-1,\"\"),ROW()-3)),\"\")","v":4}]
["2016-02-01","Алексеев Алексей Алексеевич",8]
["2016-02-01","Алексеев Алексей Алексеевич",4]
["2016-02-01","Алексеев Алексей Алексеевич",8]
["2016-02-02","Алексеев Алексей Алексеевич",4]
["2016-02-03","Алексеев Алексей Алексеевич",8]
["2016-02-01","Алексеев Алексей Алексеевич",8]
["2016-02-04","Алексеев Алексей Алексеевич",8]
["2016-02-05","Алексеев Алексей Алексеевич",8]
["2016-02-08","Алексеев Алексей Алексеевич",8]
["2016-02-09","Алексеев Алексей Алексеевич",8]
["2016-02-10","Алексеев Алексей Алексеевич",8]
["2016-02-11","Алексеев Алексей Алексеевич",8]
["2016-02-12","Алексеев Алексей Алексеевич",8]
["2016-02-19","Алексеев Алексей Алексеевич",5]
["2016-02-18","Алексеев Алексей Алексеевич",8]
["2016-02-20","Алексеев Алексей Алексеевич",7]
["2016-02-22","Алексеев Алексей Алексеевич",11]
["2016-02-24","Алексеев Алексей Алексеевич",8]
["2016-02-25","Алексеев Алексей Алексеевич",8]
["","",""]
["","",""]
["","",""]
["","",""]
["","",""]
["","",""]
["","",""]
["","",""]
["","",""]
["","",""]
["","",""]
["","",""]
["","",""]
["","",""]
["","",""]
["","",""]
["","",""]
["","",""]
["","",""]
["","",""]
["","",""]
["","",""]
["","",""]
["","",""]
["","",""]
["","",""]
["","",""]
["","",""]
["","",""]
["","",""]
["","",""]
["","",""]
["","",""]
["","",""]
["","",""]
["","",""]
["","",""]
["","",""]
["","",""]
["","",""]
["","",""]
["","",""]
["","",""]
["","",""]
["","",""]
["","",""]
["","",""]
["","",""]
["","",""]
["","",""]
["","",""]
["","",""]
["","",""]
["","",""]
["","",""]
["","",""]
["","",""]
["","",""]
["","",""]
["","",""]
["","",""]
["","",""]
["","",""]
["","",""]
["","",""]
["","",""]
["","",""]
["","",""]
["","",""]
["","",""]
["","",""]
["","",""]
["","",""]
["","",""]
["","",""]
["","",""]
["","",""]
["","",""]
["","",""]
["","",""]
["","",""]
["","",""]
["","",""]
["","",""]
["","",""]
["","",""]
["","",""]
["","",""]
["","",""]
["","",""]
["","",""]
["","",""]
["","",""]
["","",""]
["","",""]
["","",""]
["","",""]
["","",""]
["","",""]
["","",""]
["","",""]
["","",""]
["","",""]
["","",""]
["","",""]
["","",""]
["","",""]
["","",""]
["","",""]
["","",""]
["","",""]
["","",""]
["","",""]
["","",""]
["","",""]
["","",""]
["","",""]
["","",""]
["","",""]
["","",""]
["","",""]
["","",""]
["","",""]
["","",""]
["","",""]
["","",""]
["","",""]
["","",""]
["","",""]
["","",""]
["","",""]
["","",""]
["","",""]
["","",""]
["","",""]
["","",""]
["","",""]
["","",""]
["","",""]
["","",""]
["","",""]
["","",""]
["","",""]
["","",""]
["","",""]
["","",""]
["","",""]
["","",""]
["","",""]
["","",""]
["","",""]
["","",""]
["","",""]
["","",""]
["","",""]
["","",""]
["","",""]
["","",""]
["","",""]
["","",""]
["","",""]
["","",""]
["","",""]
["","",""]
["","",""]
["","",""]
["","",""]
["","",""]
["","",""]
["","",""]
["","",""]
["","",""]
["","",""]
["","",""]
["","",""]
["","",""]
["","",""]
["Итого",{"$f":"B1","v":"Алексеев Алексей Алексеевич"},{"$f":"SUM(C4:C200)","v":147}]

{"sheet":"Работники","index":2,"n_rows":6,"n_cols":2,"rows_kept":6,"cut":false,"hidden":false,"merged":[]}
[null,"Список сотрудников"]
[1,"Иванов Иван Иванович"]
[2,"Сидоров Федор Ивенович"]
[3,"Петров Пётр Петрович"]
[4,"Александров Александр Александрович"]
[5,"Алексеев Алексей Алексеевич"]