{"text_format":"1","workbook":"xlsx","n_sheets":2,"sheets":["К51","справочник"],"not_rendered":{"charts":0,"images":0,"macros":1,"external_links":0,"defined_names":1,"comments":0,"pivot_tables":0},"unopened":[],"bounds":{"document_bytes":16777216,"sheet_cells":100000,"rows_first":2000,"rows_last":500,"rows_between":2000,"halvings":0,"cell_chars":16384,"cell_head_chars":4096},"cells_cut":0,"cells_raw":0,"read":"whole","date_system":"1900"}

{"sheet":"К51","index":0,"n_rows":6,"n_cols":10,"rows_kept":6,"cut":false,"hidden":false,"merged":[]}
["дата","документ","Аналитика Дт","Аналитика Кт","Дебет","Кредит","сумма","затраты","контрагент","затраты в КП"]
["2016-01-14","Списание с расчетного счета 00000000001 от 14.01.2016 0:00:00\nСтраховые взносы по обязательному социальному страхованию от несчастных случаев на производстве и проффессиональных заболеваний за декабрь 2015г. рег.","Налог (взносы): начислено / уплачено","Отделение N8428 Сбербанка России  (Расчетный)\nРасчеты по налогам и сборам","69.11",51,10,{"$f":"IFERROR(VLOOKUP(E2,справочник!A:B,2,0),IF(сплит1(сплит(C2,2),1)=\"\",сплит2(сплит(C2,2),1),сплит1(сплит(C2,2),1)))","v":"налоги на зарплату"},{"$f":"IF(ISTEXT(VLOOKUP(E2,справочник!A:B,2,0))*1=1,\"\",сплит(C2,1))","v":""},"Страховые взносы"]
["2016-01-14","Списание с расчетного счета 00000000004 от 14.01.2016 0:00:00\nОплата по  сч.№3 от 13.01.16г., за материалы по вх.д.10 от 14.01.2016","Поставщик 4\nматериалы сч.3  от 13.01.2016г.\nСписание с расчетного счета 00000000004 от 14.01.2016 0:00:00","Отделение N8428 Сбербанка России  (Расчетный)\nОплата товаров, работ, услуг, сырья и иных оборотных активов","60.02",51,2203,{"$f":"IFERROR(VLOOKUP(E3,справочник!A:B,2,0),IF(сплит1(сплит(C3,2),1)=\"\",сплит2(сплит(C3,2),1),сплит1(сплит(C3,2),1)))","v":"материалы "},{"$f":"IF(ISTEXT(VLOOKUP(E3,справочник!A:B,2,0))*1=1,\"\",сплит(C3,1))","v":"Поставщик 4"},"хозтовары, канцтовары"]
["2016-01-14","Списание с расчетного счета 00000000013 от 14.01.2016 0:00:00\nОплата по  счету №284 от 13.01.2016г. за  насосы по вх.д.15 от 14.01.2016","Поставщик 3\nСч. №0658 от 18.01.2016г. материалы\nСписание с расчетного счета 00000000013 от 14.01.2016 0:00:00","Отделение N8428 Сбербанка России  (Расчетный)\nОплата товаров, работ, услуг, сырья и иных оборотных активов","60.02",51,21480,{"$f":"IFERROR(VLOOKUP(E4,справочник!A:B,2,0),IF(сплит1(сплит(C4,2),1)=\"\",сплит2(сплит(C4,2),1),сплит1(сплит(C4,2),1)))","v":"Сч. №0658 от 18.01.2016г. материалы"},{"$f":"IF(ISTEXT(VLOOKUP(E4,справочник!A:B,2,0))*1=1,\"\",сплит(C4,1))","v":"Поставщик 3"},"материалы на ремонт и ТО"]
["2016-01-14","Списание с расчетного счета 00000000014 от 14.01.2016 0:00:00\nОплата по Сч. №1311 от 29.10.15г.за перемешивающее устройство по вх.д.16 от 14.01.2016","Поставщик 2\nСч. №60 от 25.01.16г. материалы\nСписание с расчетного счета 00000000014 от 14.01.2016 0:00:00","Отделение N8428 Сбербанка России  (Расчетный)\nОплата товаров, работ, услуг, сырья и иных оборотных активов","60.02",51,26550,{"$f":"IFERROR(VLOOKUP(E5,справочник!A:B,2,0),IF(сплит1(сплит(C5,2),1)=\"\",сплит2(сплит(C5,2),1),сплит1(сплит(C5,2),1)))","v":"Сч. №60 от 25.01.16г. материалы"},{"$f":"IF(ISTEXT(VLOOKUP(E5,справочник!A:B,2,0))*1=1,\"\",сплит(C5,1))","v":"Поставщик 2"},"основные"]
["2016-03-03","Списание с расчетного счета 00000000199 от 03.03.2016 0:00:00\n00000000000000000130 Оплата по счету №94 от 04.03.2016г. по дог. №09-инв-31603370374 от 04.03.2016г. за проведение расчетов нормативов допуст. антроп.","Поставщик 1\nсч. 94 от 09.03.2016 разработка проекта\nСписание с расчетного счета 00000000199 от 03.03.2016 0:00:00","Отделение N8428 Сбербанка России  (Расчетный)\nОплата товаров, работ, услуг, сырья и иных оборотных активов","60.02",51,80021.7,{"$f":"IFERROR(VLOOKUP(E6,справочник!A:B,2,0),IF(сплит1(сплит(C6,2),1)=\"\",сплит2(сплит(C6,2),1),сплит1(сплит(C6,2),1)))","v":"сч. 94 от 09.03.2016 разработка проекта"},{"$f":"IF(ISTEXT(VLOOKUP(E6,справочник!A:B,2,0))*1=1,\"\",сплит(C6,1))","v":"Поставщик 1"},"технологические услуги"]

{"sheet":"справочник","index":1,"n_rows":20,"n_cols":2,"rows_kept":20,"cut":false,"hidden":false,"merged":[]}
["счёт","затраты"]
["68.01","НДФЛ"]
["68.02","НДС"]
["68.07","пени, налоги"]
["68.08","пени, налоги"]
["68.09","пени, налоги"]
["69.02.1","налоги на зарплату"]
["69.02.2","налоги на зарплату"]
["69.03.1","налоги на зарплату"]
["69.11","налоги на зарплату"]
["69.02.6","налоги на зарплату"]
["69.02.7","налоги на зарплату"]
[70,"зарплата"]
["71.01","подотчётники"]
["91.02","Расходы на услуги банков"]
["76.41","алименты"]
["66.01","погашение займа"]
["68.03","Земельный налог"]
["69.01","пени на страховые взносы"]
["69.06.3","налоги на зарплату"]