{"text_format":"1","workbook":"xlsx","n_sheets":2,"sheets":["Entertainment","ДанныеВикторины"],"not_rendered":{"charts":0,"images":0,"macros":1,"external_links":0,"defined_names":1,"comments":0,"pivot_tables":0},"unopened":[],"bounds":{"document_bytes":16777216,"sheet_cells":100000,"rows_first":2000,"rows_last":500,"rows_between":2000,"halvings":0,"cell_chars":16384,"cell_head_chars":4096},"cells_cut":0,"cells_raw":0,"read":"whole","date_system":"1900"}

{"sheet":"Entertainment","index":0,"n_rows":21,"n_cols":2,"rows_kept":21,"cut":false,"hidden":false,"merged":[]}
["Noun","Rus."]
["aberration","заблуждение"]
["font","шрифт, источник"]
["nebbish","никчемный человек"]
["peddler","разносчик"]
["shrimp","креветка"]
["sneak","подлец, ябеда, трус"]
["stench","вонь"]
["whereabout","местонахождения"]
["friend","друг"]
["mother","мать"]
["girl","девушка"]
["boy","парень"]
["king","король"]
["queen","королева"]
["pink","розовый"]
["blue","голубой"]
["red","красный"]
["green","зеленый"]
["milk","молоко"]
["gin","джин"]

{"sheet":"ДанныеВикторины","index":1,"n_rows":11,"n_cols":12,"rows_kept":11,"cut":false,"hidden":false,"merged":[]}
["Англ","Рус 1","Рус 2","Рус 3","Рус 4","Позиция Правильного",null,"Англ","Рус 1","Рус 2","Рус 3","Рус 4"]
[17,17,1,13,16,1,null,{"$f":"IF(A2=0,\"\",INDEX(Entertainment!$A$2:$A$1000,A2))","v":"red"},{"$f":"IF(B2=0,\"\",INDEX(Entertainment!$B$2:$B$1000,B2))","v":"красный"},{"$f":"IF(C2=0,\"\",INDEX(Entertainment!$B$2:$B$1000,C2))","v":"заблуждение"},{"$f":"IF(D2=0,\"\",INDEX(Entertainment!$B$2:$B$1000,D2))","v":"король"},{"$f":"IF(E2=0,\"\",INDEX(Entertainment!$B$2:$B$1000,E2))","v":"голубой"}]
[2,2,19,4,12,1,null,{"$f":"IF(A3=0,\"\",INDEX(Entertainment!$A$2:$A$1000,A3))","v":"font"},{"$f":"IF(B3=0,\"\",INDEX(Entertainment!$B$2:$B$1000,B3))","v":"шрифт, источник"},{"$f":"IF(C3=0,\"\",INDEX(Entertainment!$B$2:$B$1000,C3))","v":"молоко"},{"$f":"IF(D3=0,\"\",INDEX(Entertainment!$B$2:$B$1000,D3))","v":"разносчик"},{"$f":"IF(E3=0,\"\",INDEX(Entertainment!$B$2:$B$1000,E3))","v":"парень"}]
[19,4,15,19,14,3,null,{"$f":"IF(A4=0,\"\",INDEX(Entertainment!$A$2:$A$1000,A4))","v":"milk"},{"$f":"IF(B4=0,\"\",INDEX(Entertainment!$B$2:$B$1000,B4))","v":"разносчик"},{"$f":"IF(C4=0,\"\",INDEX(Entertainment!$B$2:$B$1000,C4))","v":"розовый"},{"$f":"IF(D4=0,\"\",INDEX(Entertainment!$B$2:$B$1000,D4))","v":"молоко"},{"$f":"IF(E4=0,\"\",INDEX(Entertainment!$B$2:$B$1000,E4))","v":"королева"}]
[8,19,8,10,15,2,null,{"$f":"IF(A5=0,\"\",INDEX(Entertainment!$A$2:$A$1000,A5))","v":"whereabout"},{"$f":"IF(B5=0,\"\",INDEX(Entertainment!$B$2:$B$1000,B5))","v":"молоко"},{"$f":"IF(C5=0,\"\",INDEX(Entertainment!$B$2:$B$1000,C5))","v":"местонахождения"},{"$f":"IF(D5=0,\"\",INDEX(Entertainment!$B$2:$B$1000,D5))","v":"мать"},{"$f":"IF(E5=0,\"\",INDEX(Entertainment!$B$2:$B$1000,E5))","v":"розовый"}]
[18,8,18,15,6,2,null,{"$f":"IF(A6=0,\"\",INDEX(Entertainment!$A$2:$A$1000,A6))","v":"green"},{"$f":"IF(B6=0,\"\",INDEX(Entertainment!$B$2:$B$1000,B6))","v":"местонахождения"},{"$f":"IF(C6=0,\"\",INDEX(Entertainment!$B$2:$B$1000,C6))","v":"зеленый"},{"$f":"IF(D6=0,\"\",INDEX(Entertainment!$B$2:$B$1000,D6))","v":"розовый"},{"$f":"IF(E6=0,\"\",INDEX(Entertainment!$B$2:$B$1000,E6))","v":"подлец, ябеда, трус"}]
[11,3,15,11,18,3,null,{"$f":"IF(A7=0,\"\",INDEX(Entertainment!$A$2:$A$1000,A7))","v":"girl"},{"$f":"IF(B7=0,\"\",INDEX(Entertainment!$B$2:$B$1000,B7))","v":"никчемный человек"},{"$f":"IF(C7=0,\"\",INDEX(Entertainment!$B$2:$B$1000,C7))","v":"розовый"},{"$f":"IF(D7=0,\"\",INDEX(Entertainment!$B$2:$B$1000,D7))","v":"девушка"},{"$f":"IF(E7=0,\"\",INDEX(Entertainment!$B$2:$B$1000,E7))","v":"зеленый"}]
[20,14,1,12,20,4,null,{"$f":"IF(A8=0,\"\",INDEX(Entertainment!$A$2:$A$1000,A8))","v":"gin"},{"$f":"IF(B8=0,\"\",INDEX(Entertainment!$B$2:$B$1000,B8))","v":"королева"},{"$f":"IF(C8=0,\"\",INDEX(Entertainment!$B$2:$B$1000,C8))","v":"заблуждение"},{"$f":"IF(D8=0,\"\",INDEX(Entertainment!$B$2:$B$1000,D8))","v":"парень"},{"$f":"IF(E8=0,\"\",INDEX(Entertainment!$B$2:$B$1000,E8))","v":"джин"}]
[16,20,16,11,1,2,null,{"$f":"IF(A9=0,\"\",INDEX(Entertainment!$A$2:$A$1000,A9))","v":"blue"},{"$f":"IF(B9=0,\"\",INDEX(Entertainment!$B$2:$B$1000,B9))","v":"джин"},{"$f":"IF(C9=0,\"\",INDEX(Entertainment!$B$2:$B$1000,C9))","v":"голубой"},{"$f":"IF(D9=0,\"\",INDEX(Entertainment!$B$2:$B$1000,D9))","v":"девушка"},{"$f":"IF(E9=0,\"\",INDEX(Entertainment!$B$2:$B$1000,E9))","v":"заблуждение"}]
[7,7,3,11,15,1,null,{"$f":"IF(A10=0,\"\",INDEX(Entertainment!$A$2:$A$1000,A10))","v":"stench"},{"$f":"IF(B10=0,\"\",INDEX(Entertainment!$B$2:$B$1000,B10))","v":"вонь"},{"$f":"IF(C10=0,\"\",INDEX(Entertainment!$B$2:$B$1000,C10))","v":"никчемный человек"},{"$f":"IF(D10=0,\"\",INDEX(Entertainment!$B$2:$B$1000,D10))","v":"девушка"},{"$f":"IF(E10=0,\"\",INDEX(Entertainment!$B$2:$B$1000,E10))","v":"розовый"}]
[14,14,15,18,20,1,null,{"$f":"IF(A11=0,\"\",INDEX(Entertainment!$A$2:$A$1000,A11))","v":"queen"},{"$f":"IF(B11=0,\"\",INDEX(Entertainment!$B$2:$B$1000,B11))","v":"королева"},{"$f":"IF(C11=0,\"\",INDEX(Entertainment!$B$2:$B$1000,C11))","v":"розовый"},{"$f":"IF(D11=0,\"\",INDEX(Entertainment!$B$2:$B$1000,D11))","v":"зеленый"},{"$f":"IF(E11=0,\"\",INDEX(Entertainment!$B$2:$B$1000,E11))","v":"джин"}]