{"text_format":"1","workbook":"xlsx","n_sheets":4,"sheets":["июнь","Перемещения","Лист1","Лист2"],"not_rendered":{"charts":0,"images":1,"macros":1,"external_links":0,"defined_names":6,"comments":0,"pivot_tables":0},"unopened":[],"bounds":{"document_bytes":16777216,"sheet_cells":100000,"rows_first":2000,"rows_last":500,"rows_between":2000,"halvings":0,"cell_chars":16384,"cell_head_chars":4096},"cells_cut":0,"cells_raw":0,"read":"whole","date_system":"1900"}

{"sheet":"июнь","index":0,"n_rows":199,"n_cols":53,"rows_kept":199,"cut":false,"hidden":false,"merged":[]}
[null,null,null,null,"материал","ОСТАТОК НА 01 мая","План Май","План Июнь","Запуск1 Июнь","Запуск2 Июнь","Дефицит МАЙ","Дефицит Июнь","заготовительный","заготовительный","заготовительный","механический","механический","механический","механический","механический","механический","механический","механический","механический","механический","механический","сварочный","сборочный","сборочный","сборочный","2015-05-01",{"$f":"WORKDAY.INTL(AE1,1,1,Лист1!$A$6:$B$21)","v":"2015-05-04"},{"$f":"WORKDAY.INTL(AF1,1,1,Лист1!$A$6:$B$21)","v":"2015-05-05"},{"$f":"WORKDAY.INTL(AG1,1,1,Лист1!$A$6:$B$21)","v":"2015-05-06"},{"$f":"WORKDAY.INTL(AH1,1,1,Лист1!$A$6:$B$21)","v":"2015-05-07"},{"$f":"WORKDAY.INTL(AI1,1,1,Лист1!$A$6:$B$21)","v":"2015-05-08"},{"$f":"WORKDAY.INTL(AJ1,1,1,Лист1!$A$6:$B$21)","v":"2015-05-11"},{"$f":"WORKDAY.INTL(AK1,1,1,Лист1!$A$6:$B$21)","v":"2015-05-12"},{"$f":"WORKDAY.INTL(AL1,1,1,Лист1!$A$6:$B$21)","v":"2015-05-13"},{"$f":"WORKDAY.INTL(AM1,1,1,Лист1!$A$6:$B$21)","v":"2015-05-14"},{"$f":"WORKDAY.INTL(AN1,1,1,Лист1!$A$6:$B$21)","v":"2015-05-15"},{"$f":"WORKDAY.INTL(AO1,1,1,Лист1!$A$6:$B$21)","v":"2015-05-18"},{"$f":"WORKDAY.INTL(AP1,1,1,Лист1!$A$6:$B$21)","v":"2015-05-19"},{"$f":"WORKDAY.INTL(AQ1,1,1,Лист1!$A$6:$B$21)","v":"2015-05-20"},{"$f":"WORKDAY.INTL(AR1,1,1,Лист1!$A$6:$B$21)","v":"2015-05-21"},{"$f":"WORKDAY.INTL(AS1,1,1,Лист1!$A$6:$B$21)","v":"2015-05-22"},{"$f":"WORKDAY.INTL(AT1,1,1,Лист1!$A$6:$B$21)","v":"2015-05-25"},{"$f":"WORKDAY.INTL(AU1,1,1,Лист1!$A$6:$B$21)","v":"2015-05-26"},{"$f":"WORKDAY.INTL(AV1,1,1,Лист1!$A$6:$B$21)","v":"2015-05-27"},{"$f":"WORKDAY.INTL(AW1,1,1,Лист1!$A$6:$B$21)","v":"2015-05-28"},{"$f":"WORKDAY.INTL(AX1,1,1,Лист1!$A$6:$B$21)","v":"2015-05-29"},{"$f":"WORKDAY.INTL(AY1,1,1,Лист1!$A$6:$B$21)","v":"2015-06-01"},{"$f":"WORKDAY.INTL(AZ1,1,1,Лист1!$A$6:$B$21)","v":"2015-06-02"}]
[null,null,null,"заготовительный",null,null,null,null,{"$f":"INDEX(Лист1!$B$2:$F$3,MATCH(июнь!I$1,Лист1!$A$2:$A$3,0),MATCH(июнь!$D$2,Лист1!$B$1:$F$1,0))","v":"2016-04-12T18:00:00"},{"$f":"INDEX(Лист1!$B$2:$F$3,MATCH(июнь!J$1,Лист1!$A$2:$A$3,0),MATCH(июнь!$D$2,Лист1!$B$1:$F$1,0))","v":"2016-04-19T18:00:00"},null,null,"лен.пил.","лазер","переход на механику","т/цтр","фрз","слс","ф/цтр","тер","ток","отк","гальв.","ток.pr","переход на сварку","переход на сборку","сварочный","склейка","электромонтаж","сборочный",{"$f":"TEXT(AE$1,\"Д/М/ГГГГ\")","v":"1/5/2015"},{"$f":"TEXT(AF$1,\"Д/М/ГГГГ\")","v":"4/5/2015"},"5/5/2015","6/5/2015","7/5/2015","8/5/2015","11/5/2015","12/5/2015","13/5/2015","14/5/2015","15/5/2015","18/5/2015","19/5/2015","20/5/2015","21/5/2015","22/5/2015","25/5/2015","26/5/2015","27/5/2015","28/5/2015","29/5/2015","1/6/2015","2/6/2015"]
[null,"сбр.",100,"Балка","Сборка",null,31,1,1,0,{"$f":"(F3+SUM($O3:$BA3))-G3","v":-31},{"$f":"K3-H3","v":-32}]
[null,"сбр.","4445.09.06.083","Балка","Сборка",null,31,1,1,0,{"$f":"(F4+SUM($O4:$BA4))-G4","v":-31},{"$f":"K4-H4","v":-32}]
[null,"сбр.","4445.09.05.270","Стойка каркаса лев","Сборка",null,31,2,2,0,-31,-33,null,null,0]
[null,"сбр.","4445.09.06.100","стойка каркаса прав","Сборка",null,31,2,2,0,-31,-33,null,null,0]
[null,"сбр.","4445.09.05.271","Балка","Сборка",null,63,4,4,0,-63,-67,null,null,0]
[null,"сбр.","4445.09.05.272","Балка","Сборка",null,0,1,1,0,0,-1,null,null,0]
[null,"сбр.","4445.09.05.273","Балка","Сборка",null,0,1,1,0,0,-1,null,null,0]
[null,"сбр.","4445.09.05.274","Балка","Сборка",null,0,0,0,0,0,0,0,null,0]
[null,"сбр.","4445.09.05.275","Платик","Сборка",null,0,0,0,0,0,0,0,null,0]
[null,"сбр.","4445.09.05.278","Платик","Сборка",null,0,0,0,0,0,0,0,null,0]
[null,"сбр.","4445.09.05.279","Платик","Сборка",null,0,0,0,0,0,0,0,null,0]
[null,"сбр.","4445.09.05.286","Платик","Сборка",null,0,0,0,0,0,0,0,null,0]
[null,"сбр.","ФКГП 385 73 00 015","Лист RAL 3020","Сборка",null,0,0,0,0,0,0,0,null,0]
[null,"сбр.","ФКГП 385 01 00 015","Лист RAL 3020","Сборка",null,1,1,1,0,-1,-2,0,null,0]
[null,"сбр.","ФКГП 385 01 00 016","Лист RAL 9018","Сборка",null,1,1,1,0,-1,-2,0,null,0]
[null,"сбр.","ФКГП 385 02 00 015","Лист RAL 3020","Сборка",null,25,26,14,12,-25,-51,0,null,0]
[null,"сбр.","ФКГП 385 02 00 016","Лист RAL 9018","Сборка",null,0,0,0,0,0,0,0,null,0]
[null,"сбр.","ФКГП 385 03 00 015","Лист RAL 3020","Сборка",null,0,0,0,0,0,0,0,null,0]
[null,"сбр.","ФКГП 385 03 00 016","Лист RAL 9018","Сборка",null,0,0,0,0,0,0,0,null,0]
[null,"сбр.","ФКГП 385 04 00 015","Лист RAL 3020","Сборка",null,0,0,0,0,0,0,0,null,0]
[null,"30сб","ФКГП 385 04 00 016","Лист RAL 9018","Сборка",null,32,2,2,0,-32,-34,0,null,0]
[null,"30сб","ФКГП 385 06 00 015","Лист RAL 3020","Сборка",null,32,2,2,0,-32,-34,0,null,0]
[null,"30сб","ФКГП 385 07 00 015","Лист RAL 3020","Сборка",null,31,2,2,0,-31,-33,0,null,0]
[null,"30сб","ФКГП 385 08 00 015","Лист RAL 3020","Сборка",null,31,2,2,0,-31,-33]
[null,"30сб","ФКГП 385 01 00 301","Пластина","Сборка",null,0,1,1,0,0,-1]
[null,"30сб","ФКГП 385 13 00 301","Пластина","Сборка",null,0,1,1,0,0,-1,0,null,0]
[null,"30сб","ФКГП 385 13 00 302","Пластина","Сборка",null,0,0,0,0,0,0,0,null,0]
[null,"30сб","ФКГП 385 13 00 303","Пластина","Сборка",null,0,0,0,0,0,0,0,null,0]
[null,"30сб","ФКГП 385 13 00 304","Пластина","Сборка",null,0,0,0,0,0,0,0,null,0]
[null,"30сб","ФКГП 385 13 00 305","Пластина","Сборка",null,0,0,0,0,0,0,0,null,0]
[null,61,"ФКГП 385 13 00 306","Пластина","ISI =1,0",null,32,3,3,0,-32,-35,0,null,0]
[null,10,"ФКГП 385 24 00 303","Пластина","Д16 Ф75",null,64,6,6,0,-64,-70,0,null,0]
[null,"30сб","ФКГП 385 33 00 303","Пластина","ПРД-129он ",null,31,1,1,0,-31,-32,0,null,0]
[null,"30сб","ФКГП 385 54 00 303","Пластина","ПРД-129он",null,31,1,1,0,-31,-32,0,null,0]
[null,"30сб","ФКГП 385 54 00 304","Пластина",null,null,0,0,0,0,0,0,0,null,0]
[null,"30сб","ФКГП624.10.00.200","Створка дверная боковая  ",null,null,0,0,0,0,0,0,0,null,0]
[null,61,"KMT_484.00.000","Стяжка  ","ISI =1,0",null,126,10,10,0,-126,-136,600]
[null,"30сб","ФКГП624.10.00.100","Коробка  ","ПРД-130он",null,126,8,8,0,-126,-134]
[null,"30сб","ФКГП624.10.00.210","Стеклопакет  ","ПРД-104.5",null,126,8,8,0,-126,-134,0]
[null,6110,"Болт","Болт M6-6gx20.56.019 ГОСТ 7798-70 ","Cт.3=4,0",null,252,20,20,0,-2,-22,250,null,0,250]
[null,10,"Винт","Винт A.M4-6gx12.46.019 ГОСТ17475-80 ","ПА6 Ф30 ",null,252,20,20,0,-252,-272,0]
[null,10,"Винт","Винт A.M6-6gx25.46.019 ГОСТ17474-80 ","Ст40Х Ф23",null,252,20,20,0,-252,-272,0]
[null,10,"Заклепка","Заклепка тяговая AL 2.4x8, стержень-сталь \"Bralo\" Испания-Чехия","Кр.40Х Ф14",null,252,20,20,0,-252,-272,0]
[null,61,"Хомут","Хомут 3.5x150 фирма \"ИЭК\" г. Москва ","ISI =1,0",null,32,3,3,0,168,165,200,null,200]
[null,61,"ФКГП268-11-00-201","Личинка","ISI =1,0",null,32,3,3,0,268,265,300,null,300]
[null,61,"ФКГП268-11-00-202","Личинка","ISI =1,0",null,126,10,10,0,-126,-136,0,null,0]
[null,61,"4179.01.21.102","Планка  ","ISI =1,0",null,32,3,3,0,1,-2,33,null,33]
[null,61,"4179.01.21.104","Штребель  ","08пс=2,0",null,64,4,4,0,-64,-68,0,null,0]
[null,6110,"4179.01.21.105","Клин  ","Ст 8ю=0,8",null,254,22,22,0,226,204,480,null,480]
[null,61,"4179.01.21.110","Стойка  ","08пс=2,0 ",null,64,4,4,0,26,22,90,null,90]
[null,61,"4179.01.21.120","Стойка  ","08пс=2,0",null,64,4,4,0,26,22,90,null,90]
[null,61,"ФКГП624.10.00.101","Перекладина  ","08пс=2,0 ",null,64,4,4,0,26,22,90,null,90]
[null,61,"Болт","Болт M8-6gx20.56.019 ГОСТ 7798-70 ","08пс=2,0 ",null,0,0,0,0,0,0,0,null,0]
[null,61,"Винт","Винт A.M5-6gx10.46.019 ГОСТ17475-80 ","08пс=2,0 ",null,0,0,0,0,0,0,0,null,0]
[null,61,"Шайба","Шайба 8 65Г 019 ГОСТ 6402-70 ","08пс=2,0 ",null,0,0,0,0,0,0,0,null,0]
[null,30,"4179.01.21.121","Стойка   ","Сборка",null,32,2,2,0,-32,-34,0,null,0]
[null,30,"4179.01.21.122","Скоба  ","Сборка",null,32,2,2,0,-32,-34,0,null,0]
[null,30,"4179.01.21.123","Скоба  ","Сборка",null,31,2,2,0,-31,-33,0,null,0]
[null,30,"4179.01.21.124","Ребро  ","Сборка",null,31,2,2,0,-31,-33,0,null,0]
[null,"30сб",null,"изделие 60","Сборка",null,0,1,1,0,0,-1,0,null,0]
[null,"30сб",null,"изделие 61","Сборка",null,0,1,1,0,0,-1,0,null,0]
[null,"30сб",null,"изделие 62","Сборка",null,0,0,0,0,0,0,0,null,0]
[null,"30сб",null,"изделие 63","Сборка",null,0,0,0,0,0,0,0,null,0]
[null,"30сб",null,"изделие 64","Сборка",null,0,0,0,0,0,0,0,null,0]
[null,"30сб",null,"изделие 65","Сборка",null,0,0,0,0,0,0,0,null,0]
[null,400,null,"изделие 66","Пен S=50",null,126,10,10,0,{"$f":"(F68+SUM($O68:$BA68))-G68","v":-126},{"$f":"K68-H68","v":-136},0,null,0]
[null,400,null,"изделие 67","Пен S=50",null,126,10,10,0,-126,-136,0,null,0]
[null,400,null,"изделие 68","Пен S=50",null,126,10,10,0,-126,-136,0,null,0]
[null,400,null,"изделие 69","Пен S=50",null,126,10,10,0,-126,-136,0,null,0]
[null,61,"ФКГП624.10.00.308","Обшивка  ","Амг3М=1,5",null,63,5,5,0,-19,-24,44,null,22,null,null,null,null,null,null,null,null,null,null,null,null,null,null,null,null,null,null,null,22]
[null,61,"ФКГП624.10.00.310","Каркас  ","Амг3М=1,5",null,63,5,5,0,-17,-22,46,null,46]
[null,400,"ФКГП624.10.00.330","Сотовая панель  ","Пен S=50",null,126,10,10,0,-126,-136,0,null,0]
[null,400,"ФКГП624.10.00.340","Сотовая панель   ","Пен S=50",null,0,0,0,0,0,0,0,null,0]
[null,400,"Заклепка","Заклепка тяговая AL 3.2x8 Zn, стержень-сталь \"Bralo\" Испания-Чехия","Пен S=50",null,0,0,0,0,0,0,0,null,0]
[null,400,"Заклепка","Заклепка тяговая AL потай 3.2x8 Zn, стержень-сталь \"Bralo\" Испания-Чехия","Пен S=50",null,0,0,0,0,0,0,0,null,0]
[null,400,"Хомут","Хомут 3.2x100 фирма \"ИЭК\" г. Москва ","Пен S=50",null,0,0,0,0,0,0,0,null,0]
[null,61,"4179.01.21.316","Пластина  ","Амг3М=1,5",null,0,0,0,0,0,0,0]
[null,61,"4179.01.21.317","Пластина  ","Амг3М=1,5",null,0,0,0,0,0,0,0,null,0]
[null,61,"4179.01.21.318","Пластина  ","Амг3М=1,5",null,0,0,0,0,0,0,0,null,0]
[null,61,"4179.01.21.320","Стойка  ","Амг3М=1,5",null,0,0,0,0,0,0,0,null,0]
[null,400,"ФКГП624.10.00.350","Перекладина  ","Пен S=50",null,0,0,0,0,0,0,0,null,0]
[80,80,null,"изделие 82","Сборка",null,32,2,2,0,-32,-34,0,null,0]
[80,80,null,"изделие 83","Сборка",null,32,2,2,0,-32,-34,0,null,0]
[80,80,null,"изделие 84","Сборка",null,31,3,3,0,-31,-34,0,null,0]
[80,80,null,"изделие 85","Сборка",null,31,3,3,0,-31,-34,0,null,0]
[80,80,"ФКГП 394.11.01.000","Корпус(Балка)(RAL 9005)","Сборка",null,0,0,0,0,0,0,0,null,0]
[80,80,"ФКГП 394.11.01.001","Короб","Сборка",null,0,0,0,0,0,0,0,null,0]
[80,80,"ФКГП 394.11.01.002","Щека","Сборка",null,0,0,0,0,0,0,0,null,0]
[80,80,"ФКГП 394.11.01.005","Платик","Сборка",null,0,0,0,0,0,0,0,null,0]
[8010,30,"ФКГП 394.11.01.006","Платик ","ПА-11 ",null,63,5,5,0,-63,-68,0,null,0]
[8010,30,"ФКГП 394.11.01.007","Пластина (Ребро)","ПА-11",null,63,5,5,0,-63,-68,0,null,0]
[8010,30,"ФКГП 394.11.01.008","Втулка   ","ПА-11",null,126,10,10,0,-126,-136,0,null,0]
[8010,30,"ФКГП 394.11.01.009","Втулка   (1шт)","ПА-11 ",null,0,0,0,0,0,0,0,null,0]
[8010,30,"ФКГП 394.11.01.010","Плита ","ПА-11 ",null,0,0,0,0,0,0,0,null,0]
[8010,30,"ФКГП 394.11.01.011","Платик","ПА-11 ",null,0,0,0,0,0,0,0,null,0]
[8010,"30сб","ФКГП 394.11.01.012","Платик","Сборка",null,0,0,0,0,0,0,0,null,0]
[8061,6110,"ФКГП 394.11.01.013","Платик","Д16Т=10,0",null,0,0,0,0,0,0,0,null,0]
[8010,30,"ФКГП 394.11.01.014","Козырек","ПА-11 L=935",null,0,0,0,0,0,0,0,null,0]
[8010,30,"ФКГП 394.11.02.000","Каретка левая(RAL 9005)"," Тр50х30х2",null,378,30,30,0,-378,-408,0,null,0]
[8010,30,"ФКГП 394.11.03.000","Каретка правая(RAL 9005)"," Тр50х30х2",null,126,10,10,0,-126,-136,0,null,0]
[8010,30,"ФКГП 394.11.02.001","Корпус"," Тр50х30х2",null,126,10,10,0,-126,-136,0,null,0]
[8010,61,"ФКГП 394.11.03.001","Корпус","Амг2=3,0",null,126,10,10,0,0,-10,126,null,126]
[8061,30,"ФКГП 394.11.02.002","Плечо"," Тр50х30х2",null,0,0,0,0,0,0,0,null,0]
[8061,30,"ФКГП 394.11.02.003","Ребро"," Тр50х30х2",null,0,0,0,0,0,0,0,null,0]
[8061,61,10000000105,"изделие 105","Амг2-3",null,0,0,0,0,0,0,0,null,0]
[88,80,10000000106,"изделие 106","Сборка",null,63,5,5,0,-63,-68,0,null,0]
[88,80,10000000107,"изделие 107","Сборка",null,63,5,5,0,-63,-68,0,null,0]
[88,80,10000000108,"изделие 108","Сборка",null,0,0,0,0,0,0,0,null,0]
[88,80,10000000109,"изделие 109","Сборка",null,0,0,0,0,0,0,0,null,0]
[8810,400,10000000110,"изделие 110","Ст.20 Ф20",null,378,30,30,0,-378,-408,0,null,0]
[8860,61,10000000111,"изделие 111","СТ 20 = 6,0",null,126,10,10,0,354,344,480,null,480]
[8860,61,10000000112,"изделие 112","СТ 20 = 6,0",null,0,0,0,0,0,0,0,null,0]
[8860,61,10000000113,"изделие 113","08ПС=1,5",null,252,20,20,0,248,228,500,null,500]
[88,80,10000000114,"изделие 114","Сборка",null,378,30,30,0,-378,-408,0,null,0]
[8860,61,10000000115,"изделие 115","СТ 20 = 6,0",null,252,20,20,0,748,728,1000,null,1000]
[88400,400,10000000116,"изделие 116","Ст.3d",null,126,10,10,0,-126,-136,0,null,0]
[88,80,10000000117,"изделие 117","Сборка",null,126,10,10,0,-126,-136,0,null,0]
[8860,61,10000000118,"изделие 118","08ПС=3,0",null,126,10,10,0,24,14,150,null,150]
[88,400,10000000119,"изделие 119","Ст.20 Ф14",null,882,70,70,0,-519,-589,363,null,363]
[88,80,10000000120,"изделие 120","Сборка",null,0,0,0,0,0,0,0,null,0]
[8860,61,10000000121,"изделие 121","08ПС=3,0",null,0,0,0,0,0,0,0,null,0]
[8810,"30сб",10000000122,"изделие 122","Сборка",null,63,5,5,0,-63,-68,0,null,0]
[8810,"30сб",10000000123,"изделие 123","Сборка",null,63,5,5,0,-63,-68,0,null,0]
[8810,"30сб",10000000124,"изделие 124","Сборка",null,0,0,0,0,0,0,0,null,0]
[8810,"30сб",10000000125,"изделие 125","Сборка",null,0,0,0,0,0,0,0,null,0]
[8810,"30сб",10000000126,"изделие 126","Сборка",null,0,0,0,0,0,0,0,null,0]
[8810,"30сб",10000000127,"изделие 127","Сборка",null,0,0,0,0,0,0,0,null,0]
[8810,30,10000000128,"изделие 128","ПА-11 L=2200",null,63,5,5,0,-63,-68,0,null,0]
[8810,30,10000000129,"изделие 129","ПА-11 L=2200",null,63,5,5,0,-63,-68,0,null,0]
[8810,30,10000000130,"изделие 130","ПА-11 L=2200",null,0,0,0,0,{"$f":"(F132+SUM($O132:$BA132))-G132","v":0},{"$f":"K132-H132","v":0},0,null,0]
[8810,30,10000000131,"изделие 131","ПА-11 L=2200",null,0,0,0,0,0,0,0,null,0]
[8810,10,10000000132,"изделие 132","АМг6 Ф25",null,252,20,20,0,105,85,357,null,357]
[8810,10,10000000133,"изделие 133","АМг6 Ф30",null,252,20,20,0,-252,-272,0,null,0]
[8810,30,10000000134,"изделие 134","Тр 50х30х2",null,252,20,20,0,-252,-272,0,null,0]
[8810,20,10000000135,"изделие 135","Сборка",null,126,10,10,0,-126,-136,0,null,0]
[88400,400,10000000136,"изделие 136","Ст.10 Ф10",null,252,20,20,0,-252,-272,0,null,0]
[88400,400,10000000137,"изделие 137","Ст.10 Ф8",null,252,20,20,0,-252,-272,0,null,0]
[8810,61,10000000138,"изделие 138","08пс=2,0",null,126,10,10,0,124,114,250,null,250]
[8810,"30сб",10000000139,"изделие 139","Сборка",null,31,3,3,0,-31,-34,0,null,0]
[8810,"30сб",10000000140,"изделие 140","Сборка",null,31,3,3,0,-31,-34,0,null,0]
[8810,30,10000000141,"изделие 141","ПА-11 L=2200",null,31,3,3,0,-31,-34,0,null,0]
[8810,30,10000000142,"изделие 142","ПА-11 L=2200",null,31,3,3,0,-31,-34,0,null,0]
[88400,400,10000000143,"изделие 143","Ст.20 Ф6,0",null,504,40,40,0,-504,-544,0,null,0]
[8810,6110,10000000144,"изделие 144","СТ 20 = 6,0",null,252,20,20,0,348,328,600,null,600]
[8810,61,10000000145,"изделие 145","08ПС=1,5",null,252,20,20,0,248,228,500,null,500]
[8810,20,10000000146,"изделие 146","Сборка",null,252,20,20,0,-252,-272,0,null,0]
[8810,61,10000000147,"изделие 147","08пс=2,0",null,126,10,10,0,174,164,300,null,300]
[88400,400,10000000148,"изделие 148","Ст.10 Ф12",null,378,30,30,0,-378,-408,0,null,0]
[8810,"30сб",10000000149,"изделие 149","Сборка",null,32,2,2,0,-32,-34,0,null,0]
[8810,"30сб",10000000150,"изделие 150","Сборка",null,32,2,2,0,-32,-34,0,null,0]
[8810,"30сб",10000000151,"изделие 151","Сборка",null,0,0,0,0,0,0,0,null,0]
[8810,"30сб",10000000152,"изделие 152","Сборка",null,0,0,0,0,0,0,0,null,0]
[8810,30,10000000153,"изделие 153","ПА-11 L=2200",null,32,2,2,0,-32,-34,0,null,0]
[8810,30,10000000154,"изделие 154","ПА-11 L=2200",null,32,2,2,0,-32,-34,0,null,0]
[8810,30,10000000155,"изделие 155","ПА-11 L=2200",null,0,0,0,0,0,0,0,null,0]
[8810,30,10000000156,"изделие 156","ПА-11 L=2200",null,0,0,0,0,0,0,0,null,0]
[null,"30сб",10000000157,"изделие 157","Сборка",null,32,3,3,0,-32,-35,0,null,0]
[null,"30сб",10000000158,"изделие 158","Сборка",null,32,3,3,0,-32,-35,0,null,0]
[null,"30сб",10000000159,"изделие 159","Сборка",null,62,4,4,0,-62,-66,0,null,0]
[null,"30сб",10000000160,"изделие 160","Сборка",null,0,0,0,0,0,0,0,null,0]
[null,"30сб",10000000161,"изделие 161","Сборка",null,0,0,0,0,0,0,0,null,0]
[null,"30сб",10000000162,"изделие 162","Сборка",null,0,0,0,0,0,0,0,null,0]
[null,"30сб",10000000163,"изделие 163","Сборка",null,0,0,0,0,0,0,0,null,0]
[null,61,10000000164,"изделие 164","АМг3=1,5",null,32,3,3,0,-16,-19,16,null,16]
[null,61,10000000165,"изделие 165","АМг3=1,5",null,32,3,3,0,-16,-19,16,null,16]
[null,61,10000000166,"изделие 166","АМг3=1,5",null,62,4,4,0,-24,-28,38,null,38]
[null,61,10000000167,"изделие 167","АМг3=1,5",null,0,0,0,0,0,0,0,null,0]
[null,61,10000000168,"изделие 168","АМг3=1,5",null,0,0,0,0,0,0,0,null,0]
[null,61,10000000169,"изделие 169","АМг3=1,5",null,0,0,0,0,0,0,0,null,0]
[null,61,10000000170,"изделие 170","АМг3=1,5",null,0,0,0,0,0,0,0,null,0]
[null,10,null,"изделие 171","АМг6 Ф20",null,126,10,10,0,63,53,189,null,189]
[null,6130,null,"изделие 172","АМг2М=2,0",null,126,10,10,0,-6,-16,120,null,120]
[null,6130,null,"изделие 173","АМг2М=2,0",null,126,10,10,0,-6,-16,120,null,120]
[null,61,null,"изделие 174","АМг2М=2,0",null,252,20,20,0,-12,-32,240,null,240]
[null,"30сб",10000000175,"изделие 175","Сборка",null,32,3,3,0,-32,-35,0,null,0]
[null,"30сб",10000000176,"изделие 176","Сборка",null,32,3,3,0,-32,-35,0,null,0]
[null,"30сб",10000000177,"изделие 177","Сборка",null,31,2,2,0,-31,-33,0,null,0]
[null,"30сб",10000000178,"изделие 178","Сборка",null,31,2,2,0,-31,-33,0,null,0]
[null,"30сб",10000000179,"изделие 179","Сборка",null,0,0,0,0,0,0,0,null,0]
[null,"30сб",10000000180,"изделие 180","Сборка",null,0,0,0,0,0,0,0,null,0]
[null,"30сб",10000000181,"изделие 181","Сборка",null,0,0,0,0,0,0,0,null,0]
[null,"30сб",null,"изделие 182","Сборка",null,0,0,0,0,0,0,0,null,0]
[null,61,null,"изделие 183","Д16Т=1,5",null,126,10,10,0,-46,-56,80,null,80]
[null,61,10000000184,"изделие 184","Д16Т=1,5",null,64,6,6,0,-24,-30,40,null,40]
[null,61,10000000185,"изделие 185","АМг2=2,5",null,64,6,6,0,36,30,100,null,100]
[null,"30сб",10000000186,"изделие 186","Пласт пр 1-6",null,128,12,12,0,-128,-140,0,null,0]
[null,61,10000000187,"изделие 187","Д16Т=1,5",null,62,4,4,0,-22,-26,40,null,40]
[null,61,10000000188,"изделие 188","Д16Т=1,5",null,0,0,0,0,0,0,0,null,0]
[null,61,10000000189,"изделие 189","Д16Т=1,5",null,0,0,0,0,0,0,0,null,0]
[null,61,10000000190,"изделие 190","Д16Т=1,5",null,0,0,0,0,0,0,0,null,0]
[null,61,null,"изделие 191","Д16Т=1,5",null,0,0,0,0,0,0,0,null,0]
[80,80,null,"изделие 192","Сборка",null,63,5,5,0,-63,-68,0,null,0]
[80,80,10000000193,"изделие 193","Сборка",null,63,5,5,0,-63,-68,0,null,0]
[80,80,10000000194,"изделие 194","Сборка",null,0,0,0,0,{"$f":"(F196+SUM($O196:$BA196))-G196","v":0},{"$f":"K196-H196","v":0},0,null,0]
[80,80,10000000195,"изделие 195","Сборка",null,0,0,0,0,0,0,0,null,0]
[8061,61,10000000196,"изделие 196","12Х18Н10Т=3,0",null,63,5,5,0,97,92,160,null,160]
[8061,61,10000000197,"изделие 197","12Х18Н10Т=3,0",null,63,5,5,0,97,92,160,null,160]

{"sheet":"Перемещения","index":1,"n_rows":4,"n_cols":6,"rows_kept":4,"cut":false,"hidden":true,"merged":[]}
["Когда","Что","откуда","куда ","сколько","основание"]
["2016-04-29T09:40:53","ФКГП 255.11.00.007","переход на механику","т/цтр",250]
["2016-04-29T08:35:53","ФКГП 255.10.00.000","переход на сварку","склейка",15]
["2016-04-29T08:35:14","ФКГП 255.10.00.000","переход на сборку","сборочный",10]

{"sheet":"Лист1","index":2,"n_rows":21,"n_cols":8,"rows_kept":21,"cut":false,"hidden":true,"merged":[]}
[null,"заготовительный","механический","сварочный","Окраска","сборочный","заготовительный","заготовительный;механический;сварочный;сборочный"]
[{"$f":"июнь!I1","v":"Запуск1 Июнь"},"2016-04-12T18:00:00","2016-04-19T18:00:00","2016-04-20T18:00:00","2016-04-25T18:00:00","2016-04-15","механический"]
[{"$f":"июнь!J1","v":"Запуск2 Июнь"},"2016-04-19T18:00:00","2016-04-22T18:00:00","2016-04-22T18:00:00","2016-04-22","2016-04-22","сварочный"]
[null,null,null,null,null,null,"сборочный"]
[]
["2016-01-01","2016-03-06"]
["2016-01-02","2016-03-07"]
["2016-01-03","2016-03-08"]
["2016-01-04","2016-04-30"]
["2016-01-05","2016-05-01"]
["2016-01-06","2016-05-02"]
[null,"2016-05-03"]
["2016-01-07","2016-05-07"]
["2016-01-08","2016-05-08"]
["2016-01-09","2016-05-09"]
["2016-01-10","2016-06-11"]
["2016-02-20","2016-06-12"]
["2016-02-21","2016-06-13"]
["2016-02-22","2016-11-04"]
["2016-02-23","2016-11-05"]
["2016-12-31","2016-11-06"]

{"sheet":"Лист2","index":3,"n_rows":0,"n_cols":0,"rows_kept":0,"cut":false,"hidden":true,"merged":[]}