{"text_format":"1","workbook":"xlsx","n_sheets":3,"sheets":["Лист1","Лист2","Лист3"],"not_rendered":{"charts":0,"images":0,"macros":1,"external_links":0,"defined_names":0,"comments":0,"pivot_tables":0},"unopened":[],"bounds":{"document_bytes":16777216,"sheet_cells":100000,"rows_first":2000,"rows_last":500,"rows_between":2000,"halvings":0,"cell_chars":16384,"cell_head_chars":4096},"cells_cut":0,"cells_raw":0,"read":"whole","date_system":"1900"}

{"sheet":"Лист1","index":0,"n_rows":10,"n_cols":4,"rows_kept":10,"cut":false,"hidden":false,"merged":[]}
[]
[]
[]
[]
[null,null,null,"01.09.2012"]
["бла бла","Петров",12,"нестабильное"]
["бла бла","Иван",13,"критическое"]
["бла бла","Коля",14,"неудовлетворительное"]
["бла бла","Вася",15,"нестабильное"]
["бла бла","Катя",16,"критическое"]

{"sheet":"Лист2","index":1,"n_rows":8,"n_cols":11,"rows_kept":8,"cut":false,"hidden":false,"merged":[]}
[]
[]
[null,null,null,null,null,null,"Код","Фин состояние","01.09.2012","1.10.2012","1.11.2012"]
["бла","бла",null,null,null,"Петров",12,null,{"$f":"INDEX(Лист1!$1:$65536, MATCH($G4,Лист1!$C:$C,), MATCH(I$3,Лист1!$5:$5,))","v":"нестабильное"},"стабильное"]
["бла","бла",null,null,null,"Иван",13,null,{"$f":"INDEX(Лист1!$1:$65536, MATCH($G5,Лист1!$C:$C,), MATCH(I$3,Лист1!$5:$5,))","v":"критическое"},"удовлетворительное"]
["бла","бла",null,null,null,"Коля",14,null,{"$f":"INDEX(Лист1!$1:$65536, MATCH($G6,Лист1!$C:$C,), MATCH(I$3,Лист1!$5:$5,))","v":"неудовлетворительное"},"неудовлетворительное"]
["бла","бла",null,null,null,"Вася",15,null,{"$f":"INDEX(Лист1!$1:$65536, MATCH($G7,Лист1!$C:$C,), MATCH(I$3,Лист1!$5:$5,))","v":"нестабильное"},"нестабильное"]
["бла","бла",null,null,null,"Катя",16,null,{"$f":"INDEX(Лист1!$1:$65536, MATCH($G8,Лист1!$C:$C,), MATCH(I$3,Лист1!$5:$5,))","v":"критическое"},"критическое"]

{"sheet":"Лист3","index":2,"n_rows":0,"n_cols":0,"rows_kept":0,"cut":false,"hidden":false,"merged":[]}