{"text_format":"1","workbook":"xlsx","n_sheets":3,"sheets":["Лист1","Лист2","Лист3"],"not_rendered":{"charts":0,"images":0,"macros":1,"external_links":0,"defined_names":0,"comments":0,"pivot_tables":1},"unopened":[],"bounds":{"document_bytes":16777216,"sheet_cells":100000,"rows_first":2000,"rows_last":500,"rows_between":2000,"halvings":0,"cell_chars":16384,"cell_head_chars":4096},"cells_cut":0,"cells_raw":0,"read":"whole","date_system":"1900"}

{"sheet":"Лист1","index":0,"n_rows":24,"n_cols":13,"rows_kept":24,"cut":false,"hidden":false,"merged":[]}
[null,null,null,null,null,null,null,null,null,"Петров",12,null,1]
[null,null,null,null,null,null,null,null,null,"Иван",13,null,2]
[null,null,null,null,null,null,null,null,null,"Коля",14,null,3]
["бла бла","ФИО","Код","Фин сост","дата",null,null,null,null,"Вася",15,null,4]
["бла бла","Петров",{"$f":"VLOOKUP(B5,$J$1:$K$5,2,)","v":12},3,"1.03.2012",null,null,null,null,"Катя",16,null,5]
["бла бла","Иван",13,2,"1.03.2012"]
["бла бла","Коля",14,3,"1.03.2012"]
["бла бла","Вася",15,4,"1.03.2012"]
["бла бла","Катя",16,5,"1.03.2012",null,null,"Среднее по полю Фин сост",null,"дата"]
["бла бла","Петров",12,4,"2013-03-02",null,null,"Код","ФИО","1.03.2012","2013-03-02","2013-03-03","2013-03-04"]
["бла бла","Иван",13,1,"2013-03-02",null,null,12,"Петров",3,4,4,3]
["бла бла","Коля",14,3,"2013-03-02",null,null,13,"Иван",2,1,1,4]
["бла бла","Вася",15,5,"2013-03-02",null,null,14,"Коля",3,3,3,4]
["бла бла","Катя",16,5,"2013-03-02",null,null,15,"Вася",4,5,5,5]
["бла бла","Петров",12,4,"2013-03-03",null,null,16,"Катя",5,5,5,1]
["бла бла","Иван",13,1,"2013-03-03"]
["бла бла","Коля",14,3,"2013-03-03"]
["бла бла","Вася",15,5,"2013-03-03"]
["бла бла","Катя",16,5,"2013-03-03"]
["бла бла","Петров",{"$f":"VLOOKUP(B20,$J$1:$K$5,2,)","v":12},3,"2013-03-04"]
["бла бла","Иван",13,4,"2013-03-04"]
["бла бла","Коля",14,4,"2013-03-04"]
["бла бла","Вася",15,5,"2013-03-04"]
["бла бла","Катя",{"$f":"VLOOKUP(B24,$J$1:$K$5,2,)","v":16},1,"2013-03-04"]

{"sheet":"Лист2","index":1,"n_rows":8,"n_cols":14,"rows_kept":8,"cut":false,"hidden":false,"merged":[[1,7,1,9]]}
[]
[null,null,null,null,null,null,null,"Фин состояние"]
[null,null,null,null,null,null,"Код","1.01.2012","1.02.2012","1.03.2012"]
[1,1,null,null,{"$f":"INDEX(Лист1!$B$5:$D$9,MATCH(Лист2!$G4,Лист1!$C$5:$C$9,0),3)","v":3},"Петров",12,1,1,{"$f":"INDEX(Лист1!B5:D9,MATCH(Лист2!G4,Лист1!C5:C9,0),3)","v":3},{"$f":"INDEX(Лист1!$1:$1048576, MATCH($G4,Лист1!$C:$C,), MATCH(J$3,Лист1!#REF!,))","v":{"$error":"#REF!"}},{"$f":"INDEX(Лист1!$B$5:$D$9,MATCH(Лист2!$G4,Лист1!$C$5:$C$9,0),3)","v":3},{"$f":"INDEX(Лист1!$B$5:$D$9,MATCH(Лист2!$G4,Лист1!$C$5:$C$9,0),3)","v":3},{"$f":"INDEX(Лист1!$B$5:$D$9,MATCH(Лист2!$G4,Лист1!$C$5:$C$9,0),3)","v":3}]
[2,2,null,null,null,"Иван",13,2,2,{"$f":"INDEX(Лист1!B6:D10,MATCH(Лист2!G5,Лист1!C6:C10,0),3)","v":2},{"$f":"INDEX(Лист1!$1:$1048576, MATCH($G5,Лист1!$C:$C,), MATCH(J$3,Лист1!#REF!,))","v":{"$error":"#REF!"}}]
[3,3,null,null,null,"Коля",14,3,3,{"$f":"INDEX(Лист1!B7:D11,MATCH(Лист2!G6,Лист1!C7:C11,0),3)","v":3},{"$f":"INDEX(Лист1!$1:$1048576, MATCH($G6,Лист1!$C:$C,), MATCH(J$3,Лист1!#REF!,))","v":{"$error":"#REF!"}}]
[4,4,null,null,null,"Вася",15,4,4,{"$f":"INDEX(Лист1!B8:D12,MATCH(Лист2!G7,Лист1!C8:C12,0),3)","v":4},{"$f":"INDEX(Лист1!$1:$1048576, MATCH($G7,Лист1!$C:$C,), MATCH(J$3,Лист1!#REF!,))","v":{"$error":"#REF!"}}]
[5,5,null,null,null,"Катя",16,5,5,{"$f":"INDEX(Лист1!B9:D13,MATCH(Лист2!G8,Лист1!C9:C13,0),3)","v":5},{"$f":"INDEX(Лист1!$1:$1048576, MATCH($G8,Лист1!$C:$C,), MATCH(J$3,Лист1!#REF!,))","v":{"$error":"#REF!"}}]

{"sheet":"Лист3","index":2,"n_rows":0,"n_cols":0,"rows_kept":0,"cut":false,"hidden":false,"merged":[]}