{"text_format":"1","workbook":"xlsx","n_sheets":2,"sheets":["Лист4","Area1"],"not_rendered":{"charts":0,"images":0,"macros":1,"external_links":0,"defined_names":2,"comments":0,"pivot_tables":0},"unopened":[],"bounds":{"document_bytes":16777216,"sheet_cells":100000,"rows_first":2000,"rows_last":500,"rows_between":2000,"halvings":0,"cell_chars":16384,"cell_head_chars":4096},"cells_cut":0,"cells_raw":0,"read":"whole","date_system":"1900"}

{"sheet":"Лист4","index":0,"n_rows":38,"n_cols":13,"rows_kept":38,"cut":false,"hidden":false,"merged":[]}
["По состоянию на 17.05.16"]
["№ позиции","Животное","Цвет","≤15 ","15-30 ","30-45 ","45-60","60-75","75-90","90-105","105-130",">130"]
["№","Кот",null,null,null,null,null,null,null,null,null,null,{"$f":"COUNTBLANK(A3:L3)","v":10}]
[1,{"$f":"IFERROR(INDEX(Area1!$A$3:$A$752,SMALL(IF(Лист4!$B$3=Area1!A3:A752,ROW(Area1!A3:A752)-2,\"\"),ROW()-ROW(Лист4!B3))),\"\")","v":"Кот"},{"$f":"IFERROR(INDEX(Area1!B$3:B$752,SMALL(IF(Лист4!$B$3=Area1!$A$3:$A$752,ROW(Area1!B3:B752)-2,\"\"),ROW()-ROW(Лист4!$B3))),\"\")","v":"серая"},{"$f":"IFERROR(INDEX(Area1!C$3:C$752,SMALL(IF(Лист4!$B$3=Area1!$A$3:$A$752,ROW(Area1!C3:C752)-2,\"\"),ROW()-ROW(Лист4!$B3))),\"\")","v":1},{"$f":"IFERROR(INDEX(Area1!D$3:D$752,SMALL(IF(Лист4!$B$3=Area1!$A$3:$A$752,ROW(Area1!D3:D752)-2,\"\"),ROW()-ROW(Лист4!$B3))),\"\")","v":" "},{"$f":"IFERROR(INDEX(Area1!E$3:E$752,SMALL(IF(Лист4!$B$3=Area1!$A$3:$A$752,ROW(Area1!E3:E752)-2,\"\"),ROW()-ROW(Лист4!$B3))),\"\")","v":" "},{"$f":"IFERROR(INDEX(Area1!F$3:F$752,SMALL(IF(Лист4!$B$3=Area1!$A$3:$A$752,ROW(Area1!F3:F752)-2,\"\"),ROW()-ROW(Лист4!$B3))),\"\")","v":" "},{"$f":"IFERROR(INDEX(Area1!G$3:G$752,SMALL(IF(Лист4!$B$3=Area1!$A$3:$A$752,ROW(Area1!G3:G752)-2,\"\"),ROW()-ROW(Лист4!$B3))),\"\")","v":" "},{"$f":"IFERROR(INDEX(Area1!H$3:H$752,SMALL(IF(Лист4!$B$3=Area1!$A$3:$A$752,ROW(Area1!H3:H752)-2,\"\"),ROW()-ROW(Лист4!$B3))),\"\")","v":" "},{"$f":"IFERROR(INDEX(Area1!I$3:I$752,SMALL(IF(Лист4!$B$3=Area1!$A$3:$A$752,ROW(Area1!I3:I752)-2,\"\"),ROW()-ROW(Лист4!$B3))),\"\")","v":" "},{"$f":"IFERROR(INDEX(Area1!J$3:J$752,SMALL(IF(Лист4!$B$3=Area1!$A$3:$A$752,ROW(Area1!J3:J752)-2,\"\"),ROW()-ROW(Лист4!$B3))),\"\")","v":" "},{"$f":"IFERROR(INDEX(Area1!#REF!,SMALL(IF(Лист4!$B$3=Area1!$A$3:$A$752,ROW(Area1!#REF!)-2,\"\"),ROW()-ROW(Лист4!$B3))),\"\")","v":""},{"$f":"COUNTBLANK(A4:L4)","v":1}]
[2,"Кот","серая",1," "," "," "," "," "," "," ","",{"$f":"COUNTBLANK(A5:L5)","v":1}]
[3,"","","","","","","","","","","",{"$f":"COUNTBLANK(A6:L6)","v":11}]
[4,"","","","","","","","","","","",{"$f":"COUNTBLANK(A7:L7)","v":11}]
[5,"","","","","","","","","","","",{"$f":"COUNTBLANK(A8:L8)","v":11}]
[6,"","","","","","","","","","","",{"$f":"COUNTBLANK(A9:L9)","v":11}]
[7,"","","","","","","","","","","",{"$f":"COUNTBLANK(A10:L10)","v":11}]
[8,"","","","","","","","","","","",{"$f":"COUNTBLANK(A11:L11)","v":11}]
[9,"","","","","","","","","","","",{"$f":"COUNTBLANK(A12:L12)","v":11}]
[10,"","","","","","","","","","","",{"$f":"COUNTBLANK(A13:L13)","v":11}]
["KIA CEE'D Classic",{"$f":"IF(SUM(D14:L14)=0,\"\",SUM(D14:L14))","v":2},null,{"$f":"SUM(D4:D13)","v":2},{"$f":"SUM(E4:E13)","v":0},0,0,0,0,0,0,0,{"$f":"COUNTBLANK(A14:L14)","v":1}]
["№","Собака",null,null,null,null,null,null,null,null,null,null,{"$f":"COUNTBLANK(A15:L15)","v":10}]
[1,{"$f":"IFERROR(INDEX(Area1!$A$3:$A$752,SMALL(IF(Лист4!$B$15=Area1!A3:A752,ROW(Area1!A3:A752)-2,\"\"),ROW()-ROW(Лист4!B15))),\"\")","v":"Собака"},{"$f":"IFERROR(INDEX(Area1!B$3:B$752,SMALL(IF(Лист4!$B$15=Area1!$A$3:$A$752,ROW(Area1!B3:B752)-2,\"\"),ROW()-ROW(Лист4!$B15))),\"\")","v":"рыжая"},{"$f":"IFERROR(INDEX(Area1!C$3:C$752,SMALL(IF(Лист4!$B$15=Area1!$A$3:$A$752,ROW(Area1!C3:C752)-2,\"\"),ROW()-ROW(Лист4!$B15))),\"\")","v":" "},{"$f":"IFERROR(INDEX(Area1!D$3:D$752,SMALL(IF(Лист4!$B$15=Area1!$A$3:$A$752,ROW(Area1!D3:D752)-2,\"\"),ROW()-ROW(Лист4!$B15))),\"\")","v":" "},{"$f":"IFERROR(INDEX(Area1!E$3:E$752,SMALL(IF(Лист4!$B$15=Area1!$A$3:$A$752,ROW(Area1!E3:E752)-2,\"\"),ROW()-ROW(Лист4!$B15))),\"\")","v":1},{"$f":"IFERROR(INDEX(Area1!F$3:F$752,SMALL(IF(Лист4!$B$15=Area1!$A$3:$A$752,ROW(Area1!F3:F752)-2,\"\"),ROW()-ROW(Лист4!$B15))),\"\")","v":" "},{"$f":"IFERROR(INDEX(Area1!G$3:G$752,SMALL(IF(Лист4!$B$15=Area1!$A$3:$A$752,ROW(Area1!G3:G752)-2,\"\"),ROW()-ROW(Лист4!$B15))),\"\")","v":" "},{"$f":"IFERROR(INDEX(Area1!H$3:H$752,SMALL(IF(Лист4!$B$15=Area1!$A$3:$A$752,ROW(Area1!H3:H752)-2,\"\"),ROW()-ROW(Лист4!$B15))),\"\")","v":" "},{"$f":"IFERROR(INDEX(Area1!I$3:I$752,SMALL(IF(Лист4!$B$15=Area1!$A$3:$A$752,ROW(Area1!I3:I752)-2,\"\"),ROW()-ROW(Лист4!$B15))),\"\")","v":" "},{"$f":"IFERROR(INDEX(Area1!J$3:J$752,SMALL(IF(Лист4!$B$15=Area1!$A$3:$A$752,ROW(Area1!J3:J752)-2,\"\"),ROW()-ROW(Лист4!$B15))),\"\")","v":" "},{"$f":"IFERROR(INDEX(Area1!#REF!,SMALL(IF(Лист4!$B$15=Area1!$A$3:$A$752,ROW(Area1!#REF!)-2,\"\"),ROW()-ROW(Лист4!$B15))),\"\")","v":""},{"$f":"COUNTBLANK(A16:L16)","v":1}]
[2,"Собака","пятнистая"," "," "," ",1," "," "," "," ","",{"$f":"COUNTBLANK(A17:L17)","v":1}]
[3,"Собака","желтая"," "," "," "," ",1," "," "," ","",{"$f":"COUNTBLANK(A18:L18)","v":1}]
[4,"","","","","","","","","","","",{"$f":"COUNTBLANK(A19:L19)","v":11}]
[5,"","","","","","","","","","","",{"$f":"COUNTBLANK(A20:L20)","v":11}]
[6,"","","","","","","","","","","",{"$f":"COUNTBLANK(A21:L21)","v":11}]
[7,"","","","","","","","","","","",{"$f":"COUNTBLANK(A22:L22)","v":11}]
[8,"","","","","","","","","","","",{"$f":"COUNTBLANK(A23:L23)","v":11}]
[9,"","","","","","","","","","","",{"$f":"COUNTBLANK(A24:L24)","v":11}]
[10,"","","","","","","","","","","",{"$f":"COUNTBLANK(A25:L25)","v":11}]
["KIA CEE'D Classic AC",{"$f":"IF(SUM(D26:L26)=0,\"\",SUM(D26:L26))","v":3},null,{"$f":"SUM(D16:D25)","v":0},{"$f":"SUM(E16:E25)","v":0},1,1,1,0,0,0,0,{"$f":"COUNTBLANK(A26:L26)","v":1}]
["№","Попугай",null,null,null,null,null,null,null,null,null,null,{"$f":"COUNTBLANK(A27:L27)","v":10}]
[1,{"$f":"IFERROR(INDEX(Area1!$A$3:$A$752,SMALL(IF(Лист4!$B$27=Area1!A3:A752,ROW(Area1!A3:A752)-2,\"\"),ROW()-ROW(Лист4!B27))),\"\")","v":"Попугай"},{"$f":"IFERROR(INDEX(Area1!B$3:B$752,SMALL(IF(Лист4!$B$27=Area1!$A$3:$A$752,ROW(Area1!B3:B752)-2,\"\"),ROW()-ROW(Лист4!$B27))),\"\")","v":"Серая"},{"$f":"IFERROR(INDEX(Area1!C$3:C$752,SMALL(IF(Лист4!$B$27=Area1!$A$3:$A$752,ROW(Area1!C3:C752)-2,\"\"),ROW()-ROW(Лист4!$B27))),\"\")","v":" "},{"$f":"IFERROR(INDEX(Area1!D$3:D$752,SMALL(IF(Лист4!$B$27=Area1!$A$3:$A$752,ROW(Area1!D3:D752)-2,\"\"),ROW()-ROW(Лист4!$B27))),\"\")","v":1},{"$f":"IFERROR(INDEX(Area1!E$3:E$752,SMALL(IF(Лист4!$B$27=Area1!$A$3:$A$752,ROW(Area1!E3:E752)-2,\"\"),ROW()-ROW(Лист4!$B27))),\"\")","v":" "},{"$f":"IFERROR(INDEX(Area1!F$3:F$752,SMALL(IF(Лист4!$B$27=Area1!$A$3:$A$752,ROW(Area1!F3:F752)-2,\"\"),ROW()-ROW(Лист4!$B27))),\"\")","v":" "},{"$f":"IFERROR(INDEX(Area1!G$3:G$752,SMALL(IF(Лист4!$B$27=Area1!$A$3:$A$752,ROW(Area1!G3:G752)-2,\"\"),ROW()-ROW(Лист4!$B27))),\"\")","v":" "},{"$f":"IFERROR(INDEX(Area1!H$3:H$752,SMALL(IF(Лист4!$B$27=Area1!$A$3:$A$752,ROW(Area1!H3:H752)-2,\"\"),ROW()-ROW(Лист4!$B27))),\"\")","v":" "},{"$f":"IFERROR(INDEX(Area1!I$3:I$752,SMALL(IF(Лист4!$B$27=Area1!$A$3:$A$752,ROW(Area1!I3:I752)-2,\"\"),ROW()-ROW(Лист4!$B27))),\"\")","v":" "},{"$f":"IFERROR(INDEX(Area1!J$3:J$752,SMALL(IF(Лист4!$B$27=Area1!$A$3:$A$752,ROW(Area1!J3:J752)-2,\"\"),ROW()-ROW(Лист4!$B27))),\"\")","v":" "},{"$f":"IFERROR(INDEX(Area1!#REF!,SMALL(IF(Лист4!$B$27=Area1!$A$3:$A$752,ROW(Area1!#REF!)-2,\"\"),ROW()-ROW(Лист4!$B27))),\"\")","v":""},{"$f":"COUNTBLANK(A28:L28)","v":1}]
[2,"Попугай","Зелено-касный"," "," "," "," "," "," "," ",1,"",{"$f":"COUNTBLANK(A29:L29)","v":1}]
[3,"Попугай","коричнево-желтый"," "," "," "," "," ",1," "," ","",{"$f":"COUNTBLANK(A30:L30)","v":1}]
[4,"","","","","","","","","","","",{"$f":"COUNTBLANK(A31:L31)","v":11}]
[5,"","","","","","","","","","","",{"$f":"COUNTBLANK(A32:L32)","v":11}]
[6,"","","","","","","","","","","",{"$f":"COUNTBLANK(A33:L33)","v":11}]
[7,"","","","","","","","","","","",{"$f":"COUNTBLANK(A34:L34)","v":11}]
[8,"","","","","","","","","","","",{"$f":"COUNTBLANK(A35:L35)","v":11}]
[9,"","","","","","","","","","","",{"$f":"COUNTBLANK(A36:L36)","v":11}]
[10,"","","","","","","","","","","",{"$f":"COUNTBLANK(A37:L37)","v":11}]
["KIA CEE'D Classic AC [Fleet]",{"$f":"IF(SUM(D38:L38)=0,\"\",SUM(D38:L38))","v":3},null,{"$f":"SUM(D28:D37)","v":0},{"$f":"SUM(E28:E37)","v":1},0,0,0,1,0,1,0,{"$f":"COUNTBLANK(A38:L38)","v":1}]

{"sheet":"Area1","index":1,"n_rows":10,"n_cols":10,"rows_kept":10,"cut":false,"hidden":false,"merged":[]}
["Наименование Авто","Цвет","<=15 дней","15-30 дней","30-45 дней","45-60 дней","60-75 дней","75-90 дней","90-105 дней","105-130 дней"]
[]
["Кот","серая",1," "," "," "," "," "," "," "]
["Кот","серая",1," "," "," "," "," "," "," "]
["Собака","рыжая"," "," ",1," "," "," "," "," "]
["Собака","пятнистая"," "," "," ",1," "," "," "," "]
["Собака","желтая"," "," "," "," ",1," "," "," "]
["Попугай","Серая"," ",1," "," "," "," "," "," "]
["Попугай","Зелено-касный"," "," "," "," "," "," "," ",1]
["Попугай","коричнево-желтый"," "," "," "," "," ",1," "," "]