{"text_format":"1","workbook":"xlsx","n_sheets":2,"sheets":["Лист1","База"],"not_rendered":{"charts":0,"images":0,"macros":1,"external_links":0,"defined_names":0,"comments":0,"pivot_tables":0},"unopened":[],"bounds":{"document_bytes":16777216,"sheet_cells":100000,"rows_first":2000,"rows_last":500,"rows_between":2000,"halvings":0,"cell_chars":16384,"cell_head_chars":4096},"cells_cut":0,"cells_raw":0,"read":"whole","date_system":"1900"}

{"sheet":"Лист1","index":0,"n_rows":17,"n_cols":5,"rows_kept":17,"cut":false,"hidden":false,"merged":[]}
[]
[null,null,"C:\\Users\\user\\Downloads\\"]
[]
[]
[null,"Товар","картошка","Дата поставки","Масса"]
[null,null,null,{"$f":"IFERROR(_xlfn.AGGREGATE(15,6,База!$A$2:$A$19/(База!B$2:B$19=C$5),ROW(1:1)),\"\")","v":"2016-06-02T17:55:39.960"},{"$f":"IFERROR(INDEX(База!C$2:C$19,_xlfn.AGGREGATE(15,6,ROW($1:$20)/(База!A$2:A$19=D6)/(База!B$2:B$19=C$5),1)),\"\")","v":33}]
[null,null,null,{"$f":"IFERROR(_xlfn.AGGREGATE(15,6,База!$A$2:$A$19/(База!B$2:B$19=C$5),ROW(2:2)),\"\")","v":"2016-06-02T18:00:23.090"},{"$f":"IFERROR(INDEX(База!C$2:C$19,_xlfn.AGGREGATE(15,6,ROW($1:$20)/(База!A$2:A$19=D7)/(База!B$2:B$19=C$5),1)),\"\")","v":908}]
[null,null,null,{"$f":"IFERROR(_xlfn.AGGREGATE(15,6,База!$A$2:$A$19/(База!B$2:B$19=C$5),ROW(3:3)),\"\")","v":"2016-06-02T18:00:36"},{"$f":"IFERROR(INDEX(База!C$2:C$19,_xlfn.AGGREGATE(15,6,ROW($1:$20)/(База!A$2:A$19=D8)/(База!B$2:B$19=C$5),1)),\"\")","v":77}]
[null,null,null,{"$f":"IFERROR(_xlfn.AGGREGATE(15,6,База!$A$2:$A$19/(База!B$2:B$19=C$5),ROW(4:4)),\"\")","v":""},{"$f":"IFERROR(INDEX(База!C$2:C$19,_xlfn.AGGREGATE(15,6,ROW($1:$20)/(База!A$2:A$19=D9)/(База!B$2:B$19=C$5),1)),\"\")","v":""}]
[null,null,null,{"$f":"IFERROR(_xlfn.AGGREGATE(15,6,База!$A$2:$A$19/(База!B$2:B$19=C$5),ROW(5:5)),\"\")","v":""},{"$f":"IFERROR(INDEX(База!C$2:C$19,_xlfn.AGGREGATE(15,6,ROW($1:$20)/(База!A$2:A$19=D10)/(База!B$2:B$19=C$5),1)),\"\")","v":""}]
[null,null,null,{"$f":"IFERROR(_xlfn.AGGREGATE(15,6,База!$A$2:$A$19/(База!B$2:B$19=C$5),ROW(6:6)),\"\")","v":""},{"$f":"IFERROR(INDEX(База!C$2:C$19,_xlfn.AGGREGATE(15,6,ROW($1:$20)/(База!A$2:A$19=D11)/(База!B$2:B$19=C$5),1)),\"\")","v":""}]
[null,null,null,{"$f":"IFERROR(_xlfn.AGGREGATE(15,6,База!$A$2:$A$19/(База!B$2:B$19=C$5),ROW(7:7)),\"\")","v":""},{"$f":"IFERROR(INDEX(База!C$2:C$19,_xlfn.AGGREGATE(15,6,ROW($1:$20)/(База!A$2:A$19=D12)/(База!B$2:B$19=C$5),1)),\"\")","v":""}]
[null,null,null,{"$f":"IFERROR(_xlfn.AGGREGATE(15,6,База!$A$2:$A$19/(База!B$2:B$19=C$5),ROW(8:8)),\"\")","v":""},{"$f":"IFERROR(INDEX(База!C$2:C$19,_xlfn.AGGREGATE(15,6,ROW($1:$20)/(База!A$2:A$19=D13)/(База!B$2:B$19=C$5),1)),\"\")","v":""}]
[null,null,null,{"$f":"IFERROR(_xlfn.AGGREGATE(15,6,База!$A$2:$A$19/(База!B$2:B$19=C$5),ROW(9:9)),\"\")","v":""}]
[null,null,null,{"$f":"IFERROR(_xlfn.AGGREGATE(15,6,База!$A$2:$A$19/(База!B$2:B$19=C$5),ROW(10:10)),\"\")","v":""}]
[null,null,null,{"$f":"IFERROR(_xlfn.AGGREGATE(15,6,База!$A$2:$A$19/(База!B$2:B$19=C$5),ROW(11:11)),\"\")","v":""}]
[null,null,null,{"$f":"IFERROR(_xlfn.AGGREGATE(15,6,База!$A$2:$A$19/(База!B$2:B$19=C$5),ROW(12:12)),\"\")","v":""}]

{"sheet":"База","index":1,"n_rows":19,"n_cols":3,"rows_kept":19,"cut":false,"hidden":false,"merged":[]}
["Дата поставки","Товар","Масса"]
["2016-06-02T17:54:30.600","Груши",354]
["2016-06-02T18:00:31.440","яблоки",323]
["2016-06-02T17:59:36.330","мясо",676]
["2016-06-02T17:55:35.710","рыба",3454]
["2016-06-02T18:00:36","картошка",77]
["2016-06-02T17:59:46.850","лук",4]
["2016-06-02T18:00:40.010","Груши",76]
["2016-06-02T17:55:29.050","яблоки",90]
["2016-06-02T18:00:43.540","мясо",32]
["2016-06-02T18:00:15.090","рыба",12]
["2016-06-02T17:55:39.960","картошка",33]
["2016-06-02T18:00:57.520","лук",76]
["2016-06-02T18:00:27.810","Груши",45]
["2016-06-02T18:00:47.280","яблоки",789]
["2016-06-02T18:00:53.580","мясо",231]
["2016-06-02T17:54:44.360","рыба",88]
["2016-06-02T18:00:23.090","картошка",908]
["2016-06-02T18:00:19.310","лук",221]