{"text_format":"1","workbook":"xlsx","n_sheets":3,"sheets":["Бюджет","Выписки","Лист3"],"not_rendered":{"charts":0,"images":0,"macros":1,"external_links":0,"defined_names":3,"comments":0,"pivot_tables":0},"unopened":[],"bounds":{"document_bytes":16777216,"sheet_cells":100000,"rows_first":2000,"rows_last":500,"rows_between":2000,"halvings":0,"cell_chars":16384,"cell_head_chars":4096},"cells_cut":0,"cells_raw":0,"read":"whole","date_system":"1900"}

{"sheet":"Бюджет","index":0,"n_rows":20,"n_cols":10,"rows_kept":20,"cut":false,"hidden":false,"merged":[[9,1,9,2],[12,1,12,2],[0,1,2,1],[0,3,0,5],[0,2,2,2],[3,1,3,2],[6,1,6,2]]}
[null,"№ Статьи","Статьи и договора","Период"]
[null,null,null,"Май",2016]
[null,null,null,"План","Факт","Отклонение",null,"сентябрь",{"$f":"(SEARCH(H3,\"январь??февраль?март????апрель??май?????июнь????июль????август??сентябрьоктябрь?ноябрь??декабрь?\")+7)/8","v":9}]
[null,"Поступления"]
[null,1,"Займ от Леруа",{"$f":"MAX(IFERROR(MATCH(\"*\",$B$1:$B5,-1),0),IFERROR(MATCH($B5+1000000,$B$1:$B5,1),0))","v":5},{"$f":"SUMIFS(Выписки!$B:$B,Выписки!$G:$G,INDEX($B:$B,MAX(IFERROR(MATCH(\"*\",$B$1:$B5,-1),0),IFERROR(MATCH($B5+1000000,$B$1:$B5,1),0))),Выписки!$H:$H,$C5,Выписки!$A:$A,\"<=\"&DATE(E$2,(SEARCH(D$2,\"январь??февраль?март????апрель??май?????июнь????июль????август??сентябрьоктябрь?ноябрь??декабрь?\")+7)/8+1,0),Выписки!$A:$A,\">=\"&DATE(E$2,(SEARCH(D$2,\"январь??февраль?март????апрель??май?????июнь????июль????август??сентябрьоктябрь?ноябрь??декабрь?\")+7)/8,1))-SUMIFS(Выписки!$C:$C,Выписки!$G:$G,INDEX($B:$B,MAX(IFERROR(MATCH(\"*\",$B$1:$B5,-1),0),IFERROR(MATCH($B5+1000000,$B$1:$B5,1),0))),Выписки!$H:$H,$C5,Выписки!$A:$A,\"<=\"&DATE(E$2,(SEARCH(D$2,\"январь??февраль?март????апрель??май?????июнь????июль????август??сентябрьоктябрь?ноябрь??декабрь?\")+7)/8+1,0),Выписки!$A:$A,\">=\"&DATE(E$2,(SEARCH(D$2,\"январь??февраль?март????апрель??май?????июнь????июль????август??сентябрьоктябрь?ноябрь??декабрь?\")+7)/8,1))","v":0},null,null,{"$f":"MATCH($B5-1000000,$B5:$B$1000,-1)","v":12},null,{"$f":"SMALL($B:$B,1)","v":1}]
[null,null,"Леруа",{"$f":"MAX(IFERROR(MATCH(\"*\",$B$1:$B6,-1),0),IFERROR(MATCH($B6+1000000,$B$1:$B6,1),0))","v":5},{"$f":"SUMIFS(Выписки!$B:$B,Выписки!$G:$G,INDEX($B:$B,MAX(IFERROR(MATCH(\"*\",$B$1:$B6,-1),0),IFERROR(MATCH($B6+1000000,$B$1:$B6,1),0))),Выписки!$H:$H,$C6,Выписки!$A:$A,\"<=\"&DATE(E$2,(SEARCH(D$2,\"январь??февраль?март????апрель??май?????июнь????июль????август??сентябрьоктябрь?ноябрь??декабрь?\")+7)/8+1,0),Выписки!$A:$A,\">=\"&DATE(E$2,(SEARCH(D$2,\"январь??февраль?март????апрель??май?????июнь????июль????август??сентябрьоктябрь?ноябрь??декабрь?\")+7)/8,1))-SUMIFS(Выписки!$C:$C,Выписки!$G:$G,INDEX($B:$B,MAX(IFERROR(MATCH(\"*\",$B$1:$B6,-1),0),IFERROR(MATCH($B6+1000000,$B$1:$B6,1),0))),Выписки!$H:$H,$C6,Выписки!$A:$A,\"<=\"&DATE(E$2,(SEARCH(D$2,\"январь??февраль?март????апрель??май?????июнь????июль????август??сентябрьоктябрь?ноябрь??декабрь?\")+7)/8+1,0),Выписки!$A:$A,\">=\"&DATE(E$2,(SEARCH(D$2,\"январь??февраль?март????апрель??май?????июнь????июль????август??сентябрьоктябрь?ноябрь??декабрь?\")+7)/8,1))","v":10000},null,null,{"$f":"MATCH($B6-1000000,$B6:$B$1000,-1)","v":11},null,{"$f":"IFERROR(SMALL($B:$B,MATCH($J5,$J:$J,0)-3),\"\")","v":2}]
[null,"АУР",null,{"$f":"MAX(IFERROR(MATCH(\"*\",$B$1:$B7,-1),0),IFERROR(MATCH(#REF!+1000000,$B$1:$B7,1),0))","v":7},{"$f":"SUMIFS(Выписки!$C:$C,Выписки!$G:$G,INDEX($B:$B,MAX(IFERROR(MATCH(\"*\",$B$1:$B7,-1),0),IFERROR(MATCH($B7+1000000,$B$1:$B7,1),0))),Выписки!$H:$H,$C7,Выписки!$A:$A,\"<=\"&DATE(E$2,(SEARCH(D$2,\"январь??февраль?март????апрель??май?????июнь????июль????август??сентябрьоктябрь?ноябрь??декабрь?\")+7)/8+1,0),Выписки!$A:$A,\">=\"&DATE(E$2,(SEARCH(D$2,\"январь??февраль?март????апрель??май?????июнь????июль????август??сентябрьоктябрь?ноябрь??декабрь?\")+7)/8,1))-SUMIFS(Выписки!$B:$B,Выписки!$G:$G,INDEX($B:$B,MAX(IFERROR(MATCH(\"*\",$B$1:$B7,-1),0),IFERROR(MATCH($B7+1000000,$B$1:$B7,1),0))),Выписки!$H:$H,$C7,Выписки!$A:$A,\"<=\"&DATE(E$2,(SEARCH(D$2,\"январь??февраль?март????апрель??май?????июнь????июль????август??сентябрьоктябрь?ноябрь??декабрь?\")+7)/8+1,0),Выписки!$A:$A,\">=\"&DATE(E$2,(SEARCH(D$2,\"январь??февраль?март????апрель??май?????июнь????июль????август??сентябрьоктябрь?ноябрь??декабрь?\")+7)/8,1))","v":0},null,null,{"$f":"MATCH($B7-1000000,$B7:$B$1000,-1)","v":{"$error":"#VALUE!"}},null,{"$f":"IFERROR(SMALL($B:$B,MATCH($J6,$J:$J,0)-3),\"\")","v":3}]
[null,2,"Интернет",{"$f":"MAX(IFERROR(MATCH(\"*\",$B$1:$B8,-1),0),IFERROR(MATCH($B8+1000000,$B$1:$B8,1),0))","v":8},{"$f":"SUMIFS(Выписки!$C:$C,Выписки!$G:$G,INDEX($B:$B,MAX(IFERROR(MATCH(\"*\",$B$1:$B8,-1),0),IFERROR(MATCH($B8+1000000,$B$1:$B8,1),0))),Выписки!$H:$H,$C8,Выписки!$A:$A,\"<=\"&DATE(E$2,(SEARCH(D$2,\"январь??февраль?март????апрель??май?????июнь????июль????август??сентябрьоктябрь?ноябрь??декабрь?\")+7)/8+1,0),Выписки!$A:$A,\">=\"&DATE(E$2,(SEARCH(D$2,\"январь??февраль?март????апрель??май?????июнь????июль????август??сентябрьоктябрь?ноябрь??декабрь?\")+7)/8,1))-SUMIFS(Выписки!$B:$B,Выписки!$G:$G,INDEX($B:$B,MAX(IFERROR(MATCH(\"*\",$B$1:$B8,-1),0),IFERROR(MATCH($B8+1000000,$B$1:$B8,1),0))),Выписки!$H:$H,$C8,Выписки!$A:$A,\"<=\"&DATE(E$2,(SEARCH(D$2,\"январь??февраль?март????апрель??май?????июнь????июль????август??сентябрьоктябрь?ноябрь??декабрь?\")+7)/8+1,0),Выписки!$A:$A,\">=\"&DATE(E$2,(SEARCH(D$2,\"январь??февраль?март????апрель??май?????июнь????июль????август??сентябрьоктябрь?ноябрь??декабрь?\")+7)/8,1))","v":0},null,null,{"$f":"MATCH($B8-1000000,$B8:$B$1000,-1)","v":9},null,4]
[null,null,"Билайн",{"$f":"MAX(IFERROR(MATCH(\"*\",$B$1:$B9,-1),0),IFERROR(MATCH($B9+1000000,$B$1:$B9,1),0))","v":8},{"$f":"SUMIFS(Выписки!$C:$C,Выписки!$G:$G,INDEX($B:$B,MAX(IFERROR(MATCH(\"*\",$B$1:$B9,-1),0),IFERROR(MATCH($B9+1000000,$B$1:$B9,1),0))),Выписки!$H:$H,$C9,Выписки!$A:$A,\"<=\"&DATE(E$2,(SEARCH(D$2,\"январь??февраль?март????апрель??май?????июнь????июль????август??сентябрьоктябрь?ноябрь??декабрь?\")+7)/8+1,0),Выписки!$A:$A,\">=\"&DATE(E$2,(SEARCH(D$2,\"январь??февраль?март????апрель??май?????июнь????июль????август??сентябрьоктябрь?ноябрь??декабрь?\")+7)/8,1))-SUMIFS(Выписки!$B:$B,Выписки!$G:$G,INDEX($B:$B,MAX(IFERROR(MATCH(\"*\",$B$1:$B9,-1),0),IFERROR(MATCH($B9+1000000,$B$1:$B9,1),0))),Выписки!$H:$H,$C9,Выписки!$A:$A,\"<=\"&DATE(E$2,(SEARCH(D$2,\"январь??февраль?март????апрель??май?????июнь????июль????август??сентябрьоктябрь?ноябрь??декабрь?\")+7)/8+1,0),Выписки!$A:$A,\">=\"&DATE(E$2,(SEARCH(D$2,\"январь??февраль?март????апрель??май?????июнь????июль????август??сентябрьоктябрь?ноябрь??декабрь?\")+7)/8,1))","v":0},null,null,{"$f":"MATCH($B9-1000000,$B9:$B$1000,-1)","v":8},null,5]
[null,"Проектирование",null,{"$f":"MAX(IFERROR(MATCH(\"*\",$B$1:$B10,-1),0),IFERROR(MATCH(#REF!+1000000,$B$1:$B10,1),0))","v":10},{"$f":"SUMIFS(Выписки!$C:$C,Выписки!$G:$G,INDEX($B:$B,MAX(IFERROR(MATCH(\"*\",$B$1:$B10,-1),0),IFERROR(MATCH(#REF!+1000000,$B$1:$B10,1),0))),Выписки!$H:$H,$B10,Выписки!$A:$A,\"<=\"&DATE(E$2,(SEARCH(D$2,\"январь??февраль?март????апрель??май?????июнь????июль????август??сентябрьоктябрь?ноябрь??декабрь?\")+7)/8+1,0),Выписки!$A:$A,\">=\"&DATE(E$2,(SEARCH(D$2,\"январь??февраль?март????апрель??май?????июнь????июль????август??сентябрьоктябрь?ноябрь??декабрь?\")+7)/8,1))-SUMIFS(Выписки!$B:$B,Выписки!$G:$G,INDEX($B:$B,MAX(IFERROR(MATCH(\"*\",$B$1:$B10,-1),0),IFERROR(MATCH(#REF!+1000000,$B$1:$B10,1),0))),Выписки!$H:$H,$B10,Выписки!$A:$A,\"<=\"&DATE(E$2,(SEARCH(D$2,\"январь??февраль?март????апрель??май?????июнь????июль????август??сентябрьоктябрь?ноябрь??декабрь?\")+7)/8+1,0),Выписки!$A:$A,\">=\"&DATE(E$2,(SEARCH(D$2,\"январь??февраль?март????апрель??май?????июнь????июль????август??сентябрьоктябрь?ноябрь??декабрь?\")+7)/8,1))","v":0},null,null,{"$f":"MATCH($B10-1000000,$B10:$B$1000,-1)","v":{"$error":"#VALUE!"}},null,""]
[null,3,"Дороги",{"$f":"MAX(IFERROR(MATCH(\"*\",$B$1:$B11,-1),0),IFERROR(MATCH($B11+1000000,$B$1:$B11,1),0))","v":11},{"$f":"SUMIFS(Выписки!$C:$C,Выписки!$G:$G,INDEX($B:$B,MAX(IFERROR(MATCH(\"*\",$B$1:$B11,-1),0),IFERROR(MATCH($B11+1000000,$B$1:$B11,1),0))),Выписки!$H:$H,$C11,Выписки!$A:$A,\"<=\"&DATE(E$2,(SEARCH(D$2,\"январь??февраль?март????апрель??май?????июнь????июль????август??сентябрьоктябрь?ноябрь??декабрь?\")+7)/8+1,0),Выписки!$A:$A,\">=\"&DATE(E$2,(SEARCH(D$2,\"январь??февраль?март????апрель??май?????июнь????июль????август??сентябрьоктябрь?ноябрь??декабрь?\")+7)/8,1))-SUMIFS(Выписки!$B:$B,Выписки!$G:$G,INDEX($B:$B,MAX(IFERROR(MATCH(\"*\",$B$1:$B11,-1),0),IFERROR(MATCH($B11+1000000,$B$1:$B11,1),0))),Выписки!$H:$H,$C11,Выписки!$A:$A,\"<=\"&DATE(E$2,(SEARCH(D$2,\"январь??февраль?март????апрель??май?????июнь????июль????август??сентябрьоктябрь?ноябрь??декабрь?\")+7)/8+1,0),Выписки!$A:$A,\">=\"&DATE(E$2,(SEARCH(D$2,\"январь??февраль?март????апрель??май?????июнь????июль????август??сентябрьоктябрь?ноябрь??декабрь?\")+7)/8,1))","v":0},null,null,{"$f":"MATCH($B11-1000000,$B11:$B$1000,-1)","v":6},null,""]
[null,null,"Проектировщик",{"$f":"MAX(IFERROR(MATCH(\"*\",$B$1:$B12,-1),0),IFERROR(MATCH($B12+1000000,$B$1:$B12,1),0))","v":11},{"$f":"SUMIFS(Выписки!$C:$C,Выписки!$G:$G,INDEX($B:$B,MAX(IFERROR(MATCH(\"*\",$B$1:$B12,-1),0),IFERROR(MATCH($B12+1000000,$B$1:$B12,1),0))),Выписки!$H:$H,$C12,Выписки!$A:$A,\"<=\"&DATE(E$2,(SEARCH(D$2,\"январь??февраль?март????апрель??май?????июнь????июль????август??сентябрьоктябрь?ноябрь??декабрь?\")+7)/8+1,0),Выписки!$A:$A,\">=\"&DATE(E$2,(SEARCH(D$2,\"январь??февраль?март????апрель??май?????июнь????июль????август??сентябрьоктябрь?ноябрь??декабрь?\")+7)/8,1))-SUMIFS(Выписки!$B:$B,Выписки!$G:$G,INDEX($B:$B,MAX(IFERROR(MATCH(\"*\",$B$1:$B12,-1),0),IFERROR(MATCH($B12+1000000,$B$1:$B12,1),0))),Выписки!$H:$H,$C12,Выписки!$A:$A,\"<=\"&DATE(E$2,(SEARCH(D$2,\"январь??февраль?март????апрель??май?????июнь????июль????август??сентябрьоктябрь?ноябрь??декабрь?\")+7)/8+1,0),Выписки!$A:$A,\">=\"&DATE(E$2,(SEARCH(D$2,\"январь??февраль?март????апрель??май?????июнь????июль????август??сентябрьоктябрь?ноябрь??декабрь?\")+7)/8,1))","v":5000},null,null,{"$f":"MATCH($B12-1000000,$B12:$B$1000,-1)","v":5},null,{"$f":"IFERROR(SMALL($B:$B,MATCH($J11,$J:$J,0)-3),\"\")","v":""}]
[null,"Строительство",null,{"$f":"MAX(IFERROR(MATCH(\"*\",$B$1:$B13,-1),0),IFERROR(MATCH(#REF!+1000000,$B$1:$B13,1),0))","v":13},{"$f":"SUMIFS(Выписки!$C:$C,Выписки!$G:$G,INDEX($B:$B,MAX(IFERROR(MATCH(\"*\",$B$1:$B13,-1),0),IFERROR(MATCH(#REF!+1000000,$B$1:$B13,1),0))),Выписки!$H:$H,$B13,Выписки!$A:$A,\"<=\"&DATE(E$2,(SEARCH(D$2,\"январь??февраль?март????апрель??май?????июнь????июль????август??сентябрьоктябрь?ноябрь??декабрь?\")+7)/8+1,0),Выписки!$A:$A,\">=\"&DATE(E$2,(SEARCH(D$2,\"январь??февраль?март????апрель??май?????июнь????июль????август??сентябрьоктябрь?ноябрь??декабрь?\")+7)/8,1))-SUMIFS(Выписки!$B:$B,Выписки!$G:$G,INDEX($B:$B,MAX(IFERROR(MATCH(\"*\",$B$1:$B13,-1),0),IFERROR(MATCH(#REF!+1000000,$B$1:$B13,1),0))),Выписки!$H:$H,$B13,Выписки!$A:$A,\"<=\"&DATE(E$2,(SEARCH(D$2,\"январь??февраль?март????апрель??май?????июнь????июль????август??сентябрьоктябрь?ноябрь??декабрь?\")+7)/8+1,0),Выписки!$A:$A,\">=\"&DATE(E$2,(SEARCH(D$2,\"январь??февраль?март????апрель??май?????июнь????июль????август??сентябрьоктябрь?ноябрь??декабрь?\")+7)/8,1))","v":0},null,null,{"$f":"MATCH($B13-1000000,$B13:$B$1000,-1)","v":{"$error":"#VALUE!"}},null,""]
[null,4,"Коммуникации",{"$f":"MAX(IFERROR(MATCH(\"*\",$B$1:$B14,-1),0),IFERROR(MATCH($B14+1000000,$B$1:$B14,1),0))","v":14},{"$f":"SUMIFS(Выписки!$C:$C,Выписки!$G:$G,INDEX($B:$B,MAX(IFERROR(MATCH(\"*\",$B$1:$B14,-1),0),IFERROR(MATCH($B14+1000000,$B$1:$B14,1),0))),Выписки!$H:$H,$C14,Выписки!$A:$A,\"<=\"&DATE(E$2,(SEARCH(D$2,\"январь??февраль?март????апрель??май?????июнь????июль????август??сентябрьоктябрь?ноябрь??декабрь?\")+7)/8+1,0),Выписки!$A:$A,\">=\"&DATE(E$2,(SEARCH(D$2,\"январь??февраль?март????апрель??май?????июнь????июль????август??сентябрьоктябрь?ноябрь??декабрь?\")+7)/8,1))-SUMIFS(Выписки!$B:$B,Выписки!$G:$G,INDEX($B:$B,MAX(IFERROR(MATCH(\"*\",$B$1:$B14,-1),0),IFERROR(MATCH($B14+1000000,$B$1:$B14,1),0))),Выписки!$H:$H,$C14,Выписки!$A:$A,\"<=\"&DATE(E$2,(SEARCH(D$2,\"январь??февраль?март????апрель??май?????июнь????июль????август??сентябрьоктябрь?ноябрь??декабрь?\")+7)/8+1,0),Выписки!$A:$A,\">=\"&DATE(E$2,(SEARCH(D$2,\"январь??февраль?март????апрель??май?????июнь????июль????август??сентябрьоктябрь?ноябрь??декабрь?\")+7)/8,1))","v":0},null,null,{"$f":"MATCH($B14-1000000,$B14:$B$1000,-1)","v":3},null,""]
[null,null,"Газстрой",{"$f":"MAX(IFERROR(MATCH(\"*\",$B$1:$B15,-1),0),IFERROR(MATCH($B15+1000000,$B$1:$B15,1),0))","v":14},{"$f":"SUMIFS(Выписки!$C:$C,Выписки!$G:$G,INDEX($B:$B,MAX(IFERROR(MATCH(\"*\",$B$1:$B15,-1),0),IFERROR(MATCH($B15+1000000,$B$1:$B15,1),0))),Выписки!$H:$H,$C15,Выписки!$A:$A,\"<=\"&DATE(E$2,(SEARCH(D$2,\"январь??февраль?март????апрель??май?????июнь????июль????август??сентябрьоктябрь?ноябрь??декабрь?\")+7)/8+1,0),Выписки!$A:$A,\">=\"&DATE(E$2,(SEARCH(D$2,\"январь??февраль?март????апрель??май?????июнь????июль????август??сентябрьоктябрь?ноябрь??декабрь?\")+7)/8,1))-SUMIFS(Выписки!$B:$B,Выписки!$G:$G,INDEX($B:$B,MAX(IFERROR(MATCH(\"*\",$B$1:$B15,-1),0),IFERROR(MATCH($B15+1000000,$B$1:$B15,1),0))),Выписки!$H:$H,$C15,Выписки!$A:$A,\"<=\"&DATE(E$2,(SEARCH(D$2,\"январь??февраль?март????апрель??май?????июнь????июль????август??сентябрьоктябрь?ноябрь??декабрь?\")+7)/8+1,0),Выписки!$A:$A,\">=\"&DATE(E$2,(SEARCH(D$2,\"январь??февраль?март????апрель??май?????июнь????июль????август??сентябрьоктябрь?ноябрь??декабрь?\")+7)/8,1))","v":0},null,null,{"$f":"MATCH($B15-1000000,$B15:$B$1000,-1)","v":2},null,""]
[null,5,"Очистные сооружения",{"$f":"MAX(IFERROR(MATCH(\"*\",$B$1:$B16,-1),0),IFERROR(MATCH($B16+1000000,$B$1:$B16,1),0))","v":16},{"$f":"SUMIFS(Выписки!$C:$C,Выписки!$G:$G,INDEX($B:$B,MAX(IFERROR(MATCH(\"*\",$B$1:$B16,-1),0),IFERROR(MATCH($B16+1000000,$B$1:$B16,1),0))),Выписки!$H:$H,$C16,Выписки!$A:$A,\"<=\"&DATE(E$2,(SEARCH(D$2,\"январь??февраль?март????апрель??май?????июнь????июль????август??сентябрьоктябрь?ноябрь??декабрь?\")+7)/8+1,0),Выписки!$A:$A,\">=\"&DATE(E$2,(SEARCH(D$2,\"январь??февраль?март????апрель??май?????июнь????июль????август??сентябрьоктябрь?ноябрь??декабрь?\")+7)/8,1))-SUMIFS(Выписки!$B:$B,Выписки!$G:$G,INDEX($B:$B,MAX(IFERROR(MATCH(\"*\",$B$1:$B16,-1),0),IFERROR(MATCH($B16+1000000,$B$1:$B16,1),0))),Выписки!$H:$H,$C16,Выписки!$A:$A,\"<=\"&DATE(E$2,(SEARCH(D$2,\"январь??февраль?март????апрель??май?????июнь????июль????август??сентябрьоктябрь?ноябрь??декабрь?\")+7)/8+1,0),Выписки!$A:$A,\">=\"&DATE(E$2,(SEARCH(D$2,\"январь??февраль?март????апрель??май?????июнь????июль????август??сентябрьоктябрь?ноябрь??декабрь?\")+7)/8,1))","v":0},null,null,{"$f":"MATCH($B16-1000000,$B16:$B$1000,-1)","v":1},null,""]
[null,null,"КомплектСтрой",{"$f":"MAX(IFERROR(MATCH(\"*\",$B$1:$B17,-1),0),IFERROR(MATCH($B17+1000000,$B$1:$B17,1),0))","v":16},{"$f":"SUMIFS(Выписки!$C:$C,Выписки!$G:$G,INDEX($B:$B,MAX(IFERROR(MATCH(\"*\",$B$1:$B17,-1),0),IFERROR(MATCH($B17+1000000,$B$1:$B17,1),0))),Выписки!$H:$H,$C17,Выписки!$A:$A,\"<=\"&DATE(E$2,(SEARCH(D$2,\"январь??февраль?март????апрель??май?????июнь????июль????август??сентябрьоктябрь?ноябрь??декабрь?\")+7)/8+1,0),Выписки!$A:$A,\">=\"&DATE(E$2,(SEARCH(D$2,\"январь??февраль?март????апрель??май?????июнь????июль????август??сентябрьоктябрь?ноябрь??декабрь?\")+7)/8,1))-SUMIFS(Выписки!$B:$B,Выписки!$G:$G,INDEX($B:$B,MAX(IFERROR(MATCH(\"*\",$B$1:$B17,-1),0),IFERROR(MATCH($B17+1000000,$B$1:$B17,1),0))),Выписки!$H:$H,$C17,Выписки!$A:$A,\"<=\"&DATE(E$2,(SEARCH(D$2,\"январь??февраль?март????апрель??май?????июнь????июль????август??сентябрьоктябрь?ноябрь??декабрь?\")+7)/8+1,0),Выписки!$A:$A,\">=\"&DATE(E$2,(SEARCH(D$2,\"январь??февраль?март????апрель??май?????июнь????июль????август??сентябрьоктябрь?ноябрь??декабрь?\")+7)/8,1))","v":0},null,null,null,null,""]
[null,null,null,null,null,null,null,null,null,""]
[null,null,null,null,null,null,null,null,null,""]
[null,null,null,null,null,null,null,null,null,""]

{"sheet":"Выписки","index":1,"n_rows":11,"n_cols":8,"rows_kept":11,"cut":false,"hidden":false,"merged":[]}
["Дата","Приход","Расход","Назначение","Разделы","Статьи","Номер статьи","Договор"]
[]
[]
[]
["Дата","Приход","Расход","Назначение","Разделы","Статьи","Номер статьи","Договор"]
["2016-03-31",null,1000,"Оплата интернет","АУР","Интернет",2,"Билайн"]
["2016-05-02",10000,null,"По договору займа от 01.04.15","Поступления","Займ от Леруа",1,"Леруа"]
["2016-05-15",null,5000,"За проектирование временного съезда","Проектирование","Дороги",3,"Проектировщик"]
["2016-05-29",null,10000,"За прокладку газопровода","Строительство","Коммуникации",4,"Леруа"]
["2016-06-02",null,13000,"СМР очистные сооружения","Строительство","Очистные сооружения",5,"КомплектСтрой"]
["2016-06-15",null,7000,"За проектирование временного съезда","Проектирование","Дороги",3,"Проектировщик"]

{"sheet":"Лист3","index":2,"n_rows":171,"n_cols":7,"rows_kept":171,"cut":false,"hidden":false,"merged":[[163,1,163,3],[3,1,3,3],[2,0,2,3],[16,1,16,3],[17,2,17,3],[38,2,38,3],[61,2,61,3],[75,2,75,3],[90,2,90,3],[110,1,110,3],[134,1,134,3]]}
[]
[]
["3. ПРОЕКТНЫЕ РАБОТЫ"]
[null,"3.1. ИЗЫСКАНИЯ",null,null,null,"3.2. ПРОЕКТИРОВАНИЕ КОММУНИКАЦИЙ"]
[null,null,3011,"          Инженерно-геологические изыскания",null,null,{"$f":"OFFSET($A$1,MATCH($H$7,$A:$A,0)-1,1,COUNTIF($A:$A,$H$7),1)","v":{"$error":"#N/A"}}]
[null,null,3012,"          Инженерно-геодезические изыскания"]
[null,null,null,"* Заключенные договоры:"]
[null,null,null,"            ГЕО Инжиниринг № 163-/15 БЕЗ НДС",null,null,{"$f":"OFFSET($B$1,MATCH($F$4,$B:$B,0),1,MATCH(1,INDEX(1-ISBLANK(INDEX($B:$B,MATCH($F$4,$B:$B,0)+1):INDEX($B:$B,MAX(IFERROR(MATCH(\"*\",$B:$B,-1),0),IFERROR(MATCH(1000000,$B:$B,1),0)))),0,1),0)-1,1)","v":"3.2.1. Проектирование Электроснабжения"}]
[null,null,null,"* Остаток по статье: "]
[null,null,3013,"          Археологические изыскания",null,null,{"$f":"MATCH(1,INDEX(1-ISBLANK(C5:C16),1,0),0)","v":1}]
[null,null,3014,"          Исследования участка на наличие ВОП"]
[null,null,null,"* Заключенные договоры:"]
[]
[null,null,null,"            Центр Инженерных Изысканий \"Импуль-М\" № 07-07/15 от 07.07.2015 г. БЕЗ НДС",null,null,{"$f":"INDEX($B:$B,MATCH($F$4,$B:$B,0))","v":"3.2. ПРОЕКТИРОВАНИЕ КОММУНИКАЦИЙ"}]
[null,null,null,"* Остаток по статье: "]
[]
[null,"3.2. ПРОЕКТИРОВАНИЕ КОММУНИКАЦИЙ"]
[null,null,"3.2.1. Проектирование Электроснабжения"]
[null,null,3021,"Проектирование временного электроснабжения 100 кВт",null,null,{"$f":"MATCH(1,INDEX(1-ISBLANK(INDEX($B:$B,MATCH($F$4,$B:$B,0)+1):$B$10000),0,1),0)-1","v":93}]
[null,null,3022,"Проектирование временного электроснабжения 500 кВт "]
[null,null,3023,"Проектирование внутриплощадочных кабельных линий (для снабжения очистных, котельной, водозабора, ШРП, наружное освещение) стадия П (освещение)"]
[null,null,null,"* Заключенные договоры:",null,{"$f":"СцепитьМного(OFFSET($B$1,MATCH($F$4,$B:$B,0),1,MATCH(1,INDEX(1-ISBLANK(INDEX($B:$B,MATCH($F$4,$B:$B,0)+1):INDEX($B:$B,MAX(IFERROR(MATCH(\"*\",$B:$B,-1),0),IFERROR(MATCH(1000000,$B:$B,1),0)))),0,1),0)-1,1),\":\",1)","v":"3.2.1. Проектирование Электроснабжения:3021:3022:3023:3024:3025:3026:3.2.2. Проектирование Теплоснабжения:3031:3032:3033:3034:3035:3.2.3. Проектирование Водоснабжения:3041:3042:3043:3.2.4. Проектирование Водоотведения:3051:3052:3053:3.2.5. Проектирование Дорог. Временные примыкания. Поворотный съезд.:3061:3062:3063:3064"}]
[null,null,null,"            СТ строй Проект (ДС № 1 от 05.09.2015 г. К договору 206-2015 от 15.07.2015 г.) распределен на 4 статьи БЕЗ НДС",null,{"$f":"СцепитьМного(B:B,\";\",1)","v":"3.1. ИЗЫСКАНИЯ;3.2. ПРОЕКТИРОВАНИЕ КОММУНИКАЦИЙ;3.3. ОСТАЛЬНЫЕ ПРОЕКТНЫЕ РАБОТЫ;3.4. СОГЛАСОВАНИЯ, ПРОЧАЯ ИРД;3.5. Непредвиденные расходы на проектирование "}]
[null,null,null,"* Остаток по статье: "]
[null,null,3024,"Рабочее проектирование сетей Электроснабжения (стария Р)"]
[null,null,null,"* Заключенные договоры:"]
[null,null,null,"            Экрос с БМ дог № 16-12/15.  В т.ч. НДС (13 728,81 р.)"]
[null,null,null,"            В т.ч. НДС  Экрос договор № 16-12/15.  (13 728,81 р.)"]
[null,null,null,"* Остаток по статье: "]
[null,null,3025,"Рабочее проектирование сетей  Электроснабжения до LM"]
[null,null,null,"* Заключенные договоры:"]
[null,null,null,"            Экрос с БХ  № 18-02/16. В т.ч. НДС  11 440,68 р."]
[null,null,null,"            В т.ч. НДС  Экрос договор № 16-12/15.  (11 440,68 р.)"]
[null,null,null,"* Остаток по статье: "]
[null,null,3026,"Проектирование основной схемы электроснабжения"]
[null,null,null,"* Планируется заключить договор"]
[null,null,null,"* Остаток по статье: "]
[]
[null,null,"3.2.2. Проектирование Теплоснабжения"]
[null,null,3031,"         Проект газопровода высокого давления с ШРП"]
[null,null,null,"* Заключенные договоры:"]
[null,null,null,"            Спецэнергопроект № 15/07-14  БЕЗ НДС"]
[null,null,null,"* Остаток по статье: "]
[null,null,3032,"          Проект газовой котельной"]
[null,null,null,"* Заключенные договоры:"]
[null,null,null,"            Спецэнергопроект № 15/07-14К  БЕЗ НДС"]
[null,null,null,"            КалининградТеплоГазПроект  №16/09-15 БЕЗ НДС"]
[null,null,null,"* Остаток по статье: "]
[null,null,3033,"          Проект газопровода среднего давления"]
[null,null,null,"* Заключенные договоры:"]
[null,null,null,"            Энергия № 01-07/15 БЕЗ НДС"]
[null,null,null,"* Остаток по статье: "]
[null,null,3034,"          Проект трассы теплоснабжения для LM и Проект теплокамеры с учетом перспективного развития (Стадия П)"]
[null,null,null,"* Заключенные договоры:"]
[null,null,null,"            СТ строй Проект (ДС № 1 от 05.09.2015 г. К договору 206-2015 от 15.07.2015 г.) распределен на 4 статьи БЕЗ НДС"]
[null,null,null,"* Остаток по статье: "]
[null,null,3035,"Рабочее проектирование трассы Теплоснабжения для LM и теплокамеры"]
[null,null,null,"* Заключенные договоры:"]
[null,null,null,"            Калининградтеплогазпроект №12/02-16   БЕЗ НДС"]
[null,null,null,"* Остаток по статье: "]
[]
[null,null,"3.2.3. Проектирование Водоснабжения"]
[null,null,3041,"          Проектирование водозабора со станцией водоподготовки, бурение артезианских скважин и оборудование водозабора, строительство сооружений водозабора, благоустройство и ограждение территории строгого режима (площадка 3 скв.), гидрогеологические изыскания, лицензия на недропользование"]
[null,null,null,"* Заключенные договоры:"]
[null,null,null,"            Калининградская Строительная Экспертиза и Балтводопроект 39 (ДС № 1 от 19.07.2015 г. к догоовру № 10/04-15 от 10.04.2015) БЕЗ НДС"]
[null,null,null,"* Остаток по статье: "]
[null,null,3042,"          Проектирование внутриплощадочных сетей водоснабжения (для снабжения очистных, станции водоподготовки, емкостей запаса чистой воды)"]
[null,null,null,"* Заключенные договоры:"]
[null,null,null,"            СТ строй Проект (ДС № 1 от 05.09.2015 г. К договору 206-2015 от 15.07.2015 г.) распределен на 4 статьи БЕЗ НДС"]
[null,null,null,"* Остаток по статье: "]
[null,null,3043,"Рабочее проектирование сетей Водоснабжения (для LM, для снабжения очистных, станции водоподготовки, емкостей запаса чистой воды)"]
[null,null,null,"* Заключенные договоры:"]
[null,null,null,"            Севзапнедра УФК по Санкт-Петербургу (\"госпошлина\" БЕЗ НДС)"]
[null,null,null,"* Остаток по статье: "]
[]
[null,null,"3.2.4. Проектирование Водоотведения"]
[null,null,3051,"          Проект локальных очистных сооружений с коллектором водосброса"]
[null,null,null,"* Заключенные договоры:"]
[null,null,null,"            Калининградская Строительная Экспертиза № 16/07-14  ДОС (БЕЗ НДС)"]
[null,null,null,"            Калининградская Строительная Экспертиза № 16/07-14 МК  (БЕЗ НДС)"]
{"$rows_left_out":91}