{"text_format":"1","workbook":"xlsx","n_sheets":3,"sheets":["Бюджет","Выписки","Справочник статей"],"not_rendered":{"charts":0,"images":0,"macros":1,"external_links":0,"defined_names":6,"comments":0,"pivot_tables":0},"unopened":[],"bounds":{"document_bytes":16777216,"sheet_cells":100000,"rows_first":2000,"rows_last":500,"rows_between":2000,"halvings":0,"cell_chars":16384,"cell_head_chars":4096},"cells_cut":0,"cells_raw":0,"read":"whole","date_system":"1900"}

{"sheet":"Бюджет","index":0,"n_rows":39,"n_cols":7,"rows_kept":39,"cut":false,"hidden":false,"merged":[[17,1,17,3],[18,2,18,3],[0,0,2,1],[0,2,2,2],[0,4,0,6],[0,3,2,3],[3,0,3,3],[4,1,4,3]]}
[null,null,"№ Статьи","Статьи и договора","Период"]
[null,null,null,null,"Май",2016]
[null,null,null,null,"План","Факт","Отклонение"]
["3. ПРОЕКТНЫЕ РАБОТЫ"]
[null,"3.1. ИЗЫСКАНИЯ"]
[null,null,3011,"          Инженерно-геологические изыскания"]
[null,null,3012,"          Инженерно-геодезические изыскания"]
[null,null,null,"* Заключенные договоры:",null,{"$f":"SUMIFS(Выписки!$C:$C,Выписки!$H:$H,INDEX($C:$C,MAX(IFERROR(MATCH(\"*\",$C$1:$C8,-1),0),IFERROR(MATCH(2E+307,$C$1:$C8,1),0))),Выписки!$I:$I,$D8,Выписки!$A:$A,\"<=\"&DATE(F$2,(SEARCH(E$2,\"январь??февраль?март????апрель??май?????июнь????июль????август??сентябрьоктябрь?ноябрь??декабрь?\")+7)/8+1,0),Выписки!$A:$A,\">=\"&DATE(F$2,(SEARCH(E$2,\"январь??февраль?март????апрель??май?????июнь????июль????август??сентябрьоктябрь?ноябрь??декабрь?\")+7)/8,1))-SUMIFS(Выписки!$B:$B,Выписки!$H:$H,INDEX($C:$C,MAX(IFERROR(MATCH(\"*\",$C$1:$C8,-1),0),IFERROR(MATCH(2E+307,$C$1:$C8,1),0))),Выписки!$I:$I,$D8,Выписки!$A:$A,\"<=\"&DATE(F$2,(SEARCH(E$2,\"январь??февраль?март????апрель??май?????июнь????июль????август??сентябрьоктябрь?ноябрь??декабрь?\")+7)/8+1,0),Выписки!$A:$A,\">=\"&DATE(F$2,(SEARCH(E$2,\"январь??февраль?март????апрель??май?????июнь????июль????август??сентябрьоктябрь?ноябрь??декабрь?\")+7)/8,1))","v":0}]
[null,null,null,"            ГЕО Инжиниринг № 163-/15 БЕЗ НДС",null,{"$f":"SUMIFS(Выписки!$C:$C,Выписки!$H:$H,INDEX($C:$C,MAX(IFERROR(MATCH(\"*\",$C$1:$C9,-1),0),IFERROR(MATCH(2E+307,$C$1:$C9,1),0))),Выписки!$I:$I,$D9,Выписки!$A:$A,\"<=\"&DATE(F$2,(SEARCH(E$2,\"январь??февраль?март????апрель??май?????июнь????июль????август??сентябрьоктябрь?ноябрь??декабрь?\")+7)/8+1,0),Выписки!$A:$A,\">=\"&DATE(F$2,(SEARCH(E$2,\"январь??февраль?март????апрель??май?????июнь????июль????август??сентябрьоктябрь?ноябрь??декабрь?\")+7)/8,1))-SUMIFS(Выписки!$B:$B,Выписки!$H:$H,INDEX($C:$C,MAX(IFERROR(MATCH(\"*\",$C$1:$C9,-1),0),IFERROR(MATCH(2E+307,$C$1:$C9,1),0))),Выписки!$I:$I,$D9,Выписки!$A:$A,\"<=\"&DATE(F$2,(SEARCH(E$2,\"январь??февраль?март????апрель??май?????июнь????июль????август??сентябрьоктябрь?ноябрь??декабрь?\")+7)/8+1,0),Выписки!$A:$A,\">=\"&DATE(F$2,(SEARCH(E$2,\"январь??февраль?март????апрель??май?????июнь????июль????август??сентябрьоктябрь?ноябрь??декабрь?\")+7)/8,1))","v":0}]
[null,null,null,"* Остаток по статье: ",null,{"$f":"SUMIFS(Выписки!$C:$C,Выписки!$H:$H,INDEX($C:$C,MAX(IFERROR(MATCH(\"*\",$C$1:$C10,-1),0),IFERROR(MATCH(2E+307,$C$1:$C10,1),0))),Выписки!$I:$I,$D10,Выписки!$A:$A,\"<=\"&DATE(F$2,(SEARCH(E$2,\"январь??февраль?март????апрель??май?????июнь????июль????август??сентябрьоктябрь?ноябрь??декабрь?\")+7)/8+1,0),Выписки!$A:$A,\">=\"&DATE(F$2,(SEARCH(E$2,\"январь??февраль?март????апрель??май?????июнь????июль????август??сентябрьоктябрь?ноябрь??декабрь?\")+7)/8,1))-SUMIFS(Выписки!$B:$B,Выписки!$H:$H,INDEX($C:$C,MAX(IFERROR(MATCH(\"*\",$C$1:$C10,-1),0),IFERROR(MATCH(2E+307,$C$1:$C10,1),0))),Выписки!$I:$I,$D10,Выписки!$A:$A,\"<=\"&DATE(F$2,(SEARCH(E$2,\"январь??февраль?март????апрель??май?????июнь????июль????август??сентябрьоктябрь?ноябрь??декабрь?\")+7)/8+1,0),Выписки!$A:$A,\">=\"&DATE(F$2,(SEARCH(E$2,\"январь??февраль?март????апрель??май?????июнь????июль????август??сентябрьоктябрь?ноябрь??декабрь?\")+7)/8,1))","v":0}]
[null,null,3013,"          Археологические изыскания"]
[null,null,3014,"          Исследования участка на наличие ВОП"]
[null,null,null,"* Заключенные договоры:",null,{"$f":"SUMIFS(Выписки!$C:$C,Выписки!$H:$H,INDEX($C:$C,MAX(IFERROR(MATCH(\"*\",$C$1:$C13,-1),0),IFERROR(MATCH(2E+307,$C$1:$C13,1),0))),Выписки!$I:$I,$D13,Выписки!$A:$A,\"<=\"&DATE(F$2,(SEARCH(E$2,\"январь??февраль?март????апрель??май?????июнь????июль????август??сентябрьоктябрь?ноябрь??декабрь?\")+7)/8+1,0),Выписки!$A:$A,\">=\"&DATE(F$2,(SEARCH(E$2,\"январь??февраль?март????апрель??май?????июнь????июль????август??сентябрьоктябрь?ноябрь??декабрь?\")+7)/8,1))-SUMIFS(Выписки!$B:$B,Выписки!$H:$H,INDEX($C:$C,MAX(IFERROR(MATCH(\"*\",$C$1:$C13,-1),0),IFERROR(MATCH(2E+307,$C$1:$C13,1),0))),Выписки!$I:$I,$D13,Выписки!$A:$A,\"<=\"&DATE(F$2,(SEARCH(E$2,\"январь??февраль?март????апрель??май?????июнь????июль????август??сентябрьоктябрь?ноябрь??декабрь?\")+7)/8+1,0),Выписки!$A:$A,\">=\"&DATE(F$2,(SEARCH(E$2,\"январь??февраль?март????апрель??май?????июнь????июль????август??сентябрьоктябрь?ноябрь??декабрь?\")+7)/8,1))","v":0}]
[null,null,null,null,null,{"$f":"SUMIFS(Выписки!$C:$C,Выписки!$H:$H,INDEX($C:$C,MAX(IFERROR(MATCH(\"*\",$C$1:$C14,-1),0),IFERROR(MATCH(2E+307,$C$1:$C14,1),0))),Выписки!$I:$I,$D14,Выписки!$A:$A,\"<=\"&DATE(F$2,(SEARCH(E$2,\"январь??февраль?март????апрель??май?????июнь????июль????август??сентябрьоктябрь?ноябрь??декабрь?\")+7)/8+1,0),Выписки!$A:$A,\">=\"&DATE(F$2,(SEARCH(E$2,\"январь??февраль?март????апрель??май?????июнь????июль????август??сентябрьоктябрь?ноябрь??декабрь?\")+7)/8,1))-SUMIFS(Выписки!$B:$B,Выписки!$H:$H,INDEX($C:$C,MAX(IFERROR(MATCH(\"*\",$C$1:$C14,-1),0),IFERROR(MATCH(2E+307,$C$1:$C14,1),0))),Выписки!$I:$I,$D14,Выписки!$A:$A,\"<=\"&DATE(F$2,(SEARCH(E$2,\"январь??февраль?март????апрель??май?????июнь????июль????август??сентябрьоктябрь?ноябрь??декабрь?\")+7)/8+1,0),Выписки!$A:$A,\">=\"&DATE(F$2,(SEARCH(E$2,\"январь??февраль?март????апрель??май?????июнь????июль????август??сентябрьоктябрь?ноябрь??декабрь?\")+7)/8,1))","v":0}]
[null,null,null,"            Центр Инженерных Изысканий \"Импуль-М\" № 07-07/15 от 07.07.2015 г. БЕЗ НДС",null,{"$f":"SUMIFS(Выписки!$C:$C,Выписки!$H:$H,INDEX($C:$C,MAX(IFERROR(MATCH(\"*\",$C$1:$C15,-1),0),IFERROR(MATCH(2E+307,$C$1:$C15,1),0))),Выписки!$I:$I,$D15,Выписки!$A:$A,\"<=\"&DATE(F$2,(SEARCH(E$2,\"январь??февраль?март????апрель??май?????июнь????июль????август??сентябрьоктябрь?ноябрь??декабрь?\")+7)/8+1,0),Выписки!$A:$A,\">=\"&DATE(F$2,(SEARCH(E$2,\"январь??февраль?март????апрель??май?????июнь????июль????август??сентябрьоктябрь?ноябрь??декабрь?\")+7)/8,1))-SUMIFS(Выписки!$B:$B,Выписки!$H:$H,INDEX($C:$C,MAX(IFERROR(MATCH(\"*\",$C$1:$C15,-1),0),IFERROR(MATCH(2E+307,$C$1:$C15,1),0))),Выписки!$I:$I,$D15,Выписки!$A:$A,\"<=\"&DATE(F$2,(SEARCH(E$2,\"январь??февраль?март????апрель??май?????июнь????июль????август??сентябрьоктябрь?ноябрь??декабрь?\")+7)/8+1,0),Выписки!$A:$A,\">=\"&DATE(F$2,(SEARCH(E$2,\"январь??февраль?март????апрель??май?????июнь????июль????август??сентябрьоктябрь?ноябрь??декабрь?\")+7)/8,1))","v":10000}]
[null,null,null,"* Остаток по статье: ",null,{"$f":"SUMIFS(Выписки!$C:$C,Выписки!$H:$H,INDEX($C:$C,MAX(IFERROR(MATCH(\"*\",$C$1:$C16,-1),0),IFERROR(MATCH(2E+307,$C$1:$C16,1),0))),Выписки!$I:$I,$D16,Выписки!$A:$A,\"<=\"&DATE(F$2,(SEARCH(E$2,\"январь??февраль?март????апрель??май?????июнь????июль????август??сентябрьоктябрь?ноябрь??декабрь?\")+7)/8+1,0),Выписки!$A:$A,\">=\"&DATE(F$2,(SEARCH(E$2,\"январь??февраль?март????апрель??май?????июнь????июль????август??сентябрьоктябрь?ноябрь??декабрь?\")+7)/8,1))-SUMIFS(Выписки!$B:$B,Выписки!$H:$H,INDEX($C:$C,MAX(IFERROR(MATCH(\"*\",$C$1:$C16,-1),0),IFERROR(MATCH(2E+307,$C$1:$C16,1),0))),Выписки!$I:$I,$D16,Выписки!$A:$A,\"<=\"&DATE(F$2,(SEARCH(E$2,\"январь??февраль?март????апрель??май?????июнь????июль????август??сентябрьоктябрь?ноябрь??декабрь?\")+7)/8+1,0),Выписки!$A:$A,\">=\"&DATE(F$2,(SEARCH(E$2,\"январь??февраль?март????апрель??май?????июнь????июль????август??сентябрьоктябрь?ноябрь??декабрь?\")+7)/8,1))","v":0}]
[null,null,null,null,null,{"$f":"SUMIFS(Выписки!$C:$C,Выписки!$H:$H,INDEX($C:$C,MAX(IFERROR(MATCH(\"*\",$C$1:$C17,-1),0),IFERROR(MATCH(2E+307,$C$1:$C17,1),0))),Выписки!$I:$I,$D17,Выписки!$A:$A,\"<=\"&DATE(F$2,(SEARCH(E$2,\"январь??февраль?март????апрель??май?????июнь????июль????август??сентябрьоктябрь?ноябрь??декабрь?\")+7)/8+1,0),Выписки!$A:$A,\">=\"&DATE(F$2,(SEARCH(E$2,\"январь??февраль?март????апрель??май?????июнь????июль????август??сентябрьоктябрь?ноябрь??декабрь?\")+7)/8,1))-SUMIFS(Выписки!$B:$B,Выписки!$H:$H,INDEX($C:$C,MAX(IFERROR(MATCH(\"*\",$C$1:$C17,-1),0),IFERROR(MATCH(2E+307,$C$1:$C17,1),0))),Выписки!$I:$I,$D17,Выписки!$A:$A,\"<=\"&DATE(F$2,(SEARCH(E$2,\"январь??февраль?март????апрель??май?????июнь????июль????август??сентябрьоктябрь?ноябрь??декабрь?\")+7)/8+1,0),Выписки!$A:$A,\">=\"&DATE(F$2,(SEARCH(E$2,\"январь??февраль?март????апрель??май?????июнь????июль????август??сентябрьоктябрь?ноябрь??декабрь?\")+7)/8,1))","v":0}]
[null,"3.2. ПРОЕКТИРОВАНИЕ КОММУНИКАЦИЙ"]
[null,null,"3.2.1. Проектирование Электроснабжения"]
[null,null,3021,"Проектирование временного электроснабжения 100 кВт"]
[null,null,3022,"Проектирование временного электроснабжения 500 кВт "]
[null,null,3023,"Проектирование внутриплощадочных кабельных линий (для снабжения очистных, котельной, водозабора, ШРП, наружное освещение) стадия П (освещение)"]
[null,null,null,"* Заключенные договоры:",null,{"$f":"SUMIFS(Выписки!$C:$C,Выписки!$H:$H,INDEX($C:$C,MAX(IFERROR(MATCH(\"*\",$C$1:$C23,-1),0),IFERROR(MATCH(2E+307,$C$1:$C23,1),0))),Выписки!$I:$I,$D23,Выписки!$A:$A,\"<=\"&DATE(F$2,(SEARCH(E$2,\"январь??февраль?март????апрель??май?????июнь????июль????август??сентябрьоктябрь?ноябрь??декабрь?\")+7)/8+1,0),Выписки!$A:$A,\">=\"&DATE(F$2,(SEARCH(E$2,\"январь??февраль?март????апрель??май?????июнь????июль????август??сентябрьоктябрь?ноябрь??декабрь?\")+7)/8,1))-SUMIFS(Выписки!$B:$B,Выписки!$H:$H,INDEX($C:$C,MAX(IFERROR(MATCH(\"*\",$C$1:$C23,-1),0),IFERROR(MATCH(2E+307,$C$1:$C23,1),0))),Выписки!$I:$I,$D23,Выписки!$A:$A,\"<=\"&DATE(F$2,(SEARCH(E$2,\"январь??февраль?март????апрель??май?????июнь????июль????август??сентябрьоктябрь?ноябрь??декабрь?\")+7)/8+1,0),Выписки!$A:$A,\">=\"&DATE(F$2,(SEARCH(E$2,\"январь??февраль?март????апрель??май?????июнь????июль????август??сентябрьоктябрь?ноябрь??декабрь?\")+7)/8,1))","v":0}]
[null,null,null,"            СТ строй Проект (ДС № 1 от 05.09.2015 г. К договору 206-2015 от 15.07.2015 г.) распределен на 4 статьи БЕЗ НДС",null,{"$f":"SUMIFS(Выписки!$C:$C,Выписки!$H:$H,INDEX($C:$C,MAX(IFERROR(MATCH(\"*\",$C$1:$C24,-1),0),IFERROR(MATCH(2E+307,$C$1:$C24,1),0))),Выписки!$I:$I,$D24,Выписки!$A:$A,\"<=\"&DATE(F$2,(SEARCH(E$2,\"январь??февраль?март????апрель??май?????июнь????июль????август??сентябрьоктябрь?ноябрь??декабрь?\")+7)/8+1,0),Выписки!$A:$A,\">=\"&DATE(F$2,(SEARCH(E$2,\"январь??февраль?март????апрель??май?????июнь????июль????август??сентябрьоктябрь?ноябрь??декабрь?\")+7)/8,1))-SUMIFS(Выписки!$B:$B,Выписки!$H:$H,INDEX($C:$C,MAX(IFERROR(MATCH(\"*\",$C$1:$C24,-1),0),IFERROR(MATCH(2E+307,$C$1:$C24,1),0))),Выписки!$I:$I,$D24,Выписки!$A:$A,\"<=\"&DATE(F$2,(SEARCH(E$2,\"январь??февраль?март????апрель??май?????июнь????июль????август??сентябрьоктябрь?ноябрь??декабрь?\")+7)/8+1,0),Выписки!$A:$A,\">=\"&DATE(F$2,(SEARCH(E$2,\"январь??февраль?март????апрель??май?????июнь????июль????август??сентябрьоктябрь?ноябрь??декабрь?\")+7)/8,1))","v":0}]
[null,null,null,"* Остаток по статье: ",null,{"$f":"SUMIFS(Выписки!$C:$C,Выписки!$H:$H,INDEX($C:$C,MAX(IFERROR(MATCH(\"*\",$C$1:$C25,-1),0),IFERROR(MATCH(2E+307,$C$1:$C25,1),0))),Выписки!$I:$I,$D25,Выписки!$A:$A,\"<=\"&DATE(F$2,(SEARCH(E$2,\"январь??февраль?март????апрель??май?????июнь????июль????август??сентябрьоктябрь?ноябрь??декабрь?\")+7)/8+1,0),Выписки!$A:$A,\">=\"&DATE(F$2,(SEARCH(E$2,\"январь??февраль?март????апрель??май?????июнь????июль????август??сентябрьоктябрь?ноябрь??декабрь?\")+7)/8,1))-SUMIFS(Выписки!$B:$B,Выписки!$H:$H,INDEX($C:$C,MAX(IFERROR(MATCH(\"*\",$C$1:$C25,-1),0),IFERROR(MATCH(2E+307,$C$1:$C25,1),0))),Выписки!$I:$I,$D25,Выписки!$A:$A,\"<=\"&DATE(F$2,(SEARCH(E$2,\"январь??февраль?март????апрель??май?????июнь????июль????август??сентябрьоктябрь?ноябрь??декабрь?\")+7)/8+1,0),Выписки!$A:$A,\">=\"&DATE(F$2,(SEARCH(E$2,\"январь??февраль?март????апрель??май?????июнь????июль????август??сентябрьоктябрь?ноябрь??декабрь?\")+7)/8,1))","v":0}]
[null,null,3024,"Рабочее проектирование сетей Электроснабжения (стария Р)"]
[null,null,null,"* Заключенные договоры:",null,{"$f":"SUMIFS(Выписки!$C:$C,Выписки!$H:$H,INDEX($C:$C,MAX(IFERROR(MATCH(\"*\",$C$1:$C27,-1),0),IFERROR(MATCH(2E+307,$C$1:$C27,1),0))),Выписки!$I:$I,$D27,Выписки!$A:$A,\"<=\"&DATE(F$2,(SEARCH(E$2,\"январь??февраль?март????апрель??май?????июнь????июль????август??сентябрьоктябрь?ноябрь??декабрь?\")+7)/8+1,0),Выписки!$A:$A,\">=\"&DATE(F$2,(SEARCH(E$2,\"январь??февраль?март????апрель??май?????июнь????июль????август??сентябрьоктябрь?ноябрь??декабрь?\")+7)/8,1))-SUMIFS(Выписки!$B:$B,Выписки!$H:$H,INDEX($C:$C,MAX(IFERROR(MATCH(\"*\",$C$1:$C27,-1),0),IFERROR(MATCH(2E+307,$C$1:$C27,1),0))),Выписки!$I:$I,$D27,Выписки!$A:$A,\"<=\"&DATE(F$2,(SEARCH(E$2,\"январь??февраль?март????апрель??май?????июнь????июль????август??сентябрьоктябрь?ноябрь??декабрь?\")+7)/8+1,0),Выписки!$A:$A,\">=\"&DATE(F$2,(SEARCH(E$2,\"январь??февраль?март????апрель??май?????июнь????июль????август??сентябрьоктябрь?ноябрь??декабрь?\")+7)/8,1))","v":0}]
[null,null,null,"            Экрос с БМ дог № 16-12/15.  В т.ч. НДС (13 728,81 р.)",null,{"$f":"SUMIFS(Выписки!$C:$C,Выписки!$H:$H,INDEX($C:$C,MAX(IFERROR(MATCH(\"*\",$C$1:$C28,-1),0),IFERROR(MATCH(2E+307,$C$1:$C28,1),0))),Выписки!$I:$I,$D28,Выписки!$A:$A,\"<=\"&DATE(F$2,(SEARCH(E$2,\"январь??февраль?март????апрель??май?????июнь????июль????август??сентябрьоктябрь?ноябрь??декабрь?\")+7)/8+1,0),Выписки!$A:$A,\">=\"&DATE(F$2,(SEARCH(E$2,\"январь??февраль?март????апрель??май?????июнь????июль????август??сентябрьоктябрь?ноябрь??декабрь?\")+7)/8,1))-SUMIFS(Выписки!$B:$B,Выписки!$H:$H,INDEX($C:$C,MAX(IFERROR(MATCH(\"*\",$C$1:$C28,-1),0),IFERROR(MATCH(2E+307,$C$1:$C28,1),0))),Выписки!$I:$I,$D28,Выписки!$A:$A,\"<=\"&DATE(F$2,(SEARCH(E$2,\"январь??февраль?март????апрель??май?????июнь????июль????август??сентябрьоктябрь?ноябрь??декабрь?\")+7)/8+1,0),Выписки!$A:$A,\">=\"&DATE(F$2,(SEARCH(E$2,\"январь??февраль?март????апрель??май?????июнь????июль????август??сентябрьоктябрь?ноябрь??декабрь?\")+7)/8,1))","v":5000}]
[null,null,null,"            В т.ч. НДС  Экрос договор № 16-12/15.  (13 728,81 р.)",null,{"$f":"SUMIFS(Выписки!$C:$C,Выписки!$H:$H,INDEX($C:$C,MAX(IFERROR(MATCH(\"*\",$C$1:$C29,-1),0),IFERROR(MATCH(2E+307,$C$1:$C29,1),0))),Выписки!$I:$I,$D29,Выписки!$A:$A,\"<=\"&DATE(F$2,(SEARCH(E$2,\"январь??февраль?март????апрель??май?????июнь????июль????август??сентябрьоктябрь?ноябрь??декабрь?\")+7)/8+1,0),Выписки!$A:$A,\">=\"&DATE(F$2,(SEARCH(E$2,\"январь??февраль?март????апрель??май?????июнь????июль????август??сентябрьоктябрь?ноябрь??декабрь?\")+7)/8,1))-SUMIFS(Выписки!$B:$B,Выписки!$H:$H,INDEX($C:$C,MAX(IFERROR(MATCH(\"*\",$C$1:$C29,-1),0),IFERROR(MATCH(2E+307,$C$1:$C29,1),0))),Выписки!$I:$I,$D29,Выписки!$A:$A,\"<=\"&DATE(F$2,(SEARCH(E$2,\"январь??февраль?март????апрель??май?????июнь????июль????август??сентябрьоктябрь?ноябрь??декабрь?\")+7)/8+1,0),Выписки!$A:$A,\">=\"&DATE(F$2,(SEARCH(E$2,\"январь??февраль?март????апрель??май?????июнь????июль????август??сентябрьоктябрь?ноябрь??декабрь?\")+7)/8,1))","v":0}]
[null,null,null,"* Остаток по статье: ",null,{"$f":"SUMIFS(Выписки!$C:$C,Выписки!$H:$H,INDEX($C:$C,MAX(IFERROR(MATCH(\"*\",$C$1:$C30,-1),0),IFERROR(MATCH(2E+307,$C$1:$C30,1),0))),Выписки!$I:$I,$D30,Выписки!$A:$A,\"<=\"&DATE(F$2,(SEARCH(E$2,\"январь??февраль?март????апрель??май?????июнь????июль????август??сентябрьоктябрь?ноябрь??декабрь?\")+7)/8+1,0),Выписки!$A:$A,\">=\"&DATE(F$2,(SEARCH(E$2,\"январь??февраль?март????апрель??май?????июнь????июль????август??сентябрьоктябрь?ноябрь??декабрь?\")+7)/8,1))-SUMIFS(Выписки!$B:$B,Выписки!$H:$H,INDEX($C:$C,MAX(IFERROR(MATCH(\"*\",$C$1:$C30,-1),0),IFERROR(MATCH(2E+307,$C$1:$C30,1),0))),Выписки!$I:$I,$D30,Выписки!$A:$A,\"<=\"&DATE(F$2,(SEARCH(E$2,\"январь??февраль?март????апрель??май?????июнь????июль????август??сентябрьоктябрь?ноябрь??декабрь?\")+7)/8+1,0),Выписки!$A:$A,\">=\"&DATE(F$2,(SEARCH(E$2,\"январь??февраль?март????апрель??май?????июнь????июль????август??сентябрьоктябрь?ноябрь??декабрь?\")+7)/8,1))","v":0}]
{"$rows_left_out":10}
{"sheet":"Выписки","index":1,"n_rows":11,"n_cols":9,"rows_kept":11,"cut":false,"hidden":false,"merged":[]}
["Дата","Приход","Расход","Назначение","Разделы","Подразделы","Статьи","Номер статьи","Договор"]
[]
[]
[]
["Дата","Приход","Расход","Назначение","Разделы","Подразделы","Статьи","Номер статьи","Договор"]
["2016-03-31",null,1000,null,"3. ПРОЕКТНЫЕ РАБОТЫ","3.1. ИЗЫСКАНИЯ","          Инженерно-геодезические изыскания",{"$f":"IF(ISERROR(INDEX('Справочник статей'!$C:$C,MATCH($G6,'Справочник статей'!$D:$D,0))),\"\",INDEX('Справочник статей'!$C:$C,MATCH($G6,'Справочник статей'!$D:$D,0)))","v":3012},"            ГЕО Инжиниринг № 163-/15 БЕЗ НДС"]
["2016-05-02",10000,null,null,null,null,null,{"$f":"IF(ISERROR(INDEX('Справочник статей'!$C:$C,MATCH($G7,'Справочник статей'!$D:$D,0))),\"\",INDEX('Справочник статей'!$C:$C,MATCH($G7,'Справочник статей'!$D:$D,0)))","v":""}]
["2016-05-15",null,5000,null,"3. ПРОЕКТНЫЕ РАБОТЫ","3.2. ПРОЕКТИРОВАНИЕ КОММУНИКАЦИЙ","Рабочее проектирование сетей Электроснабжения (стария Р)",{"$f":"IF(ISERROR(INDEX('Справочник статей'!$C:$C,MATCH($G8,'Справочник статей'!$D:$D,0))),\"\",INDEX('Справочник статей'!$C:$C,MATCH($G8,'Справочник статей'!$D:$D,0)))","v":3024},"            Экрос с БМ дог № 16-12/15.  В т.ч. НДС (13 728,81 р.)"]
["2016-05-29",null,10000,null,"3. ПРОЕКТНЫЕ РАБОТЫ","3.1. ИЗЫСКАНИЯ","          Исследования участка на наличие ВОП",{"$f":"IF(ISERROR(INDEX('Справочник статей'!$C:$C,MATCH($G9,'Справочник статей'!$D:$D,0))),\"\",INDEX('Справочник статей'!$C:$C,MATCH($G9,'Справочник статей'!$D:$D,0)))","v":3014},"            Центр Инженерных Изысканий \"Импуль-М\" № 07-07/15 от 07.07.2015 г. БЕЗ НДС"]
["2016-06-02",null,13000,null,"3. ПРОЕКТНЫЕ РАБОТЫ","3.2. ПРОЕКТИРОВАНИЕ КОММУНИКАЦИЙ","Проектирование внутриплощадочных кабельных линий (для снабжения очистных, котельной, водозабора, ШРП, наружное освещение) стадия П (освещение)",{"$f":"IF(ISERROR(INDEX('Справочник статей'!$C:$C,MATCH($G10,'Справочник статей'!$D:$D,0))),\"\",INDEX('Справочник статей'!$C:$C,MATCH($G10,'Справочник статей'!$D:$D,0)))","v":3023},"            СТ строй Проект (ДС № 1 от 05.09.2015 г. К договору 206-2015 от 15.07.2015 г.) распределен на 4 статьи БЕЗ НДС"]
["2016-06-15",null,7000,null,"3. ПРОЕКТНЫЕ РАБОТЫ","3.1. ИЗЫСКАНИЯ","          Инженерно-геодезические изыскания",{"$f":"IF(ISERROR(INDEX('Справочник статей'!$C:$C,MATCH($G11,'Справочник статей'!$D:$D,0))),\"\",INDEX('Справочник статей'!$C:$C,MATCH($G11,'Справочник статей'!$D:$D,0)))","v":3012},"            ГЕО Инжиниринг № 163-/15 БЕЗ НДС"]

{"sheet":"Справочник статей","index":2,"n_rows":36,"n_cols":4,"rows_kept":36,"cut":false,"hidden":false,"merged":[[1,1,1,3],[0,0,0,3],[14,1,14,3],[15,2,15,3]]}
["3. ПРОЕКТНЫЕ РАБОТЫ"]
[null,"3.1. ИЗЫСКАНИЯ"]
[null,null,3011,"          Инженерно-геологические изыскания"]
[null,null,3012,"          Инженерно-геодезические изыскания"]
[null,null,null,"* Заключенные договоры:"]
[null,null,null,"            ГЕО Инжиниринг № 163-/15 БЕЗ НДС"]
[null,null,null,"* Остаток по статье: "]
[null,null,3013,"          Археологические изыскания"]
[null,null,3014,"          Исследования участка на наличие ВОП"]
[null,null,null,"* Заключенные договоры:"]
[]
[null,null,null,"            Центр Инженерных Изысканий \"Импуль-М\" № 07-07/15 от 07.07.2015 г. БЕЗ НДС"]
[null,null,null,"* Остаток по статье: "]
[]
[null,"3.2. ПРОЕКТИРОВАНИЕ КОММУНИКАЦИЙ"]
[null,null,"3.2.1. Проектирование Электроснабжения"]
[null,null,3021,"Проектирование временного электроснабжения 100 кВт"]
[null,null,3022,"Проектирование временного электроснабжения 500 кВт "]
[null,null,3023,"Проектирование внутриплощадочных кабельных линий (для снабжения очистных, котельной, водозабора, ШРП, наружное освещение) стадия П (освещение)"]
[null,null,null,"* Заключенные договоры:"]
[null,null,null,"            СТ строй Проект (ДС № 1 от 05.09.2015 г. К договору 206-2015 от 15.07.2015 г.) распределен на 4 статьи БЕЗ НДС"]
[null,null,null,"* Остаток по статье: "]
[null,null,3024,"Рабочее проектирование сетей Электроснабжения (стария Р)"]
[null,null,null,"* Заключенные договоры:"]
[null,null,null,"            Экрос с БМ дог № 16-12/15.  В т.ч. НДС (13 728,81 р.)"]
[null,null,null,"            В т.ч. НДС  Экрос договор № 16-12/15.  (13 728,81 р.)"]
[null,null,null,"* Остаток по статье: "]
[null,null,3025,"Рабочее проектирование сетей  Электроснабжения до LM"]
[null,null,null,"* Заключенные договоры:"]
[null,null,null,"            Экрос с БХ  № 18-02/16. В т.ч. НДС  11 440,68 р."]
{"$rows_left_out":6}