{"text_format":"1","workbook":"xlsx","n_sheets":2,"sheets":["Исходные данные","Как надо"],"not_rendered":{"charts":0,"images":0,"macros":0,"external_links":0,"defined_names":0,"comments":0,"pivot_tables":0},"unopened":[],"bounds":{"document_bytes":16777216,"sheet_cells":100000,"rows_first":2000,"rows_last":500,"rows_between":2000,"halvings":0,"cell_chars":16384,"cell_head_chars":4096},"cells_cut":0,"cells_raw":0,"read":"whole","date_system":"1900"}

{"sheet":"Исходные данные","index":0,"n_rows":586,"n_cols":6,"rows_kept":586,"cut":false,"hidden":false,"merged":[]}
["Spot Name","Spot TVCompany","Date","Spot type","Advertiser","GRP"]
["Total",null,null,null,null,410514.3]
["ALPEN GOLD ОСОБЫЙ ТЕМНЫЙ шоколад (тауар) КАЗ (2 девушки с бобами) Ерекше уйлесимдилик, бирегей дам","КАЗАХСТАН","2013-01-01","Ролик","КРАФТ ФУДС КАЗАХСТАН",1.3]
["ALPEN GOLD ОСОБЫЙ ТЕМНЫЙ шоколад (тауар) КАЗ (2 девушки с бобами) Ерекше уйлесимдилик, бирегей дам","КАЗАХСТАН","2013-01-01","Ролик","КРАФТ ФУДС КАЗАХСТАН",0]
["ALPEN GOLD ОСОБЫЙ ТЕМНЫЙ шоколад (тауар) КАЗ (2 девушки с бобами) Ерекше уйлесимдилик, бирегей дам","КАЗАХСТАН","2013-01-01","Ролик","КРАФТ ФУДС КАЗАХСТАН",0]
["ALPEN GOLD ОСОБЫЙ ТЕМНЫЙ шоколад (тауар) КАЗ (2 девушки с бобами) Ерекше уйлесимдилик, бирегей дам","КАЗАХСТАН","2013-01-01","Ролик","КРАФТ ФУДС КАЗАХСТАН",0]
["ALPEN GOLD ОСОБЫЙ ТЕМНЫЙ шоколад (тауар) КАЗ (2 девушки с бобами) Ерекше уйлесимдилик, бирегей дам","КАЗАХСТАН","2013-01-01","Ролик","КРАФТ ФУДС КАЗАХСТАН",1.6]
["А.КОРКУНОВ шоколад в упаковке (КАЗ) В лесу (спонсор)","31 КАНАЛ","2013-01-01","Спонсор. ролик","А.КОРКУНОВ",1.6]
["M&M'S шоколадные конфеты (КАЗ) Елка (спонсор)","31 КАНАЛ","2013-01-01","Спонсор. ролик","MARS",1.6]
["M&M'S шоколадные конфеты (Желтый в шляпе и с волшебной палочкой) спонсор","31 КАНАЛ","2013-01-01","Спонсор. ролик","MARS",1.6]
["M&M'S шоколадные конфеты (КАЗ) Конфеты на диване (спонсор)","31 КАНАЛ","2013-01-01","Спонсор. ролик","MARS",1.6]
["А.КОРКУНОВ шоколад в упаковке (В лесу) спонсор.","31 КАНАЛ","2013-01-01","Спонсор. ролик","А.КОРКУНОВ",1.6]
["M&M'S шоколадные конфеты (Елка) спонсор","31 КАНАЛ","2013-01-01","Спонсор. ролик","MARS",1.6]
["M&M'S шоколадные конфеты (КАЗ) Конфета со стаканом (спонсор)","31 КАНАЛ","2013-01-01","Спонсор. ролик","MARS",1.6]
["M&M'S шоколадные конфеты (У желтого хвост павлина) спонсор","31 КАНАЛ","2013-01-01","Спонсор. ролик","MARS",0]
["А.КОРКУНОВ шоколад в упаковке (КАЗ) В лесу (спонсор)","31 КАНАЛ","2013-01-01","Спонсор. ролик","А.КОРКУНОВ",1.6]
["M&M'S шоколадные конфеты (КАЗ) Желтый в шляпе и с волшебной палочкой (спонсор)","31 КАНАЛ","2013-01-01","Спонсор. ролик","MARS",1.6]
["M&M'S шоколадные конфеты (Желтый в шляпе и с волшебной палочкой) спонсор","31 КАНАЛ","2013-01-01","Спонсор. ролик","MARS",1.6]
["M&M'S шоколадные конфеты (КАЗ) У желтого хвост павлина (спонсор)","31 КАНАЛ","2013-01-01","Спонсор. ролик","MARS",1.6]
["А.КОРКУНОВ шоколад в упаковке (В лесу) спонсор.","31 КАНАЛ","2013-01-01","Спонсор. ролик","А.КОРКУНОВ",1.6]
["M&M'S шоколадные конфеты (Желтый в шляпе и с волшебной палочкой) спонсор","31 КАНАЛ","2013-01-01","Спонсор. ролик","MARS",1.6]
["M&M'S шоколадные конфеты (КАЗ) Конфета со стаканом (спонсор)","31 КАНАЛ","2013-01-01","Спонсор. ролик","MARS",1.8]
["M&M'S шоколадные конфеты (Конфеты на диване) спонсор","31 КАНАЛ","2013-01-01","Спонсор. ролик","MARS",2.6]
["M&M'S шоколадные конфеты (КАЗ) Желтый в шляпе и с волшебной палочкой (спонсор)","31 КАНАЛ","2013-01-01","Спонсор. ролик","MARS",0]
["А.КОРКУНОВ шоколад в упаковке (КАЗ) В лесу (спонсор)","31 КАНАЛ","2013-01-01","Спонсор. ролик","А.КОРКУНОВ",6.1]
["M&M'S шоколадные конфеты (КАЗ) Желтый в шляпе и с волшебной палочкой (спонсор)","31 КАНАЛ","2013-01-01","Спонсор. ролик","MARS",5.0999999999999996]
["M&M'S шоколадные конфеты (КАЗ) Елка (спонсор)","31 КАНАЛ","2013-01-01","Спонсор. ролик","MARS",5.2]
["M&M'S шоколадные конфеты (Желтый в шляпе и с волшебной палочкой) спонсор","31 КАНАЛ","2013-01-01","Спонсор. ролик","MARS",3.9]
["M&M'S шоколадные конфеты (КАЗ) Конфеты на диване (спонсор)","31 КАНАЛ","2013-01-01","Спонсор. ролик","MARS",4.4000000000000004]
["А.КОРКУНОВ шоколад в упаковке (В лесу) спонсор.","31 КАНАЛ","2013-01-01","Спонсор. ролик","А.КОРКУНОВ",6.6]
{"$rows_left_out":557}
{"sheet":"Как надо","index":1,"n_rows":222,"n_cols":6,"rows_kept":222,"cut":false,"hidden":false,"merged":[]}
[null,"Spot TVCompany","Date","Spot type","Advertiser","GRP"]
[null,{"$f":"INDEX('Исходные данные'!$A$2:$F$586,ROW(A1),MATCH('Как надо'!B$1,'Исходные данные'!$A$1:$F$1,0))","v":0},{"$f":"INDEX('Исходные данные'!$A$2:$F$586,ROW(B1),MATCH('Как надо'!C$1,'Исходные данные'!$A$1:$F$1,0))","v":0},{"$f":"INDEX('Исходные данные'!$A$2:$F$586,ROW(C1),MATCH('Как надо'!D$1,'Исходные данные'!$A$1:$F$1,0))","v":0},{"$f":"INDEX('Исходные данные'!$A$2:$F$586,ROW(D1),MATCH('Как надо'!E$1,'Исходные данные'!$A$1:$F$1,0))","v":0},{"$f":"INDEX('Исходные данные'!$A$2:$F$586,ROW(E1),MATCH('Как надо'!F$1,'Исходные данные'!$A$1:$F$1,0))","v":410514.3}]
[null,{"$f":"INDEX('Исходные данные'!$A$2:$F$586,ROW(A2),MATCH('Как надо'!B$1,'Исходные данные'!$A$1:$F$1,0))","v":"КАЗАХСТАН"},{"$f":"INDEX('Исходные данные'!$A$2:$F$586,ROW(B2),MATCH('Как надо'!C$1,'Исходные данные'!$A$1:$F$1,0))","v":"2013-01-01"},{"$f":"INDEX('Исходные данные'!$A$2:$F$586,ROW(C2),MATCH('Как надо'!D$1,'Исходные данные'!$A$1:$F$1,0))","v":"Ролик"},{"$f":"INDEX('Исходные данные'!$A$2:$F$586,ROW(D2),MATCH('Как надо'!E$1,'Исходные данные'!$A$1:$F$1,0))","v":"КРАФТ ФУДС КАЗАХСТАН"},{"$f":"INDEX('Исходные данные'!$A$2:$F$586,ROW(E2),MATCH('Как надо'!F$1,'Исходные данные'!$A$1:$F$1,0))","v":1.3}]
[null,{"$f":"INDEX('Исходные данные'!$A$2:$F$586,ROW(A3),MATCH('Как надо'!B$1,'Исходные данные'!$A$1:$F$1,0))","v":"КАЗАХСТАН"},{"$f":"INDEX('Исходные данные'!$A$2:$F$586,ROW(B3),MATCH('Как надо'!C$1,'Исходные данные'!$A$1:$F$1,0))","v":"2013-01-01"},{"$f":"INDEX('Исходные данные'!$A$2:$F$586,ROW(C3),MATCH('Как надо'!D$1,'Исходные данные'!$A$1:$F$1,0))","v":"Ролик"},{"$f":"INDEX('Исходные данные'!$A$2:$F$586,ROW(D3),MATCH('Как надо'!E$1,'Исходные данные'!$A$1:$F$1,0))","v":"КРАФТ ФУДС КАЗАХСТАН"},{"$f":"INDEX('Исходные данные'!$A$2:$F$586,ROW(E3),MATCH('Как надо'!F$1,'Исходные данные'!$A$1:$F$1,0))","v":0}]
[null,{"$f":"INDEX('Исходные данные'!$A$2:$F$586,ROW(A4),MATCH('Как надо'!B$1,'Исходные данные'!$A$1:$F$1,0))","v":"КАЗАХСТАН"},{"$f":"INDEX('Исходные данные'!$A$2:$F$586,ROW(B4),MATCH('Как надо'!C$1,'Исходные данные'!$A$1:$F$1,0))","v":"2013-01-01"},{"$f":"INDEX('Исходные данные'!$A$2:$F$586,ROW(C4),MATCH('Как надо'!D$1,'Исходные данные'!$A$1:$F$1,0))","v":"Ролик"},{"$f":"INDEX('Исходные данные'!$A$2:$F$586,ROW(D4),MATCH('Как надо'!E$1,'Исходные данные'!$A$1:$F$1,0))","v":"КРАФТ ФУДС КАЗАХСТАН"},{"$f":"INDEX('Исходные данные'!$A$2:$F$586,ROW(E4),MATCH('Как надо'!F$1,'Исходные данные'!$A$1:$F$1,0))","v":0}]
[null,{"$f":"INDEX('Исходные данные'!$A$2:$F$586,ROW(A5),MATCH('Как надо'!B$1,'Исходные данные'!$A$1:$F$1,0))","v":"КАЗАХСТАН"},{"$f":"INDEX('Исходные данные'!$A$2:$F$586,ROW(B5),MATCH('Как надо'!C$1,'Исходные данные'!$A$1:$F$1,0))","v":"2013-01-01"},{"$f":"INDEX('Исходные данные'!$A$2:$F$586,ROW(C5),MATCH('Как надо'!D$1,'Исходные данные'!$A$1:$F$1,0))","v":"Ролик"},{"$f":"INDEX('Исходные данные'!$A$2:$F$586,ROW(D5),MATCH('Как надо'!E$1,'Исходные данные'!$A$1:$F$1,0))","v":"КРАФТ ФУДС КАЗАХСТАН"},{"$f":"INDEX('Исходные данные'!$A$2:$F$586,ROW(E5),MATCH('Как надо'!F$1,'Исходные данные'!$A$1:$F$1,0))","v":0}]
[null,{"$f":"INDEX('Исходные данные'!$A$2:$F$586,ROW(A6),MATCH('Как надо'!B$1,'Исходные данные'!$A$1:$F$1,0))","v":"КАЗАХСТАН"},{"$f":"INDEX('Исходные данные'!$A$2:$F$586,ROW(B6),MATCH('Как надо'!C$1,'Исходные данные'!$A$1:$F$1,0))","v":"2013-01-01"},{"$f":"INDEX('Исходные данные'!$A$2:$F$586,ROW(C6),MATCH('Как надо'!D$1,'Исходные данные'!$A$1:$F$1,0))","v":"Ролик"},{"$f":"INDEX('Исходные данные'!$A$2:$F$586,ROW(D6),MATCH('Как надо'!E$1,'Исходные данные'!$A$1:$F$1,0))","v":"КРАФТ ФУДС КАЗАХСТАН"},{"$f":"INDEX('Исходные данные'!$A$2:$F$586,ROW(E6),MATCH('Как надо'!F$1,'Исходные данные'!$A$1:$F$1,0))","v":1.6}]
[null,{"$f":"INDEX('Исходные данные'!$A$2:$F$586,ROW(A7),MATCH('Как надо'!B$1,'Исходные данные'!$A$1:$F$1,0))","v":"31 КАНАЛ"},{"$f":"INDEX('Исходные данные'!$A$2:$F$586,ROW(B7),MATCH('Как надо'!C$1,'Исходные данные'!$A$1:$F$1,0))","v":"2013-01-01"},{"$f":"INDEX('Исходные данные'!$A$2:$F$586,ROW(C7),MATCH('Как надо'!D$1,'Исходные данные'!$A$1:$F$1,0))","v":"Спонсор. ролик"},{"$f":"INDEX('Исходные данные'!$A$2:$F$586,ROW(D7),MATCH('Как надо'!E$1,'Исходные данные'!$A$1:$F$1,0))","v":"А.КОРКУНОВ"},{"$f":"INDEX('Исходные данные'!$A$2:$F$586,ROW(E7),MATCH('Как надо'!F$1,'Исходные данные'!$A$1:$F$1,0))","v":1.6}]
[null,{"$f":"INDEX('Исходные данные'!$A$2:$F$586,ROW(A8),MATCH('Как надо'!B$1,'Исходные данные'!$A$1:$F$1,0))","v":"31 КАНАЛ"},{"$f":"INDEX('Исходные данные'!$A$2:$F$586,ROW(B8),MATCH('Как надо'!C$1,'Исходные данные'!$A$1:$F$1,0))","v":"2013-01-01"},{"$f":"INDEX('Исходные данные'!$A$2:$F$586,ROW(C8),MATCH('Как надо'!D$1,'Исходные данные'!$A$1:$F$1,0))","v":"Спонсор. ролик"},{"$f":"INDEX('Исходные данные'!$A$2:$F$586,ROW(D8),MATCH('Как надо'!E$1,'Исходные данные'!$A$1:$F$1,0))","v":"MARS"},{"$f":"INDEX('Исходные данные'!$A$2:$F$586,ROW(E8),MATCH('Как надо'!F$1,'Исходные данные'!$A$1:$F$1,0))","v":1.6}]
[null,{"$f":"INDEX('Исходные данные'!$A$2:$F$586,ROW(A9),MATCH('Как надо'!B$1,'Исходные данные'!$A$1:$F$1,0))","v":"31 КАНАЛ"},{"$f":"INDEX('Исходные данные'!$A$2:$F$586,ROW(B9),MATCH('Как надо'!C$1,'Исходные данные'!$A$1:$F$1,0))","v":"2013-01-01"},{"$f":"INDEX('Исходные данные'!$A$2:$F$586,ROW(C9),MATCH('Как надо'!D$1,'Исходные данные'!$A$1:$F$1,0))","v":"Спонсор. ролик"},{"$f":"INDEX('Исходные данные'!$A$2:$F$586,ROW(D9),MATCH('Как надо'!E$1,'Исходные данные'!$A$1:$F$1,0))","v":"MARS"},{"$f":"INDEX('Исходные данные'!$A$2:$F$586,ROW(E9),MATCH('Как надо'!F$1,'Исходные данные'!$A$1:$F$1,0))","v":1.6}]
[null,{"$f":"INDEX('Исходные данные'!$A$2:$F$586,ROW(A10),MATCH('Как надо'!B$1,'Исходные данные'!$A$1:$F$1,0))","v":"31 КАНАЛ"},{"$f":"INDEX('Исходные данные'!$A$2:$F$586,ROW(B10),MATCH('Как надо'!C$1,'Исходные данные'!$A$1:$F$1,0))","v":"2013-01-01"},{"$f":"INDEX('Исходные данные'!$A$2:$F$586,ROW(C10),MATCH('Как надо'!D$1,'Исходные данные'!$A$1:$F$1,0))","v":"Спонсор. ролик"},{"$f":"INDEX('Исходные данные'!$A$2:$F$586,ROW(D10),MATCH('Как надо'!E$1,'Исходные данные'!$A$1:$F$1,0))","v":"MARS"},{"$f":"INDEX('Исходные данные'!$A$2:$F$586,ROW(E10),MATCH('Как надо'!F$1,'Исходные данные'!$A$1:$F$1,0))","v":1.6}]
[null,{"$f":"INDEX('Исходные данные'!$A$2:$F$586,ROW(A11),MATCH('Как надо'!B$1,'Исходные данные'!$A$1:$F$1,0))","v":"31 КАНАЛ"},{"$f":"INDEX('Исходные данные'!$A$2:$F$586,ROW(B11),MATCH('Как надо'!C$1,'Исходные данные'!$A$1:$F$1,0))","v":"2013-01-01"},{"$f":"INDEX('Исходные данные'!$A$2:$F$586,ROW(C11),MATCH('Как надо'!D$1,'Исходные данные'!$A$1:$F$1,0))","v":"Спонсор. ролик"},{"$f":"INDEX('Исходные данные'!$A$2:$F$586,ROW(D11),MATCH('Как надо'!E$1,'Исходные данные'!$A$1:$F$1,0))","v":"А.КОРКУНОВ"},{"$f":"INDEX('Исходные данные'!$A$2:$F$586,ROW(E11),MATCH('Как надо'!F$1,'Исходные данные'!$A$1:$F$1,0))","v":1.6}]
[null,{"$f":"INDEX('Исходные данные'!$A$2:$F$586,ROW(A12),MATCH('Как надо'!B$1,'Исходные данные'!$A$1:$F$1,0))","v":"31 КАНАЛ"},{"$f":"INDEX('Исходные данные'!$A$2:$F$586,ROW(B12),MATCH('Как надо'!C$1,'Исходные данные'!$A$1:$F$1,0))","v":"2013-01-01"},{"$f":"INDEX('Исходные данные'!$A$2:$F$586,ROW(C12),MATCH('Как надо'!D$1,'Исходные данные'!$A$1:$F$1,0))","v":"Спонсор. ролик"},{"$f":"INDEX('Исходные данные'!$A$2:$F$586,ROW(D12),MATCH('Как надо'!E$1,'Исходные данные'!$A$1:$F$1,0))","v":"MARS"},{"$f":"INDEX('Исходные данные'!$A$2:$F$586,ROW(E12),MATCH('Как надо'!F$1,'Исходные данные'!$A$1:$F$1,0))","v":1.6}]
[null,{"$f":"INDEX('Исходные данные'!$A$2:$F$586,ROW(A13),MATCH('Как надо'!B$1,'Исходные данные'!$A$1:$F$1,0))","v":"31 КАНАЛ"},{"$f":"INDEX('Исходные данные'!$A$2:$F$586,ROW(B13),MATCH('Как надо'!C$1,'Исходные данные'!$A$1:$F$1,0))","v":"2013-01-01"},{"$f":"INDEX('Исходные данные'!$A$2:$F$586,ROW(C13),MATCH('Как надо'!D$1,'Исходные данные'!$A$1:$F$1,0))","v":"Спонсор. ролик"},{"$f":"INDEX('Исходные данные'!$A$2:$F$586,ROW(D13),MATCH('Как надо'!E$1,'Исходные данные'!$A$1:$F$1,0))","v":"MARS"},{"$f":"INDEX('Исходные данные'!$A$2:$F$586,ROW(E13),MATCH('Как надо'!F$1,'Исходные данные'!$A$1:$F$1,0))","v":1.6}]
[null,{"$f":"INDEX('Исходные данные'!$A$2:$F$586,ROW(A14),MATCH('Как надо'!B$1,'Исходные данные'!$A$1:$F$1,0))","v":"31 КАНАЛ"},{"$f":"INDEX('Исходные данные'!$A$2:$F$586,ROW(B14),MATCH('Как надо'!C$1,'Исходные данные'!$A$1:$F$1,0))","v":"2013-01-01"},{"$f":"INDEX('Исходные данные'!$A$2:$F$586,ROW(C14),MATCH('Как надо'!D$1,'Исходные данные'!$A$1:$F$1,0))","v":"Спонсор. ролик"},{"$f":"INDEX('Исходные данные'!$A$2:$F$586,ROW(D14),MATCH('Как надо'!E$1,'Исходные данные'!$A$1:$F$1,0))","v":"MARS"},{"$f":"INDEX('Исходные данные'!$A$2:$F$586,ROW(E14),MATCH('Как надо'!F$1,'Исходные данные'!$A$1:$F$1,0))","v":0}]
[null,{"$f":"INDEX('Исходные данные'!$A$2:$F$586,ROW(A15),MATCH('Как надо'!B$1,'Исходные данные'!$A$1:$F$1,0))","v":"31 КАНАЛ"},{"$f":"INDEX('Исходные данные'!$A$2:$F$586,ROW(B15),MATCH('Как надо'!C$1,'Исходные данные'!$A$1:$F$1,0))","v":"2013-01-01"},{"$f":"INDEX('Исходные данные'!$A$2:$F$586,ROW(C15),MATCH('Как надо'!D$1,'Исходные данные'!$A$1:$F$1,0))","v":"Спонсор. ролик"},{"$f":"INDEX('Исходные данные'!$A$2:$F$586,ROW(D15),MATCH('Как надо'!E$1,'Исходные данные'!$A$1:$F$1,0))","v":"А.КОРКУНОВ"},{"$f":"INDEX('Исходные данные'!$A$2:$F$586,ROW(E15),MATCH('Как надо'!F$1,'Исходные данные'!$A$1:$F$1,0))","v":1.6}]
[null,{"$f":"INDEX('Исходные данные'!$A$2:$F$586,ROW(A16),MATCH('Как надо'!B$1,'Исходные данные'!$A$1:$F$1,0))","v":"31 КАНАЛ"},{"$f":"INDEX('Исходные данные'!$A$2:$F$586,ROW(B16),MATCH('Как надо'!C$1,'Исходные данные'!$A$1:$F$1,0))","v":"2013-01-01"},{"$f":"INDEX('Исходные данные'!$A$2:$F$586,ROW(C16),MATCH('Как надо'!D$1,'Исходные данные'!$A$1:$F$1,0))","v":"Спонсор. ролик"},{"$f":"INDEX('Исходные данные'!$A$2:$F$586,ROW(D16),MATCH('Как надо'!E$1,'Исходные данные'!$A$1:$F$1,0))","v":"MARS"},{"$f":"INDEX('Исходные данные'!$A$2:$F$586,ROW(E16),MATCH('Как надо'!F$1,'Исходные данные'!$A$1:$F$1,0))","v":1.6}]
[null,{"$f":"INDEX('Исходные данные'!$A$2:$F$586,ROW(A17),MATCH('Как надо'!B$1,'Исходные данные'!$A$1:$F$1,0))","v":"31 КАНАЛ"},{"$f":"INDEX('Исходные данные'!$A$2:$F$586,ROW(B17),MATCH('Как надо'!C$1,'Исходные данные'!$A$1:$F$1,0))","v":"2013-01-01"},{"$f":"INDEX('Исходные данные'!$A$2:$F$586,ROW(C17),MATCH('Как надо'!D$1,'Исходные данные'!$A$1:$F$1,0))","v":"Спонсор. ролик"},{"$f":"INDEX('Исходные данные'!$A$2:$F$586,ROW(D17),MATCH('Как надо'!E$1,'Исходные данные'!$A$1:$F$1,0))","v":"MARS"},{"$f":"INDEX('Исходные данные'!$A$2:$F$586,ROW(E17),MATCH('Как надо'!F$1,'Исходные данные'!$A$1:$F$1,0))","v":1.6}]
[null,{"$f":"INDEX('Исходные данные'!$A$2:$F$586,ROW(A18),MATCH('Как надо'!B$1,'Исходные данные'!$A$1:$F$1,0))","v":"31 КАНАЛ"},{"$f":"INDEX('Исходные данные'!$A$2:$F$586,ROW(B18),MATCH('Как надо'!C$1,'Исходные данные'!$A$1:$F$1,0))","v":"2013-01-01"},{"$f":"INDEX('Исходные данные'!$A$2:$F$586,ROW(C18),MATCH('Как надо'!D$1,'Исходные данные'!$A$1:$F$1,0))","v":"Спонсор. ролик"},{"$f":"INDEX('Исходные данные'!$A$2:$F$586,ROW(D18),MATCH('Как надо'!E$1,'Исходные данные'!$A$1:$F$1,0))","v":"MARS"},{"$f":"INDEX('Исходные данные'!$A$2:$F$586,ROW(E18),MATCH('Как надо'!F$1,'Исходные данные'!$A$1:$F$1,0))","v":1.6}]
[null,{"$f":"INDEX('Исходные данные'!$A$2:$F$586,ROW(A19),MATCH('Как надо'!B$1,'Исходные данные'!$A$1:$F$1,0))","v":"31 КАНАЛ"},{"$f":"INDEX('Исходные данные'!$A$2:$F$586,ROW(B19),MATCH('Как надо'!C$1,'Исходные данные'!$A$1:$F$1,0))","v":"2013-01-01"},{"$f":"INDEX('Исходные данные'!$A$2:$F$586,ROW(C19),MATCH('Как надо'!D$1,'Исходные данные'!$A$1:$F$1,0))","v":"Спонсор. ролик"},{"$f":"INDEX('Исходные данные'!$A$2:$F$586,ROW(D19),MATCH('Как надо'!E$1,'Исходные данные'!$A$1:$F$1,0))","v":"А.КОРКУНОВ"},{"$f":"INDEX('Исходные данные'!$A$2:$F$586,ROW(E19),MATCH('Как надо'!F$1,'Исходные данные'!$A$1:$F$1,0))","v":1.6}]
[null,{"$f":"INDEX('Исходные данные'!$A$2:$F$586,ROW(A20),MATCH('Как надо'!B$1,'Исходные данные'!$A$1:$F$1,0))","v":"31 КАНАЛ"},{"$f":"INDEX('Исходные данные'!$A$2:$F$586,ROW(B20),MATCH('Как надо'!C$1,'Исходные данные'!$A$1:$F$1,0))","v":"2013-01-01"},{"$f":"INDEX('Исходные данные'!$A$2:$F$586,ROW(C20),MATCH('Как надо'!D$1,'Исходные данные'!$A$1:$F$1,0))","v":"Спонсор. ролик"},{"$f":"INDEX('Исходные данные'!$A$2:$F$586,ROW(D20),MATCH('Как надо'!E$1,'Исходные данные'!$A$1:$F$1,0))","v":"MARS"},{"$f":"INDEX('Исходные данные'!$A$2:$F$586,ROW(E20),MATCH('Как надо'!F$1,'Исходные данные'!$A$1:$F$1,0))","v":1.6}]
[null,{"$f":"INDEX('Исходные данные'!$A$2:$F$586,ROW(A21),MATCH('Как надо'!B$1,'Исходные данные'!$A$1:$F$1,0))","v":"31 КАНАЛ"},{"$f":"INDEX('Исходные данные'!$A$2:$F$586,ROW(B21),MATCH('Как надо'!C$1,'Исходные данные'!$A$1:$F$1,0))","v":"2013-01-01"},{"$f":"INDEX('Исходные данные'!$A$2:$F$586,ROW(C21),MATCH('Как надо'!D$1,'Исходные данные'!$A$1:$F$1,0))","v":"Спонсор. ролик"},{"$f":"INDEX('Исходные данные'!$A$2:$F$586,ROW(D21),MATCH('Как надо'!E$1,'Исходные данные'!$A$1:$F$1,0))","v":"MARS"},{"$f":"INDEX('Исходные данные'!$A$2:$F$586,ROW(E21),MATCH('Как надо'!F$1,'Исходные данные'!$A$1:$F$1,0))","v":1.8}]
[null,{"$f":"INDEX('Исходные данные'!$A$2:$F$586,ROW(A22),MATCH('Как надо'!B$1,'Исходные данные'!$A$1:$F$1,0))","v":"31 КАНАЛ"},{"$f":"INDEX('Исходные данные'!$A$2:$F$586,ROW(B22),MATCH('Как надо'!C$1,'Исходные данные'!$A$1:$F$1,0))","v":"2013-01-01"},{"$f":"INDEX('Исходные данные'!$A$2:$F$586,ROW(C22),MATCH('Как надо'!D$1,'Исходные данные'!$A$1:$F$1,0))","v":"Спонсор. ролик"},{"$f":"INDEX('Исходные данные'!$A$2:$F$586,ROW(D22),MATCH('Как надо'!E$1,'Исходные данные'!$A$1:$F$1,0))","v":"MARS"},{"$f":"INDEX('Исходные данные'!$A$2:$F$586,ROW(E22),MATCH('Как надо'!F$1,'Исходные данные'!$A$1:$F$1,0))","v":2.6}]
[null,{"$f":"INDEX('Исходные данные'!$A$2:$F$586,ROW(A23),MATCH('Как надо'!B$1,'Исходные данные'!$A$1:$F$1,0))","v":"31 КАНАЛ"},{"$f":"INDEX('Исходные данные'!$A$2:$F$586,ROW(B23),MATCH('Как надо'!C$1,'Исходные данные'!$A$1:$F$1,0))","v":"2013-01-01"},{"$f":"INDEX('Исходные данные'!$A$2:$F$586,ROW(C23),MATCH('Как надо'!D$1,'Исходные данные'!$A$1:$F$1,0))","v":"Спонсор. ролик"},{"$f":"INDEX('Исходные данные'!$A$2:$F$586,ROW(D23),MATCH('Как надо'!E$1,'Исходные данные'!$A$1:$F$1,0))","v":"MARS"},{"$f":"INDEX('Исходные данные'!$A$2:$F$586,ROW(E23),MATCH('Как надо'!F$1,'Исходные данные'!$A$1:$F$1,0))","v":0}]
[null,{"$f":"INDEX('Исходные данные'!$A$2:$F$586,ROW(A24),MATCH('Как надо'!B$1,'Исходные данные'!$A$1:$F$1,0))","v":"31 КАНАЛ"},{"$f":"INDEX('Исходные данные'!$A$2:$F$586,ROW(B24),MATCH('Как надо'!C$1,'Исходные данные'!$A$1:$F$1,0))","v":"2013-01-01"},{"$f":"INDEX('Исходные данные'!$A$2:$F$586,ROW(C24),MATCH('Как надо'!D$1,'Исходные данные'!$A$1:$F$1,0))","v":"Спонсор. ролик"},{"$f":"INDEX('Исходные данные'!$A$2:$F$586,ROW(D24),MATCH('Как надо'!E$1,'Исходные данные'!$A$1:$F$1,0))","v":"А.КОРКУНОВ"},{"$f":"INDEX('Исходные данные'!$A$2:$F$586,ROW(E24),MATCH('Как надо'!F$1,'Исходные данные'!$A$1:$F$1,0))","v":6.1}]
[null,{"$f":"INDEX('Исходные данные'!$A$2:$F$586,ROW(A25),MATCH('Как надо'!B$1,'Исходные данные'!$A$1:$F$1,0))","v":"31 КАНАЛ"},{"$f":"INDEX('Исходные данные'!$A$2:$F$586,ROW(B25),MATCH('Как надо'!C$1,'Исходные данные'!$A$1:$F$1,0))","v":"2013-01-01"},{"$f":"INDEX('Исходные данные'!$A$2:$F$586,ROW(C25),MATCH('Как надо'!D$1,'Исходные данные'!$A$1:$F$1,0))","v":"Спонсор. ролик"},{"$f":"INDEX('Исходные данные'!$A$2:$F$586,ROW(D25),MATCH('Как надо'!E$1,'Исходные данные'!$A$1:$F$1,0))","v":"MARS"},{"$f":"INDEX('Исходные данные'!$A$2:$F$586,ROW(E25),MATCH('Как надо'!F$1,'Исходные данные'!$A$1:$F$1,0))","v":5.0999999999999996}]
[null,{"$f":"INDEX('Исходные данные'!$A$2:$F$586,ROW(A26),MATCH('Как надо'!B$1,'Исходные данные'!$A$1:$F$1,0))","v":"31 КАНАЛ"},{"$f":"INDEX('Исходные данные'!$A$2:$F$586,ROW(B26),MATCH('Как надо'!C$1,'Исходные данные'!$A$1:$F$1,0))","v":"2013-01-01"},{"$f":"INDEX('Исходные данные'!$A$2:$F$586,ROW(C26),MATCH('Как надо'!D$1,'Исходные данные'!$A$1:$F$1,0))","v":"Спонсор. ролик"},{"$f":"INDEX('Исходные данные'!$A$2:$F$586,ROW(D26),MATCH('Как надо'!E$1,'Исходные данные'!$A$1:$F$1,0))","v":"MARS"},{"$f":"INDEX('Исходные данные'!$A$2:$F$586,ROW(E26),MATCH('Как надо'!F$1,'Исходные данные'!$A$1:$F$1,0))","v":5.2}]
[null,{"$f":"INDEX('Исходные данные'!$A$2:$F$586,ROW(A27),MATCH('Как надо'!B$1,'Исходные данные'!$A$1:$F$1,0))","v":"31 КАНАЛ"},{"$f":"INDEX('Исходные данные'!$A$2:$F$586,ROW(B27),MATCH('Как надо'!C$1,'Исходные данные'!$A$1:$F$1,0))","v":"2013-01-01"},{"$f":"INDEX('Исходные данные'!$A$2:$F$586,ROW(C27),MATCH('Как надо'!D$1,'Исходные данные'!$A$1:$F$1,0))","v":"Спонсор. ролик"},{"$f":"INDEX('Исходные данные'!$A$2:$F$586,ROW(D27),MATCH('Как надо'!E$1,'Исходные данные'!$A$1:$F$1,0))","v":"MARS"},{"$f":"INDEX('Исходные данные'!$A$2:$F$586,ROW(E27),MATCH('Как надо'!F$1,'Исходные данные'!$A$1:$F$1,0))","v":3.9}]
[null,{"$f":"INDEX('Исходные данные'!$A$2:$F$586,ROW(A28),MATCH('Как надо'!B$1,'Исходные данные'!$A$1:$F$1,0))","v":"31 КАНАЛ"},{"$f":"INDEX('Исходные данные'!$A$2:$F$586,ROW(B28),MATCH('Как надо'!C$1,'Исходные данные'!$A$1:$F$1,0))","v":"2013-01-01"},{"$f":"INDEX('Исходные данные'!$A$2:$F$586,ROW(C28),MATCH('Как надо'!D$1,'Исходные данные'!$A$1:$F$1,0))","v":"Спонсор. ролик"},{"$f":"INDEX('Исходные данные'!$A$2:$F$586,ROW(D28),MATCH('Как надо'!E$1,'Исходные данные'!$A$1:$F$1,0))","v":"MARS"},{"$f":"INDEX('Исходные данные'!$A$2:$F$586,ROW(E28),MATCH('Как надо'!F$1,'Исходные данные'!$A$1:$F$1,0))","v":4.4000000000000004}]
[null,{"$f":"INDEX('Исходные данные'!$A$2:$F$586,ROW(A29),MATCH('Как надо'!B$1,'Исходные данные'!$A$1:$F$1,0))","v":"31 КАНАЛ"},{"$f":"INDEX('Исходные данные'!$A$2:$F$586,ROW(B29),MATCH('Как надо'!C$1,'Исходные данные'!$A$1:$F$1,0))","v":"2013-01-01"},{"$f":"INDEX('Исходные данные'!$A$2:$F$586,ROW(C29),MATCH('Как надо'!D$1,'Исходные данные'!$A$1:$F$1,0))","v":"Спонсор. ролик"},{"$f":"INDEX('Исходные данные'!$A$2:$F$586,ROW(D29),MATCH('Как надо'!E$1,'Исходные данные'!$A$1:$F$1,0))","v":"А.КОРКУНОВ"},{"$f":"INDEX('Исходные данные'!$A$2:$F$586,ROW(E29),MATCH('Как надо'!F$1,'Исходные данные'!$A$1:$F$1,0))","v":6.6}]
{"$rows_left_out":192}