{"text_format":"1","workbook":"xlsx","n_sheets":4,"sheets":["Заполнение данных на месяц","График","1","2"],"not_rendered":{"charts":0,"images":0,"macros":1,"external_links":0,"defined_names":0,"comments":0,"pivot_tables":0},"unopened":[],"bounds":{"document_bytes":16777216,"sheet_cells":100000,"rows_first":2000,"rows_last":500,"rows_between":2000,"halvings":0,"cell_chars":16384,"cell_head_chars":4096},"cells_cut":0,"cells_raw":0,"read":"whole","date_system":"1900"}

{"sheet":"Заполнение данных на месяц","index":0,"n_rows":115,"n_cols":7,"rows_kept":115,"cut":false,"hidden":false,"merged":[[0,17,1048575,37],[8,7,9,7],[8,6,9,6],[4,2,4,3],[3,5,3,6],[5,5,5,6],[3,8,3,11],[5,8,5,11],[2,13,2,14],[14,11,14,13],[14,8,14,9],[14,2,14,3],[14,5,14,6],[8,8,9,8]]}
[]
[]
[]
[]
[]
[]
[]
[]
[]
[]
[]
[]
[]
[]
[null,null,"Начальство",null,null,"Сотрудники"]
[null,null,1,"Быков",null,51,"Константинов"]
[null,null,2,"Васильев",null,52,"Копылов"]
[null,null,3,"Веселов",null,53,"Корнилов"]
[null,null,4,"Виноградов",null,54,"Королёв"]
[null,null,5,"Вишняков",null,55,"Костин"]
[null,null,6,"Владимиров",null,56,"Котов"]
[null,null,7,"Власов",null,57,"Кошелев"]
[null,null,8,"Волков",null,58,"Красильников"]
[null,null,9,"Воробьёв",null,59,"Крылов"]
[null,null,10,"Воронов",null,60,"Крюков"]
[null,null,11,"Воронцов",null,61,"Кудрявцев"]
[null,null,12,"Гаврилов",null,62,"Кудряшов"]
[null,null,13,"Галкин",null,63,"Кузнецов"]
[null,null,14,"Герасимов",null,64,"Кузьмин"]
[null,null,15,"Голубев",null,65,"Кулагин"]
[null,null,16,"Горбачёв",null,66,"Кулаков"]
[null,null,17,"Горбунов",null,67,"Куликов"]
[null,null,18,"Гордеев",null,68,"Лаврентьев"]
[null,null,19,"Горшков",null,69,"Лазарев"]
[null,null,20,"Григорьев",null,70,"Лапин"]
[null,null,21,"Гришин",null,71,"Ларионов"]
[null,null,22,"Громов",null,72,"Лебедев"]
[null,null,23,"Гуляев",null,73,"Лихачёв"]
[null,null,24,"Гурьев",null,74,"Лобанов"]
[null,null,25,"Гусев",null,75,"Логинов"]
{"$rows_left_out":76}
{"sheet":"График","index":1,"n_rows":160,"n_cols":36,"rows_kept":160,"cut":false,"hidden":false,"merged":[[2,23,2,30],[5,12,5,21],[4,2,4,4],[5,6,5,10],[3,6,3,10],[3,12,3,21],[3,23,3,26],[4,23,4,26],[5,23,5,26],[5,27,5,30],[4,27,4,30],[3,27,3,30]]}
[]
[]
[]
[]
[]
[]
[]
[]
[]
[null,null,"№","ФИО","Д",1,2,3,4,5,6,7,8,9,10,11,12,13,14,15,16,17,18,19,20,21,22,23,24,25,26,27,28,29,30,31]
[null,null,1,{"$f":"IF('Заполнение данных на месяц'!D16=\"\",\"\",'Заполнение данных на месяц'!D16)","v":"Быков"},"в","з0",null,null,null,null,"з5","з6","з7",null,null,null,"2з",22,23,24,null,null,null,null,29,30,"3з",32,33,null,null,null,37,38,39,40]
[null,null,2,{"$f":"IF('Заполнение данных на месяц'!D17=\"\",\"\",'Заполнение данных на месяц'!D17)","v":"Васильев"},"в","з0","зз","з2","з3","з4","з5","з6",null,null,null,null,null,22,23,24,25,26,27,null,null,null,null,null,null,null,null,36,37,38,39,40]
[null,null,3,{"$f":"IF('Заполнение данных на месяц'!D18=\"\",\"\",'Заполнение данных на месяц'!D18)","v":"Веселов"},"в",null,"зз",null,null,null,"з5","з6","з7","з8",null,null,null,22,23,24,null,26,27,28,29,null,null,32,null,34,35,36]
[null,null,4,{"$f":"IF('Заполнение данных на месяц'!D19=\"\",\"\",'Заполнение данных на месяц'!D19)","v":"Виноградов"},"в",null,"зз","з2","з3","з4",null,null,"з7","з8","з9",20,null,null,null,24,25,null,null,null,29,null,null,32,33,34,35,36,37,38,39,40]
[null,null,5,{"$f":"IF('Заполнение данных на месяц'!D20=\"\",\"\",'Заполнение данных на месяц'!D20)","v":"Вишняков"},"в","з0","зз","з2","з3",null,"з5","з6","з7","з8","з9",20,"2з",22,23,24,25,null,null,null,29,null,null,null,null,null,null,36,37,38,39]
[null,null,6,{"$f":"IF('Заполнение данных на месяц'!D21=\"\",\"\",'Заполнение данных на месяц'!D21)","v":"Владимиров"},"в","з0",null,"з2","з3","з4","з5",null,null,"з8","з9",20,"2з",22,23,24,25,26,27,28,29,30,"3з",32,33,34,35,36,37,null,39]
[null,null,7,{"$f":"IF('Заполнение данных на месяц'!D22=\"\",\"\",'Заполнение данных на месяц'!D22)","v":"Власов"},"в","з0",null,null,null,"з4","з5",null,null,"з8","з9",null,null,null,null,null,25,26,27,28,29,30,"3з",32,null,34,35,36,37,null,39]
[null,null,8,{"$f":"IF('Заполнение данных на месяц'!D23=\"\",\"\",'Заполнение данных на месяц'!D23)","v":"Волков"},"в",null,null,null,null,"з4","з5","з6","з7","з8","з9",null,"2з",22,23,null,null,null,null,null,null,null,null,null,null,34,35,null,37,null,39]
[null,null,9,{"$f":"IF('Заполнение данных на месяц'!D24=\"\",\"\",'Заполнение данных на месяц'!D24)","v":"Воробьёв"},"в","з0","зз","з2","з3","з4",null,null,null,null,"з9",20,"2з",null,23,null,null,null,null,null,null,null,null,null,null,34,35,null,37,null,39,40]
[null,null,10,{"$f":"IF('Заполнение данных на месяц'!D25=\"\",\"\",'Заполнение данных на месяц'!D25)","v":"Воронов"},"в",null,"зз","з2","з3","з4","з5","з6","з7","з8","з9",20,"2з",null,23,null,null,null,27,28,29,30,null,null,null,34,35,null,37,38,39,40]
[null,null,11,{"$f":"IF('Заполнение данных на месяц'!D26=\"\",\"\",'Заполнение данных на месяц'!D26)","v":"Воронцов"},"в","з0",null,null,null,"з4","з5","з6",null,null,null,null,"2з",null,23,24,25,26,27,28,29,30,"3з",32,33,34,35,36,37,38,39,40]
[null,null,12,{"$f":"IF('Заполнение данных на месяц'!D27=\"\",\"\",'Заполнение данных на месяц'!D27)","v":"Гаврилов"},"в","з0","зз","з2","з3",null,"з5","з6","з7","з8","з9",20,"2з",22,23,24,null,26,27,null,null,null,null,null,null,34,35,36]
[null,null,13,{"$f":"IF('Заполнение данных на месяц'!D28=\"\",\"\",'Заполнение данных на месяц'!D28)","v":"Галкин"},"в","з0","зз",null,null,null,null,null,null,"з8","з9",null,"2з",22,23,24,null,26,27,28,29,30,"3з",32,33,34,35,36,37,38,39,40]
[null,null,14,{"$f":"IF('Заполнение данных на месяц'!D29=\"\",\"\",'Заполнение данных на месяц'!D29)","v":"Герасимов"},"в","з0","зз",null,null,null,null,null,null,"з8","з9",20,"2з",22,23,24,null,26,null,null,null,30,"3з",32,null,null,null,36,null,null,null,40]
[null,null,15,{"$f":"IF('Заполнение данных на месяц'!D30=\"\",\"\",'Заполнение данных на месяц'!D30)","v":"Голубев"},"в","з0","зз",null,null,null,null,null,null,null,null,null,null,null,23,24,null,null,null,null,29,30,"3з",32,33,34,35,36,37,38,39,40]
[null,null,16,{"$f":"IF('Заполнение данных на месяц'!D31=\"\",\"\",'Заполнение данных на месяц'!D31)","v":"Горбачёв"},"в","з0","зз","з2","з3","з4","з5","з6","з7","з8","з9",20,"2з",22,23,24,null,null,null,null,29,30,"3з",32]
[null,null,17,{"$f":"IF('Заполнение данных на месяц'!D32=\"\",\"\",'Заполнение данных на месяц'!D32)","v":"Горбунов"},"в","з0","зз",null,null,null,"з5","з6","з7","з8",null,null,null,null,23,24,null,26,27,28,29,null,null,null,null,null,null,36,37,38,39,40]
[null,null,18,{"$f":"IF('Заполнение данных на месяц'!D33=\"\",\"\",'Заполнение данных на месяц'!D33)","v":"Гордеев"},"в","з0","зз",null,null,null,null,null,null,"з8",null,null,null,null,23,24,25,26,27,28,29,30,"3з",32,33,34,35,36,37,38,39,40]
[null,null,19,{"$f":"IF('Заполнение данных на месяц'!D34=\"\",\"\",'Заполнение данных на месяц'!D34)","v":"Горшков"},"в","з0","зз",null,null,null,null,null,null,"з8","з9",20,"2з",22,23,24,25,26,null,null,null,null,null,null,null,null,35,36]
[null,null,20,{"$f":"IF('Заполнение данных на месяц'!D35=\"\",\"\",'Заполнение данных на месяц'!D35)","v":"Григорьев"},"в","з0","зз","з2","з3","з4","з5",null,null,null,null,null,"2з",22,23,24,25,26,27,28,29,30,"3з",32,33,34,35,36,37,38,39,40]
[null,null,21,{"$f":"IF('Заполнение данных на месяц'!D36=\"\",\"\",'Заполнение данных на месяц'!D36)","v":"Гришин"},"в","з0","зз","з2","з3","з4","з5","з6","з7","з8","з9",20,"2з",22,23,24,25,26,27,28,29,30,null,null,null,34,35,36,37,38,39,40]
[null,null,22,{"$f":"IF('Заполнение данных на месяц'!D37=\"\",\"\",'Заполнение данных на месяц'!D37)","v":"Громов"},"в","з0","зз","з2","з3","з4","з5","з6","з7","з8","з9",20,"2з",22,null,null,null,null,null,28,29,30,"3з",32,33,34,35,36,37,38,39,40]
[null,null,23,{"$f":"IF('Заполнение данных на месяц'!D38=\"\",\"\",'Заполнение данных на месяц'!D38)","v":"Гуляев"},"в","з0","зз","з2",null,null,null,null,null,"з8","з9",null,null,null,null,null,25,26,27,28,29,30,"3з",null,null,null,null,null,null,null,null,40]
[null,null,24,{"$f":"IF('Заполнение данных на месяц'!D39=\"\",\"\",'Заполнение данных на месяц'!D39)","v":"Гурьев"},"в","з0","зз","з2","з3","з4","з5","з6","з7","з8","з9",null,null,null,null,null,25,26,27,28,29,30,"3з",null,null,null,null,null,null,null,null,40]
[null,null,25,{"$f":"IF('Заполнение данных на месяц'!D40=\"\",\"\",'Заполнение данных на месяц'!D40)","v":"Гусев"},"в",null,null,null,null,"з4","з5","з6","з7","з8","з9",20,"2з",22,23,24,25,26,27,28,null,null,null,null,null,null,35,36,37,38,39,40]
[null,null,26,{"$f":"IF('Заполнение данных на месяц'!D41=\"\",\"\",'Заполнение данных на месяц'!D41)","v":"Гущин"},"в",null,null,null,null,"з4","з5",null,null,null,null,null,null,null,23,24,25,26,27,28,29,30,"3з",32,33,34,35,36,37,38,39,40]
[null,null,27,{"$f":"IF('Заполнение данных на месяц'!D42=\"\",\"\",'Заполнение данных на месяц'!D42)","v":"Давыдов"},"в","з0","зз","з2","з3","з4","з5","з6","з7","з8","з9",20,"2з",22,23,24,25,26,27,28,29,30,"3з",32,33,34,null,null,null,null,39,40]
[null,null,28,{"$f":"IF('Заполнение данных на месяц'!D43=\"\",\"\",'Заполнение данных на месяц'!D43)","v":"Данилов"},"в","з0",null,null,null,null,"з5",null,null,null,null,null,null,null,null,null,25,26,27,28,29,30,"3з",32,33,34,null,null,null,null,39,40]
[null,null,29,{"$f":"IF('Заполнение данных на месяц'!D44=\"\",\"\",'Заполнение данных на месяц'!D44)","v":"Дементьев"},"в","з0","зз",null,null,null,null,null,"з7","з8","з9",20,"2з",22,23,24,null,null,null,null,null,30,"3з",32,33,34,35,36,37,38,39,40]
[null,null,30,{"$f":"IF('Заполнение данных на месяц'!D45=\"\",\"\",'Заполнение данных на месяц'!D45)","v":"Денисов"},"в","з0","зз","з2","з3","з4","з5","з6","з7","з8","з9",20,null,null,null,null,null,null,27,null,null,null,null,null,33,34,null,null,null,null,null,40]
{"$rows_left_out":121}
{"sheet":"1","index":2,"n_rows":60,"n_cols":10,"rows_kept":60,"cut":false,"hidden":false,"merged":[[13,6,13,11],[9,2,9,3],[2,15,2,16],[3,7,3,8],[3,10,3,13],[4,3,4,4],[5,7,5,8],[5,10,5,13]]}
[]
[]
[]
[]
[]
[]
[]
[]
[]
[null,null,{"$f":"IF('Заполнение данных на месяц'!C15:D15=\"\",\"\",'Заполнение данных на месяц'!C15:D15)","v":"Начальство"}]
[null,null,{"$f":"IF('Заполнение данных на месяц'!C16=\"\",\"\",'Заполнение данных на месяц'!C16)","v":1},{"$f":"IF('Заполнение данных на месяц'!D16=\"\",\"\",'Заполнение данных на месяц'!D16)","v":"Быков"},null,null,{"$f":"IF(C10=\"\",\"\",C10)","v":"Начальство"},"Виноградов",null,"Возможно ли реализовать, чтобы при нажатии на фамилию на листе 1 и 2, в G18:G48 расстанавливались значения с листа График."]
[null,null,{"$f":"IF('Заполнение данных на месяц'!C17=\"\",\"\",'Заполнение данных на месяц'!C17)","v":2},{"$f":"IF('Заполнение данных на месяц'!D17=\"\",\"\",'Заполнение данных на месяц'!D17)","v":"Васильев"},null,null,null,null,null," А в строках H11 высвечивалась бы фамилия кого я выбрал."]
[null,null,{"$f":"IF('Заполнение данных на месяц'!C18=\"\",\"\",'Заполнение данных на месяц'!C18)","v":3},{"$f":"IF('Заполнение данных на месяц'!D18=\"\",\"\",'Заполнение данных на месяц'!D18)","v":"Веселов"},null,null,null,null,null,"Мне требуется в листе 1 - с 1-го по 50 сотрудника, а в листе 2 - с 51-го по 150 сотрудника."]
[null,null,{"$f":"IF('Заполнение данных на месяц'!C19=\"\",\"\",'Заполнение данных на месяц'!C19)","v":4},{"$f":"IF('Заполнение данных на месяц'!D19=\"\",\"\",'Заполнение данных на месяц'!D19)","v":"Виноградов"},null,null,"Здесь с 1-го по 50 сотрудника"]
[null,null,{"$f":"IF('Заполнение данных на месяц'!C20=\"\",\"\",'Заполнение данных на месяц'!C20)","v":5},{"$f":"IF('Заполнение данных на месяц'!D20=\"\",\"\",'Заполнение данных на месяц'!D20)","v":"Вишняков"}]
[null,null,{"$f":"IF('Заполнение данных на месяц'!C21=\"\",\"\",'Заполнение данных на месяц'!C21)","v":6},{"$f":"IF('Заполнение данных на месяц'!D21=\"\",\"\",'Заполнение данных на месяц'!D21)","v":"Владимиров"}]
[null,null,{"$f":"IF('Заполнение данных на месяц'!C22=\"\",\"\",'Заполнение данных на месяц'!C22)","v":7},{"$f":"IF('Заполнение данных на месяц'!D22=\"\",\"\",'Заполнение данных на месяц'!D22)","v":"Власов"},null,null,"График"]
[null,null,{"$f":"IF('Заполнение данных на месяц'!C23=\"\",\"\",'Заполнение данных на месяц'!C23)","v":8},{"$f":"IF('Заполнение данных на месяц'!D23=\"\",\"\",'Заполнение данных на месяц'!D23)","v":"Волков"},null,null,{"$f":"VLOOKUP($H$11,График!$D$11:$AJ$160,ROW(A3),0)","v":0},"2016-09-01"]
[null,null,{"$f":"IF('Заполнение данных на месяц'!C24=\"\",\"\",'Заполнение данных на месяц'!C24)","v":9},{"$f":"IF('Заполнение данных на месяц'!D24=\"\",\"\",'Заполнение данных на месяц'!D24)","v":"Воробьёв"},null,null,{"$f":"VLOOKUP($H$11,График!$D$11:$AJ$160,ROW(A4),0)","v":"зз"},"2016-09-02"]
[null,null,{"$f":"IF('Заполнение данных на месяц'!C25=\"\",\"\",'Заполнение данных на месяц'!C25)","v":10},{"$f":"IF('Заполнение данных на месяц'!D25=\"\",\"\",'Заполнение данных на месяц'!D25)","v":"Воронов"},null,null,{"$f":"VLOOKUP($H$11,График!$D$11:$AJ$160,ROW(A5),0)","v":"з2"},"2016-09-03"]
[null,null,{"$f":"IF('Заполнение данных на месяц'!C26=\"\",\"\",'Заполнение данных на месяц'!C26)","v":11},{"$f":"IF('Заполнение данных на месяц'!D26=\"\",\"\",'Заполнение данных на месяц'!D26)","v":"Воронцов"},null,null,{"$f":"VLOOKUP($H$11,График!$D$11:$AJ$160,ROW(A6),0)","v":"з3"},"2016-09-04"]
[null,null,{"$f":"IF('Заполнение данных на месяц'!C27=\"\",\"\",'Заполнение данных на месяц'!C27)","v":12},{"$f":"IF('Заполнение данных на месяц'!D27=\"\",\"\",'Заполнение данных на месяц'!D27)","v":"Гаврилов"},null,null,{"$f":"VLOOKUP($H$11,График!$D$11:$AJ$160,ROW(A7),0)","v":"з4"},"2016-09-05"]
[null,null,{"$f":"IF('Заполнение данных на месяц'!C28=\"\",\"\",'Заполнение данных на месяц'!C28)","v":13},{"$f":"IF('Заполнение данных на месяц'!D28=\"\",\"\",'Заполнение данных на месяц'!D28)","v":"Галкин"},null,null,{"$f":"VLOOKUP($H$11,График!$D$11:$AJ$160,ROW(A8),0)","v":0},"2016-09-06"]
[null,null,{"$f":"IF('Заполнение данных на месяц'!C29=\"\",\"\",'Заполнение данных на месяц'!C29)","v":14},{"$f":"IF('Заполнение данных на месяц'!D29=\"\",\"\",'Заполнение данных на месяц'!D29)","v":"Герасимов"},null,null,{"$f":"VLOOKUP($H$11,График!$D$11:$AJ$160,ROW(A9),0)","v":0},"2016-09-07"]
[null,null,{"$f":"IF('Заполнение данных на месяц'!C30=\"\",\"\",'Заполнение данных на месяц'!C30)","v":15},{"$f":"IF('Заполнение данных на месяц'!D30=\"\",\"\",'Заполнение данных на месяц'!D30)","v":"Голубев"},null,null,{"$f":"VLOOKUP($H$11,График!$D$11:$AJ$160,ROW(A10),0)","v":"з7"},"2016-09-08"]
[null,null,{"$f":"IF('Заполнение данных на месяц'!C31=\"\",\"\",'Заполнение данных на месяц'!C31)","v":16},{"$f":"IF('Заполнение данных на месяц'!D31=\"\",\"\",'Заполнение данных на месяц'!D31)","v":"Горбачёв"},null,null,{"$f":"VLOOKUP($H$11,График!$D$11:$AJ$160,ROW(A11),0)","v":"з8"},"2016-09-09"]
[null,null,{"$f":"IF('Заполнение данных на месяц'!C32=\"\",\"\",'Заполнение данных на месяц'!C32)","v":17},{"$f":"IF('Заполнение данных на месяц'!D32=\"\",\"\",'Заполнение данных на месяц'!D32)","v":"Горбунов"},null,null,{"$f":"VLOOKUP($H$11,График!$D$11:$AJ$160,ROW(A12),0)","v":"з9"},"2016-09-10"]
[null,null,{"$f":"IF('Заполнение данных на месяц'!C33=\"\",\"\",'Заполнение данных на месяц'!C33)","v":18},{"$f":"IF('Заполнение данных на месяц'!D33=\"\",\"\",'Заполнение данных на месяц'!D33)","v":"Гордеев"},null,null,{"$f":"VLOOKUP($H$11,График!$D$11:$AJ$160,ROW(A13),0)","v":20},"2016-09-11"]
[null,null,{"$f":"IF('Заполнение данных на месяц'!C34=\"\",\"\",'Заполнение данных на месяц'!C34)","v":19},{"$f":"IF('Заполнение данных на месяц'!D34=\"\",\"\",'Заполнение данных на месяц'!D34)","v":"Горшков"},null,null,{"$f":"VLOOKUP($H$11,График!$D$11:$AJ$160,ROW(A14),0)","v":0},"2016-09-12"]
[null,null,{"$f":"IF('Заполнение данных на месяц'!C35=\"\",\"\",'Заполнение данных на месяц'!C35)","v":20},{"$f":"IF('Заполнение данных на месяц'!D35=\"\",\"\",'Заполнение данных на месяц'!D35)","v":"Григорьев"},null,null,{"$f":"VLOOKUP($H$11,График!$D$11:$AJ$160,ROW(A15),0)","v":0},"2016-09-13"]
[null,null,{"$f":"IF('Заполнение данных на месяц'!C36=\"\",\"\",'Заполнение данных на месяц'!C36)","v":21},{"$f":"IF('Заполнение данных на месяц'!D36=\"\",\"\",'Заполнение данных на месяц'!D36)","v":"Гришин"},null,null,{"$f":"VLOOKUP($H$11,График!$D$11:$AJ$160,ROW(A16),0)","v":0},"2016-09-14"]
[null,null,{"$f":"IF('Заполнение данных на месяц'!C37=\"\",\"\",'Заполнение данных на месяц'!C37)","v":22},{"$f":"IF('Заполнение данных на месяц'!D37=\"\",\"\",'Заполнение данных на месяц'!D37)","v":"Громов"},null,null,{"$f":"VLOOKUP($H$11,График!$D$11:$AJ$160,ROW(A17),0)","v":24},"2016-09-15"]
[null,null,{"$f":"IF('Заполнение данных на месяц'!C38=\"\",\"\",'Заполнение данных на месяц'!C38)","v":23},{"$f":"IF('Заполнение данных на месяц'!D38=\"\",\"\",'Заполнение данных на месяц'!D38)","v":"Гуляев"},null,null,{"$f":"VLOOKUP($H$11,График!$D$11:$AJ$160,ROW(A18),0)","v":25},"2016-09-16"]
[null,null,{"$f":"IF('Заполнение данных на месяц'!C39=\"\",\"\",'Заполнение данных на месяц'!C39)","v":24},{"$f":"IF('Заполнение данных на месяц'!D39=\"\",\"\",'Заполнение данных на месяц'!D39)","v":"Гурьев"},null,null,{"$f":"VLOOKUP($H$11,График!$D$11:$AJ$160,ROW(A19),0)","v":0},"2016-09-17"]
[null,null,{"$f":"IF('Заполнение данных на месяц'!C40=\"\",\"\",'Заполнение данных на месяц'!C40)","v":25},{"$f":"IF('Заполнение данных на месяц'!D40=\"\",\"\",'Заполнение данных на месяц'!D40)","v":"Гусев"},null,null,{"$f":"VLOOKUP($H$11,График!$D$11:$AJ$160,ROW(A20),0)","v":0},"2016-09-18"]
[null,null,{"$f":"IF('Заполнение данных на месяц'!C41=\"\",\"\",'Заполнение данных на месяц'!C41)","v":26},{"$f":"IF('Заполнение данных на месяц'!D41=\"\",\"\",'Заполнение данных на месяц'!D41)","v":"Гущин"},null,null,{"$f":"VLOOKUP($H$11,График!$D$11:$AJ$160,ROW(A21),0)","v":0},"2016-09-19"]
[null,null,{"$f":"IF('Заполнение данных на месяц'!C42=\"\",\"\",'Заполнение данных на месяц'!C42)","v":27},{"$f":"IF('Заполнение данных на месяц'!D42=\"\",\"\",'Заполнение данных на месяц'!D42)","v":"Давыдов"},null,null,{"$f":"VLOOKUP($H$11,График!$D$11:$AJ$160,ROW(A22),0)","v":29},"2016-09-20"]
[null,null,{"$f":"IF('Заполнение данных на месяц'!C43=\"\",\"\",'Заполнение данных на месяц'!C43)","v":28},{"$f":"IF('Заполнение данных на месяц'!D43=\"\",\"\",'Заполнение данных на месяц'!D43)","v":"Данилов"},null,null,{"$f":"VLOOKUP($H$11,График!$D$11:$AJ$160,ROW(A23),0)","v":0},"2016-09-21"]
[null,null,{"$f":"IF('Заполнение данных на месяц'!C44=\"\",\"\",'Заполнение данных на месяц'!C44)","v":29},{"$f":"IF('Заполнение данных на месяц'!D44=\"\",\"\",'Заполнение данных на месяц'!D44)","v":"Дементьев"},null,null,{"$f":"VLOOKUP($H$11,График!$D$11:$AJ$160,ROW(A24),0)","v":0},"2016-09-22"]
[null,null,{"$f":"IF('Заполнение данных на месяц'!C45=\"\",\"\",'Заполнение данных на месяц'!C45)","v":30},{"$f":"IF('Заполнение данных на месяц'!D45=\"\",\"\",'Заполнение данных на месяц'!D45)","v":"Денисов"},null,null,{"$f":"VLOOKUP($H$11,График!$D$11:$AJ$160,ROW(A25),0)","v":32},"2016-09-23"]
{"$rows_left_out":21}
{"sheet":"2","index":3,"n_rows":110,"n_cols":8,"rows_kept":110,"cut":false,"hidden":false,"merged":[[9,2,9,3],[13,6,13,11],[2,15,2,16],[3,7,3,8],[3,10,3,13],[4,3,4,4],[5,7,5,8],[5,10,5,13]]}
[]
[]
[]
[]
[]
[]
[]
[]
[]
[null,null,"Сотрудники"]
[null,null,51,"Константинов",null,null,{"$f":"IF(C10=\"\",\"\",C10)","v":"Сотрудники"},"Котов"]
[null,null,52,"Копылов"]
[null,null,53,"Корнилов"]
[null,null,54,"Королёв",null,null,"Здесь с 51-го по 150 сотрудника"]
[null,null,55,"Костин"]
[null,null,56,"Котов"]
[null,null,57,"Кошелев",null,null,"График"]
[null,null,58,"Красильников",null,null,{"$f":"VLOOKUP($H$11,График!$D$11:$AJ$160,ROW(A3),0)","v":60},"2016-09-01"]
[null,null,59,"Крылов",null,null,{"$f":"VLOOKUP($H$11,График!$D$11:$AJ$160,ROW(A4),0)","v":0},"2016-09-02"]
[null,null,60,"Крюков",null,null,{"$f":"VLOOKUP($H$11,График!$D$11:$AJ$160,ROW(A5),0)","v":"1з"},"2016-09-03"]
[null,null,61,"Кудрявцев",null,null,{"$f":"VLOOKUP($H$11,График!$D$11:$AJ$160,ROW(A6),0)","v":13},"2016-09-04"]
[null,null,62,"Кудряшов",null,null,{"$f":"VLOOKUP($H$11,График!$D$11:$AJ$160,ROW(A7),0)","v":14},"2016-09-05"]
[null,null,63,"Кузнецов",null,null,{"$f":"VLOOKUP($H$11,График!$D$11:$AJ$160,ROW(A8),0)","v":75},"2016-09-06"]
[null,null,64,"Кузьмин",null,null,{"$f":"VLOOKUP($H$11,График!$D$11:$AJ$160,ROW(A9),0)","v":0},"2016-09-07"]
[null,null,65,"Кулагин",null,null,{"$f":"VLOOKUP($H$11,График!$D$11:$AJ$160,ROW(A10),0)","v":0},"2016-09-08"]
[null,null,66,"Кулаков",null,null,{"$f":"VLOOKUP($H$11,График!$D$11:$AJ$160,ROW(A11),0)","v":18},"2016-09-09"]
[null,null,67,"Куликов",null,null,{"$f":"VLOOKUP($H$11,График!$D$11:$AJ$160,ROW(A12),0)","v":19},"2016-09-10"]
[null,null,68,"Лаврентьев",null,null,{"$f":"VLOOKUP($H$11,График!$D$11:$AJ$160,ROW(A13),0)","v":"з0"},"2016-09-11"]
[null,null,69,"Лазарев",null,null,{"$f":"VLOOKUP($H$11,График!$D$11:$AJ$160,ROW(A14),0)","v":"з1"},"2016-09-12"]
[null,null,70,"Лапин",null,null,{"$f":"VLOOKUP($H$11,График!$D$11:$AJ$160,ROW(A15),0)","v":"зз"},"2016-09-13"]
[null,null,71,"Ларионов",null,null,{"$f":"VLOOKUP($H$11,График!$D$11:$AJ$160,ROW(A16),0)","v":"з3"},"2016-09-14"]
[null,null,72,"Лебедев",null,null,{"$f":"VLOOKUP($H$11,График!$D$11:$AJ$160,ROW(A17),0)","v":"з4"},"2016-09-15"]
[null,null,73,"Лихачёв",null,null,{"$f":"VLOOKUP($H$11,График!$D$11:$AJ$160,ROW(A18),0)","v":"з5"},"2016-09-16"]
[null,null,74,"Лобанов",null,null,{"$f":"VLOOKUP($H$11,График!$D$11:$AJ$160,ROW(A19),0)","v":"з6"},"2016-09-17"]
[null,null,75,"Логинов",null,null,{"$f":"VLOOKUP($H$11,График!$D$11:$AJ$160,ROW(A20),0)","v":"з7"},"2016-09-18"]
[null,null,76,"Лукин",null,null,{"$f":"VLOOKUP($H$11,График!$D$11:$AJ$160,ROW(A21),0)","v":"з8"},"2016-09-19"]
[null,null,77,"Лыткин",null,null,{"$f":"VLOOKUP($H$11,График!$D$11:$AJ$160,ROW(A22),0)","v":74},"2016-09-20"]
[null,null,78,"Макаров",null,null,{"$f":"VLOOKUP($H$11,График!$D$11:$AJ$160,ROW(A23),0)","v":30},"2016-09-21"]
[null,null,79,"Максимов",null,null,{"$f":"VLOOKUP($H$11,График!$D$11:$AJ$160,ROW(A24),0)","v":31},"2016-09-22"]
[null,null,80,"Мамонтов",null,null,{"$f":"VLOOKUP($H$11,График!$D$11:$AJ$160,ROW(A25),0)","v":"3з"},"2016-09-23"]
{"$rows_left_out":70}