{"text_format":"1","workbook":"xlsx","n_sheets":2,"sheets":["Лист1","Лист2"],"not_rendered":{"charts":0,"images":0,"macros":1,"external_links":0,"defined_names":0,"comments":0,"pivot_tables":0},"unopened":[],"bounds":{"document_bytes":16777216,"sheet_cells":100000,"rows_first":2000,"rows_last":500,"rows_between":2000,"halvings":0,"cell_chars":16384,"cell_head_chars":4096},"cells_cut":0,"cells_raw":0,"read":"whole","date_system":"1900"}

{"sheet":"Лист1","index":0,"n_rows":31,"n_cols":9,"rows_kept":31,"cut":false,"hidden":false,"merged":[[17,1,17,8]]}
[]
[]
[]
[]
[]
[]
[]
[]
["Rechnung von",null,{"$f":"VLOOKUP(C14,Лист2!A:DU,48,FALSE)","v":"2016-06-01T08:36:00"}]
["Bestellt am:",null,{"$f":"C9","v":"2016-06-01T08:36:00"}]
[]
["Name des Verkäufers:"]
[]
["Rechnungsnumer/",null,"304-9976551-6494731"]
[]
[]
["Menge","Produktdetails"]
[{"$f":"VLOOKUP(C14,Лист2!A:DU,24,FALSE)","v":1},{"$f":"VLOOKUP(C14,Лист2!A:DU,3,FALSE)","v":"Illustrator CS5 Design-Workshop: Beispiele und Tipps fur den professionellen Umg"}]
[]
[]
[]
[]
[]
[]
[null,null,null,null,null,"Preis",null,"Gesamt"]
[null,null,null,null,null,{"$f":"VLOOKUP(C14,Лист2!A:DU,25,FALSE)","v":21.44},"Versand",null,{"$f":"VLOOKUP(C14,Лист2!A:DU,27,FALSE)","v":0}]
[null,null,null,null,null,null,"Zwischensumme",null,{"$f":"F26+I26","v":21.44}]
[null,null,null,null,null,null,"Netto",null,{"$f":"I27-I29","v":20.037383177570096}]
[null,null,null,null,null,null,"UmSt.7%",null,{"$f":"I27/107*7","v":1.4026168224299067}]
[null,null,null,null,null,null,"Gesamtsumme",null,{"$f":"I27","v":21.44}]
["Die Rechnung ist für Ihre Unterlagen bestimmt und stellt keine Zahlungsanforderungen dar."]

{"sheet":"Лист2","index":1,"n_rows":10,"n_cols":108,"rows_kept":10,"cut":false,"hidden":false,"merged":[]}
["Auftragsnummer"]
["306-6288037-8698717","02695558934251","Top oder Flop: Verkaufsstrategien fur Marktfuhrer (Dein Business)111111111111111111111111111111111111111111111nnnnnnnnnnnnnnnnn",null,11,"2016-05-26T16:24:00","Sebastian Kla?","Sebastian Kla?",17.27,3,"Nein","Ja","Ja","Nein","Nein","Nein","Nein","Nein",581,"306-6288037-8698717","306-6288037-8698717","DB",17.27,1,17.27,17.27,0,null,17.27,null,null,null,"EUR",null,null,null,"Uferweg 12","08541 Tho?fell","Deutschland","DE",null,"Nein","kdbsfyllmgnssy9@marketplace.amazon.de",null,null,null,null,"2016-06-25T19:50:23","2016-06-25T19:17:10",null,null,null,null,null,null,null,null,null,null,null,null,null,null,null,"Sebastian Kla?",null,null,"Uferweg 12","08541 Tho?fell","Deutschland","DE",5.73,null,null,11.54,null,null,null,null,0,null,null,null,null,0,0,null,"AA-1R-r22928",null,"HERMES",null,"Nein",null,null,null,null,null,null,null,null,null,null,"A","N",17.27,0,null,"N"]
["303-6679073-0893143","45918289362227","Allgemeine und Spezielle Krankheitslehre",null,876,"2016-05-30T11:08:52","Nadja Blein","Nadja Blein",31.49,3,"Nein","Ja","Ja","Nein","Nein","Nein","Nein","Nein",285,"303-6679073-0893143","303-6679073-0893143","DB",31.49,1,31.49,31.49,0,null,31.49,null,null,null,"EUR",null,null,null,"Sieboldstra?e 1a","97072 Wurzburg","Deutschland","DE",null,"Nein","n3f6w3xk07h81bq@marketplace.amazon.de",null,null,null,null,"2016-06-01T11:23:32","2016-06-01T10:55:40",null,null,null,null,null,null,null,null,null,null,null,null,null,null,null,"Nadja Blein",null,null,"Sieboldstra?e 1a","97072 Wurzburg","Deutschland","DE",11.29,null,null,20.2,null,null,null,null,0,null,null,null,null,0,0,null,"AA-1W-r22772",null,"HERMES",null,"Nein",null,null,null,null,null,null,null,null,null,null,"A","N",31.49,0,null,"N"]
["306-4939659-9078761","34416919524475","Ergotherapie Prufungswissen: Sozialwissenschaften",null,995,"2016-05-30T16:47:11","daniel schemat","daniel schemat",32.33,3,"Nein","Ja","Ja","Nein","Nein","Nein","Nein","Nein",561,"306-4939659-9078761","306-4939659-9078761","DB",32.33,1,32.33,32.33,0,null,32.33,null,null,null,"EUR",null,null,null,"Thesdorfer Weg 188","25421 Pinneberg","Deutschland","DE",null,"Nein","m70tbrqhhl4qhmz@marketplace.amazon.de",null,null,null,null,"2016-06-01T08:06:26","2016-06-01T06:37:41",null,null,null,null,null,null,null,null,null,null,null,null,null,null,null,"daniel schemat",null,null,"Thesdorfer Weg 188","25421 Pinneberg","Deutschland","DE",14.17,null,null,18.159999999999997,null,null,null,null,0,null,null,null,null,0,0,null,"AA-1W-r22891",null,"DP",null,"Nein",null,null,null,null,null,null,null,null,null,null,"A","N",32.33,0,null,"N"]
["303-1151667-8245934","48606967185515","Fu?boden-Lexikon: Die wichtigsten Bodenbelage fur Architektur und Design",null,1243,"2016-05-31T07:18:57","Thomas Schubert","Thomas Schubert",35.479999999999997,3,"Nein","Ja","Ja","Nein","Nein","Nein","Nein","Nein",226,"303-1151667-8245934","303-1151667-8245934","DB",35.479999999999997,1,35.479999999999997,35.479999999999997,0,null,35.479999999999997,null,null,null,"EUR",null,null,"Schubert Stone GmbH","Breitenfurter Strasse 249","1230 Wien","Osterreich","AT",null,"Nein","gddwqrvt2jxn4rs@marketplace.amazon.de",null,null,null,null,"2016-06-01T12:27:00","2016-06-01T11:32:11",null,null,null,null,null,null,null,null,null,null,null,null,null,null,null,"Thomas Schubert",null,"Schubert Stone GmbH","Breitenfurter Strasse 249","1230 Wien","Osterreich","AT",21.47,null,null,14.009999999999998,null,null,null,null,0,null,null,null,null,0,0,null,"AA-B1-r18703",null,"DP",null,"Nein",null,null,null,null,null,null,null,null,null,null,"A","N",35.479999999999997,0,null,"N"]
["304-1125798-0219560","20929276078715","Marketing in der gesetzlichen Krankenversicherung: Kundenbindung in einem reguli",null,160,"2016-05-31T08:21:13","Vienna Wege","Vienna Wege",37.619999999999997,3,"Nein","Ja","Ja","Nein","Nein","Nein","Nein","Nein",335,"304-1125798-0219560","304-1125798-0219560","DB",37.619999999999997,1,37.619999999999997,37.619999999999997,0,null,37.619999999999997,null,null,null,"EUR",null,null,null,"Ellerbeker Str. 13","25474 Bonningstedt","Deutschland","DE",null,"Nein","1pysg518l248p17@marketplace.amazon.de",null,null,null,null,"2016-06-02T07:24:08","2016-06-02T06:34:49",null,null,null,null,null,null,null,null,null,null,null,null,null,null,null,"Vienna Wege",null,null,"Ellerbeker Str. 13","25474 Bonningstedt","Deutschland","DE",18.329999999999998,null,null,19.29,null,null,null,null,0,null,null,null,null,0,0,null,"AA-1R-r23287",null,"DP",null,"Nein",null,null,null,null,null,null,null,null,null,null,"A","N",37.619999999999997,0,null,"N"]
["305-8828554-4661937","56279708672915","Personal-Management: Grundzuge fur Konzeptionen betrieblicher Personalarbeit",null,187,"2016-05-31T10:34:40","Meike Jegottka","Meike Jegottka",32.61,3,"Nein","Ja","Ja","Nein","Nein","Nein","Nein","Nein",504,"305-8828554-4661937","305-8828554-4661937","DB",32.61,1,32.61,32.61,0,null,32.61,null,null,null,"EUR",null,null,null,"Riedstr 25","44581 Castrop-Rauxel","Deutschland","DE",null,"Nein","27ldmdf1y4f8c4r@marketplace.amazon.de",null,null,null,null,"2016-05-31T21:35:44","2016-05-31T19:21:56",null,null,null,null,null,null,null,null,null,null,null,null,null,null,null,"Meike Jegottka",null,null,"Riedstr 25","44581 Castrop-Rauxel","Deutschland","DE",9.18,null,null,23.43,null,null,null,null,0,null,null,null,null,0,0,null,"AA-1R-r23314",null,"DP",null,"Nein",null,null,null,null,null,null,null,null,null,null,"A","N",32.61,0,null,"N"]
["305-7269462-7021144","51350385335003","Die Maya",null,146,"2016-05-31T13:01:46","Albert Josef Urban","Albert Josef Urban",19.940000000000001,3,"Nein","Ja","Ja","Nein","Nein","Nein","Nein","Nein",490,"305-7269462-7021144","305-7269462-7021144","DB",19.940000000000001,1,19.940000000000001,19.940000000000001,0,null,19.940000000000001,null,null,null,"EUR",null,null,"Deutsches Liturgisches Institut","Weberbach 72a","54290 Trier","Deutschland","DE",null,"Nein","g5z4gqtcck7pkhc@marketplace.amazon.de",null,null,null,null,"2016-05-31T21:50:30","2016-05-31T21:12:39",null,null,null,null,null,null,null,null,null,null,null,null,null,null,null,"Albert Josef Urban",null,"Deutsches Liturgisches Institut","Weberbach 72a","54290 Trier","Deutschland","DE",4.37,null,null,15.57,null,null,null,null,0,null,null,null,null,0,0,null,"AA-1R-r23273",null,"DP",null,"Nein",null,null,null,null,null,null,null,null,null,null,"A","N",19.940000000000001,0,null,"N"]
["302-3691723-9074746","15972852128275","Der Meister der Blumenkunst (SANDMANN EDITION)",null,6339,"2016-05-31T13:50:44","Dr. O. Fuhrmeister","Dr. O. Fuhrmeister",62.99,3,"Nein","Ja","Ja","Nein","Nein","Nein","Nein","Nein",158,"302-3691723-9074746","302-3691723-9074746","DB",62.99,1,62.99,62.99,0,null,62.99,null,null,null,"EUR",null,null,null,"aAchener Stra?e 206","40223 Dusseldorf","Deutschland","DE",null,"Nein","bdcpls3bs86b4yk@marketplace.amazon.de",null,null,null,null,"2016-05-31T22:07:06","2016-05-31T20:04:57",null,null,null,null,null,null,null,null,null,null,null,null,null,null,null,"Dr. O. Fuhrmeister",null,null,"aAchener Stra?e 206","40223 Dusseldorf","Deutschland","DE",41.5,null,null,21.490000000000002,null,null,null,null,0,null,null,null,null,0,0,null,"BB-1W-r22729",null,"DP",null,"Nein",null,null,null,null,null,null,null,null,null,null,"A","N",62.99,0,null,"N"]
["304-9976551-6494731","65761303140675","Illustrator CS5 Design-Workshop: Beispiele und Tipps fur den professionellen Umg",null,2989,"2016-05-31T15:52:21","michael soboll","michael soboll",21.44,3,"Nein","Ja","Ja","Nein","Nein","Nein","Nein","Nein",422,"304-9976551-6494731","304-9976551-6494731","DB",21.44,1,21.44,21.44,0,null,21.44,null,null,null,"EUR",null,null,null,"Kotnerholzweg 4","30451 Hannover","Deutschland","DE",null,"Nein","dgm9qf9tc63f1t1@marketplace.amazon.de",null,null,null,null,"2016-06-01T08:36:00","2016-06-01T06:42:00",null,null,null,null,null,null,null,null,null,null,null,null,null,null,null,"michael soboll",null,null,"Kotnerholzweg 4","30451 Hannover","Deutschland","DE",11.29,null,null,10.150000000000002,null,null,null,null,0,null,null,null,null,0,0,null,"AA-M1-r20850",null,"DP",null,"Nein",null,null,null,null,null,null,null,null,null,null,"A","N",21.44,0,null,"N"]