{"text_format":"1","workbook":"xlsx","n_sheets":6,"sheets":["Дата","Таблица","Таблица КТС","1","2","Данные"],"not_rendered":{"charts":0,"images":0,"macros":1,"external_links":0,"defined_names":1,"comments":0,"pivot_tables":0},"unopened":[],"bounds":{"document_bytes":16777216,"sheet_cells":100000,"rows_first":2000,"rows_last":500,"rows_between":2000,"halvings":0,"cell_chars":16384,"cell_head_chars":4096},"cells_cut":0,"cells_raw":0,"read":"whole","date_system":"1900"}

{"sheet":"Дата","index":0,"n_rows":5,"n_cols":10,"rows_kept":5,"cut":false,"hidden":false,"merged":[]}
["№ решения","Дата","Дата решения","Дата вступления решения в законную силу","Дата подачи заявления",12,13,14,"Выплата з/п за месяц","Выплата з/п за год"]
[6,"2017-06-24","2017-06-25","2017-06-26","2017-04-30",{"$f":"TEXT(B2,\"[$-FC19]ДД ММММ ГГГГ\")","v":"24 июня 2017"},{"$f":"TEXT(C2,\"[$-FC19]ДД ММММ ГГГГ\")","v":"25 июня 2017"},{"$f":"C2","v":"2017-06-25"},"май",2017]
[null,null,null,null,null,null,{"$f":"TEXT(C2,\"[$-FC19]ДД ММММ ГГГГ\")&\" года\"","v":"25 июня 2017 года"}]
[null,null,null,null,null,null,{"$f":"TEXT(E2,\"[$-FC19]ДД ММММ ГГГГ\")","v":"30 апреля 2017"}]
[null,null,null,null,null,null,{"$f":"TEXT(E2,\"[$-FC19]ДД ММММ ГГГГ\")&\" года\"","v":"30 апреля 2017 года"}]

{"sheet":"Таблица","index":1,"n_rows":8,"n_cols":12,"rows_kept":8,"cut":false,"hidden":false,"merged":[]}
["№ п/п","Ф.И.О.","Результат","Должность","Дата рождения","Место рождения","Паспорт","Адрес","ИНН","Лицевой счёт","Выплата за месяц","Выплата за месяц прописью"]
[1,"Сидоров Сидор Сидорович","Сидорова Сидора Сидоровича","Электросварщик ручной сварки","1962-11-22","г.Москва","98 02 № 234567 выдан Отделением УФМС России по Энской Республике в Энском районе 16 ноября 2007 г.","Энская Республика, г. Энск, ул. Ульянова, 1, кв. 3","202201234568","00000000000000000002",6500,{"$f":"MSumProp(K2)","v":"(Шесть тысяч пятьсот) рублей 00 коп."}]
[2,"Иванов Иван Иванович","Иванова Ивана Ивановича","Главный инженер","1961-10-21","с.Чужое Энского района","98 01 № 123456 выдан Отделением УФМС России по Энской Республике в Энском районе 15 ноября 2007 г.","Энская Республика, г. Энск, ул. Ленина, 1, кв. 2","202201234567","00000000000000000001",9800,{"$f":"MSumProp(K3)","v":"(Девять тысяч восемьсот) рублей 00 коп."}]
[3,"Петров Пётр Петрович","Петрова Пётра Петровича","Инженер-сметчик","1963-12-23","г.Энск Энской АССР","98 03 № 345678 выдан Отделением УФМС России по Энской Республике в Энском районе 17 ноября 2007 г.","Энская Республика, г. Энск, ул. Ильича, 1, кв. 4","202201234569","00000000000000000003",7200,{"$f":"MSumProp(K4)","v":"(Семь тысяч двести) рублей 00 коп."}]
[4,"залипало илья розин","залипало ильи розиы",null,null,null,null,null,null,null,null,{"$f":"MSumProp(K5)","v":"(Ноль) рублей 00 коп."}]
[5,"Просто проверка ячейки","Просто проверкы ячейкы","Инженер программист",null,null,null,null,null,null,null,{"$f":"MSumProp(K6)","v":"(Ноль) рублей 00 коп."}]
[7,null,null,null,null,null,null,null,null,null,null,{"$f":"MSumProp(K7)","v":"(Ноль) рублей 00 коп."}]
[null,"Просто проверка ячейки","Просто проверкы ячейкы",null,null,null,null,null,null,null,null,{"$f":"MSumProp(K8)","v":"(Ноль) рублей 00 коп."}]

{"sheet":"Таблица КТС","index":2,"n_rows":139,"n_cols":4,"rows_kept":139,"cut":false,"hidden":false,"merged":[[133,1,133,3],[14,0,14,3],[15,0,15,3],[16,0,16,3],[17,0,17,3],[18,0,18,3],[1,0,1,3],[4,0,4,3],[2,0,2,3],[3,0,3,3],[19,0,19,3],[11,0,11,3],[12,0,12,3],[13,0,13,3]]}
[null,{"$f":"SUM(D22:D132)","v":{"$error":"#REF!"}},{"$f":"MSumProp(B1)","v":{"$error":"#VALUE!"}}]
["Состав"]
["комиссии по трудовым спорам"]
["Общества с ограниченной ответственностью «Управление»"]
[{"$f":"Дата!C2","v":"2017-06-25"}]
["комиссия по трудовым спорам в составе:"]
["Председателя КТС: Антоновой Антонины Петровны"]
["Зам. председателя КТС: Кузьмина Карнила Карниловича"]
["Членов КТС: - Кузьминой Г.А."]
[null,"            - Курочкиной О.В.\n            - Мышенкова М.В.\n            - Быстрякова С.Б.\n            - Макарова Р.А.\n            - Сульдиной В.Д.\n            - Модина В.Н."]
["Секретаря КТС: Гашуткиной Г.И."]
[{"$f":"Данные!C2&Дата!G4&Данные!C3&Дата!I2&\" \"&Дата!J2&\" г.\"","v":"     Рассмотрев на заседании заявления работников Общества с ограниченной ответственностью «Управление» от 30 апреля 2017 о невыплате заработной платы за май 2017 г."}]
["УСТАНОВИЛА"]
[{"$f":"Данные!C4&Дата!I2&\" месяц \"&Дата!J2&\" г. на общую сумму \"&FLOOR(B1,1)&\" \"&TEXT(C1,\"\")","v":{"$error":"#REF!"}}]
[{"$f":"Данные!C5&Дата!G5&Данные!C6","v":"     Факт невыплаты заработной платы подтверждается поданными заявлениями работников от 30 апреля 2017 года, а ее сумма прилагаемыми справками о причитающейся заработной плате."}]
[{"$f":"Данные!C7","v":"     Выслушав стороны и исследовав документы, комиссия находит, что требования заявителей подлежать удовлетворению, так как в соответствии со ст. 136 Трудового кодекса РФ выплата заработной платы должна производиться не реже, чем каждые полмесяца."}]
[{"$f":"Данные!C8","v":"     На основании изложенного, комиссия приняла единогласное решение удовлетворить требования заявителей о выплате заработной платы, и руководствуясь ст.ст. 383-395 Трудового кодекса РФ"}]
["РЕШИЛА"]
[{"$f":"Данные!C9&\" \"&FLOOR(B1,1)&\" \"&TEXT(C1,\"\")&\" за \"&Дата!I2&\" месяц \"&Дата!J2&\" г.\"","v":{"$error":"#REF!"}}]
["СПИСОК"]
["№ п/п","Ф.И.О.","Должность","Сумма руб."]
[1,{"$f":"INDEX(Таблица!$A$2:$L$8,A22,2)","v":"Сидоров Сидор Сидорович"},{"$f":"INDEX(Таблица!$A$2:$L$8,A22,4)","v":"Электросварщик ручной сварки"},{"$f":"INDEX(Таблица!$A$2:$L$8,A22,11)","v":6500}]
[2,{"$f":"INDEX(Таблица!$A$2:$L$8,A23,2)","v":"Иванов Иван Иванович"},{"$f":"INDEX(Таблица!$A$2:$L$8,A23,4)","v":"Главный инженер"},{"$f":"INDEX(Таблица!$A$2:$L$8,A23,11)","v":9800}]
[3,{"$f":"INDEX(Таблица!$A$2:$L$8,A24,2)","v":"Петров Пётр Петрович"},{"$f":"INDEX(Таблица!$A$2:$L$8,A24,4)","v":"Инженер-сметчик"},{"$f":"INDEX(Таблица!$A$2:$L$8,A24,11)","v":7200}]
[4,{"$f":"INDEX(Таблица!$A$2:$L$8,A25,2)","v":"залипало илья розин"},{"$f":"INDEX(Таблица!$A$2:$L$8,A25,4)","v":0},{"$f":"INDEX(Таблица!$A$2:$L$8,A25,11)","v":0}]
[5,{"$f":"INDEX(Таблица!$A$2:$L$8,A26,2)","v":"Просто проверка ячейки"},{"$f":"INDEX(Таблица!$A$2:$L$8,A26,4)","v":"Инженер программист"},{"$f":"INDEX(Таблица!$A$2:$L$8,A26,11)","v":0}]
[6,{"$f":"INDEX(Таблица!$A$2:$L$8,A27,2)","v":0},{"$f":"INDEX(Таблица!$A$2:$L$8,A27,4)","v":0},{"$f":"INDEX(Таблица!$A$2:$L$8,A27,11)","v":0}]
[7,{"$f":"INDEX(Таблица!$A$2:$L$8,A28,2)","v":"Просто проверка ячейки"},{"$f":"INDEX(Таблица!$A$2:$L$8,A28,4)","v":0},{"$f":"INDEX(Таблица!$A$2:$L$8,A28,11)","v":0}]
[8,{"$f":"INDEX(Таблица!$A$2:$L$8,A29,2)","v":{"$error":"#REF!"}},{"$f":"INDEX(Таблица!$A$2:$L$8,A29,4)","v":{"$error":"#REF!"}},{"$f":"INDEX(Таблица!$A$2:$L$8,A29,11)","v":{"$error":"#REF!"}}]
[9,{"$f":"INDEX(Таблица!$A$2:$L$8,A30,2)","v":{"$error":"#REF!"}},{"$f":"INDEX(Таблица!$A$2:$L$8,A30,4)","v":{"$error":"#REF!"}},{"$f":"INDEX(Таблица!$A$2:$L$8,A30,11)","v":{"$error":"#REF!"}}]
[10,{"$f":"INDEX(Таблица!$A$2:$L$8,A31,2)","v":{"$error":"#REF!"}},{"$f":"INDEX(Таблица!$A$2:$L$8,A31,4)","v":{"$error":"#REF!"}},{"$f":"INDEX(Таблица!$A$2:$L$8,A31,11)","v":{"$error":"#REF!"}}]
[11,{"$f":"INDEX(Таблица!$A$2:$L$8,A32,2)","v":{"$error":"#REF!"}},{"$f":"INDEX(Таблица!$A$2:$L$8,A32,4)","v":{"$error":"#REF!"}},{"$f":"INDEX(Таблица!$A$2:$L$8,A32,11)","v":{"$error":"#REF!"}}]
[12,{"$f":"INDEX(Таблица!$A$2:$L$8,A33,2)","v":{"$error":"#REF!"}},{"$f":"INDEX(Таблица!$A$2:$L$8,A33,4)","v":{"$error":"#REF!"}},{"$f":"INDEX(Таблица!$A$2:$L$8,A33,11)","v":{"$error":"#REF!"}}]
[13,{"$f":"INDEX(Таблица!$A$2:$L$8,A34,2)","v":{"$error":"#REF!"}},{"$f":"INDEX(Таблица!$A$2:$L$8,A34,4)","v":{"$error":"#REF!"}},{"$f":"INDEX(Таблица!$A$2:$L$8,A34,11)","v":{"$error":"#REF!"}}]
[14,{"$f":"INDEX(Таблица!$A$2:$L$8,A35,2)","v":{"$error":"#REF!"}},{"$f":"INDEX(Таблица!$A$2:$L$8,A35,4)","v":{"$error":"#REF!"}},{"$f":"INDEX(Таблица!$A$2:$L$8,A35,11)","v":{"$error":"#REF!"}}]
[15,{"$f":"INDEX(Таблица!$A$2:$L$8,A36,2)","v":{"$error":"#REF!"}},{"$f":"INDEX(Таблица!$A$2:$L$8,A36,4)","v":{"$error":"#REF!"}},{"$f":"INDEX(Таблица!$A$2:$L$8,A36,11)","v":{"$error":"#REF!"}}]
[16,{"$f":"INDEX(Таблица!$A$2:$L$8,A37,2)","v":{"$error":"#REF!"}},{"$f":"INDEX(Таблица!$A$2:$L$8,A37,4)","v":{"$error":"#REF!"}},{"$f":"INDEX(Таблица!$A$2:$L$8,A37,11)","v":{"$error":"#REF!"}}]
[17,{"$f":"INDEX(Таблица!$A$2:$L$8,A38,2)","v":{"$error":"#REF!"}},{"$f":"INDEX(Таблица!$A$2:$L$8,A38,4)","v":{"$error":"#REF!"}},{"$f":"INDEX(Таблица!$A$2:$L$8,A38,11)","v":{"$error":"#REF!"}}]
[18,{"$f":"INDEX(Таблица!$A$2:$L$8,A39,2)","v":{"$error":"#REF!"}},{"$f":"INDEX(Таблица!$A$2:$L$8,A39,4)","v":{"$error":"#REF!"}},{"$f":"INDEX(Таблица!$A$2:$L$8,A39,11)","v":{"$error":"#REF!"}}]
[19,{"$f":"INDEX(Таблица!$A$2:$L$8,A40,2)","v":{"$error":"#REF!"}},{"$f":"INDEX(Таблица!$A$2:$L$8,A40,4)","v":{"$error":"#REF!"}},{"$f":"INDEX(Таблица!$A$2:$L$8,A40,11)","v":{"$error":"#REF!"}}]
[20,{"$f":"INDEX(Таблица!$A$2:$L$8,A41,2)","v":{"$error":"#REF!"}},{"$f":"INDEX(Таблица!$A$2:$L$8,A41,4)","v":{"$error":"#REF!"}},{"$f":"INDEX(Таблица!$A$2:$L$8,A41,11)","v":{"$error":"#REF!"}}]
[21,{"$f":"INDEX(Таблица!$A$2:$L$8,A42,2)","v":{"$error":"#REF!"}},{"$f":"INDEX(Таблица!$A$2:$L$8,A42,4)","v":{"$error":"#REF!"}},{"$f":"INDEX(Таблица!$A$2:$L$8,A42,11)","v":{"$error":"#REF!"}}]
[22,{"$f":"INDEX(Таблица!$A$2:$L$8,A43,2)","v":{"$error":"#REF!"}},{"$f":"INDEX(Таблица!$A$2:$L$8,A43,4)","v":{"$error":"#REF!"}},{"$f":"INDEX(Таблица!$A$2:$L$8,A43,11)","v":{"$error":"#REF!"}}]
[23,{"$f":"INDEX(Таблица!$A$2:$L$8,A44,2)","v":{"$error":"#REF!"}},{"$f":"INDEX(Таблица!$A$2:$L$8,A44,4)","v":{"$error":"#REF!"}},{"$f":"INDEX(Таблица!$A$2:$L$8,A44,11)","v":{"$error":"#REF!"}}]
[24,{"$f":"INDEX(Таблица!$A$2:$L$8,A45,2)","v":{"$error":"#REF!"}},{"$f":"INDEX(Таблица!$A$2:$L$8,A45,4)","v":{"$error":"#REF!"}},{"$f":"INDEX(Таблица!$A$2:$L$8,A45,11)","v":{"$error":"#REF!"}}]
[25,{"$f":"INDEX(Таблица!$A$2:$L$8,A46,2)","v":{"$error":"#REF!"}},{"$f":"INDEX(Таблица!$A$2:$L$8,A46,4)","v":{"$error":"#REF!"}},{"$f":"INDEX(Таблица!$A$2:$L$8,A46,11)","v":{"$error":"#REF!"}}]
[26,{"$f":"INDEX(Таблица!$A$2:$L$8,A47,2)","v":{"$error":"#REF!"}},{"$f":"INDEX(Таблица!$A$2:$L$8,A47,4)","v":{"$error":"#REF!"}},{"$f":"INDEX(Таблица!$A$2:$L$8,A47,11)","v":{"$error":"#REF!"}}]
[27,{"$f":"INDEX(Таблица!$A$2:$L$8,A48,2)","v":{"$error":"#REF!"}},{"$f":"INDEX(Таблица!$A$2:$L$8,A48,4)","v":{"$error":"#REF!"}},{"$f":"INDEX(Таблица!$A$2:$L$8,A48,11)","v":{"$error":"#REF!"}}]
[28,{"$f":"INDEX(Таблица!$A$2:$L$8,A49,2)","v":{"$error":"#REF!"}},{"$f":"INDEX(Таблица!$A$2:$L$8,A49,4)","v":{"$error":"#REF!"}},{"$f":"INDEX(Таблица!$A$2:$L$8,A49,11)","v":{"$error":"#REF!"}}]
[29,{"$f":"INDEX(Таблица!$A$2:$L$8,A50,2)","v":{"$error":"#REF!"}},{"$f":"INDEX(Таблица!$A$2:$L$8,A50,4)","v":{"$error":"#REF!"}},{"$f":"INDEX(Таблица!$A$2:$L$8,A50,11)","v":{"$error":"#REF!"}}]
[31,{"$f":"INDEX(Таблица!$A$2:$L$8,A51,2)","v":{"$error":"#REF!"}},{"$f":"INDEX(Таблица!$A$2:$L$8,A51,4)","v":{"$error":"#REF!"}},{"$f":"INDEX(Таблица!$A$2:$L$8,A51,11)","v":{"$error":"#REF!"}}]
[31,{"$f":"INDEX(Таблица!$A$2:$L$8,A52,2)","v":{"$error":"#REF!"}},{"$f":"INDEX(Таблица!$A$2:$L$8,A52,4)","v":{"$error":"#REF!"}},{"$f":"INDEX(Таблица!$A$2:$L$8,A52,11)","v":{"$error":"#REF!"}}]
[32,{"$f":"INDEX(Таблица!$A$2:$L$8,A53,2)","v":{"$error":"#REF!"}},{"$f":"INDEX(Таблица!$A$2:$L$8,A53,4)","v":{"$error":"#REF!"}},{"$f":"INDEX(Таблица!$A$2:$L$8,A53,11)","v":{"$error":"#REF!"}}]
[33,{"$f":"INDEX(Таблица!$A$2:$L$8,A54,2)","v":{"$error":"#REF!"}},{"$f":"INDEX(Таблица!$A$2:$L$8,A54,4)","v":{"$error":"#REF!"}},{"$f":"INDEX(Таблица!$A$2:$L$8,A54,11)","v":{"$error":"#REF!"}}]
[34,{"$f":"INDEX(Таблица!$A$2:$L$8,A55,2)","v":{"$error":"#REF!"}},{"$f":"INDEX(Таблица!$A$2:$L$8,A55,4)","v":{"$error":"#REF!"}},{"$f":"INDEX(Таблица!$A$2:$L$8,A55,11)","v":{"$error":"#REF!"}}]
[35,{"$f":"INDEX(Таблица!$A$2:$L$8,A56,2)","v":{"$error":"#REF!"}},{"$f":"INDEX(Таблица!$A$2:$L$8,A56,4)","v":{"$error":"#REF!"}},{"$f":"INDEX(Таблица!$A$2:$L$8,A56,11)","v":{"$error":"#REF!"}}]
[36,{"$f":"INDEX(Таблица!$A$2:$L$8,A57,2)","v":{"$error":"#REF!"}},{"$f":"INDEX(Таблица!$A$2:$L$8,A57,4)","v":{"$error":"#REF!"}},{"$f":"INDEX(Таблица!$A$2:$L$8,A57,11)","v":{"$error":"#REF!"}}]
[37,{"$f":"INDEX(Таблица!$A$2:$L$8,A58,2)","v":{"$error":"#REF!"}},{"$f":"INDEX(Таблица!$A$2:$L$8,A58,4)","v":{"$error":"#REF!"}},{"$f":"INDEX(Таблица!$A$2:$L$8,A58,11)","v":{"$error":"#REF!"}}]
[38,{"$f":"INDEX(Таблица!$A$2:$L$8,A59,2)","v":{"$error":"#REF!"}},{"$f":"INDEX(Таблица!$A$2:$L$8,A59,4)","v":{"$error":"#REF!"}},{"$f":"INDEX(Таблица!$A$2:$L$8,A59,11)","v":{"$error":"#REF!"}}]
[39,{"$f":"INDEX(Таблица!$A$2:$L$8,A60,2)","v":{"$error":"#REF!"}},{"$f":"INDEX(Таблица!$A$2:$L$8,A60,4)","v":{"$error":"#REF!"}},{"$f":"INDEX(Таблица!$A$2:$L$8,A60,11)","v":{"$error":"#REF!"}}]
{"$rows_left_out":80}
{"sheet":"1","index":3,"n_rows":42,"n_cols":3,"rows_kept":42,"cut":false,"hidden":false,"merged":[[14,1,14,3],[1,1,1,3],[2,0,2,3],[3,1,3,3],[4,0,4,3],[6,1,6,3],[7,0,7,1],[8,0,8,3],[9,0,9,3],[10,1,10,3],[11,0,11,3],[12,0,12,3],[41,2,41,3],[15,2,15,3],[16,2,16,3],[30,1,30,3],[31,1,31,3],[34,1,34,3],[35,1,35,3],[36,1,36,3],[37,0,37,3],[38,0,38,3],[39,1,39,3],[40,2,40,3]]}
[]
[null,"Комиссия по трудовым спорам\nОбщества с ограниченной ответственностью \n«Управление»"]
[{"$f":"--RIGHTB(SUBSTITUTE(CELL(\"filename\",D1),\"]\",REPT(\" \",31)),31)","v":1}]
[null,{"$f":"Дата!B2","v":"2017-06-24"}]
[{"$f":"Данные!B2&\" \"&Дата!A2&\" от \"&Дата!G2&\" года \"&Данные!B3&Дата!I2&\" месяц \"&Дата!J2&\" года.\"","v":"     Настоящее удостоверение выдано на основании Решения КТС Общества с ограниченной ответственностью «Управление» № 6 от 25 июня 2017 года о взыскании невыплаченной своевременно заработной платы за май месяц 2017 года."}]
["в пользу:",{"$f":"VLOOKUP(A3,Таблица!A2:L8,3)","v":"Сидорова Сидора Сидоровича"}]
["в сумме:",{"$f":"FLOOR(VLOOKUP(A3,Таблица!A2:L8,11),1)&\" \"&VLOOKUP(A3,Таблица!A2:L8,12)","v":"6500 (Шесть тысяч пятьсот) рублей 00 коп."}]
["     Решение комиссии по трудовым спорам:"]
[{"$f":"Данные!B4&\" в пользу:\"","v":"     Взыскать с Общества с ограниченной ответственностью «Управление»  юридический адрес: 444444, г. Энска, мкр. Стройка, д. 1, Банковские реквизиты:  АКБ «БАНККРЕДИТПРОСТОМБАНК» ПАО г. Энска, р/счет 98765432100000123456, Кор. счет 98765432100000000123, ИНН 222004444, БИК 012345678  в пользу:"}]
[{"$f":"VLOOKUP($A$3,Таблица!$A$2:$L$8,3)&\", дата рождения \"&TEXT((VLOOKUP($A$3,Таблица!$A$2:$L$8,5)),\"ДД.ММ.ГГГГ\")&\" года, \"&\"место рождения: \"&VLOOKUP($A$3,Таблица!$A$2:$L$8,6)&\", адрес: \"&VLOOKUP(A3,Таблица!A2:L8,8)&Данные!B5&Дата!I2&\" месяц \"&Дата!J2&\" года\"&\" в сумме: \"&FLOOR(VLOOKUP(A3,Таблица!A2:L8,11),1)&\" \"&VLOOKUP(A3,Таблица!A2:L8,12)","v":"Сидорова Сидора Сидоровича, дата рождения 22.11.1962 года, место рождения: г.Москва, адрес: Энская Республика, г. Энск, ул. Ульянова, 1, кв. 3, невыплаченную заработную плату за май месяц 2017 года в сумме: 6500 (Шесть тысяч пятьсот) рублей 00 коп."}]
[null,{"$f":"Дата!D2","v":"2017-06-26"}]
[{"$f":"Данные!B6","v":"     Настоящее удостоверение имеет силу исполнительного листа и предъявляется к исполнению не позднее 3-х месяцев со следующего дня его выдачи."}]
[{"$f":"Данные!B7","v":"     Налог на доходы физических лиц, налог в пенсионный фонд с указанной суммы удержаны."}]
[]
[null,{"$f":"Дата!B2","v":"2017-06-24"}]
[null,"Председатель КТС:",{"$f":"Данные!B8","v":"Антонова А.П."}]
[null,"Секретарь КТС:",{"$f":"Данные!B9","v":"Гашуткина Г.И."}]
[]
[]
[]
[]
[]
[]
[]
[]
[]
[]
[]
[]
[]
[null,"АКБ «БАНККРЕДИТПРОСТОМБАНК» ПАО"]
[null,"город Энск, улица Патриса Лумумбы, 26"]
[null,"БИК 04970625"]
[null,{"$f":"VLOOKUP($A$3,Таблица!$A$2:$L$8,3)","v":"Сидорова Сидора Сидоровича"}]
[null,{"$f":"\"Паспорт: \"&VLOOKUP($A$3,Таблица!$A$2:$L$8,7)","v":"Паспорт: 98 02 № 234567 выдан Отделением УФМС России по Энской Республике в Энском районе 16 ноября 2007 г."}]
[null,{"$f":"\"Адрес: \"&VLOOKUP($A$3,Таблица!$A$2:$L$8,8)","v":"Адрес: Энская Республика, г. Энск, ул. Ульянова, 1, кв. 3"}]
[null,{"$f":"\"ИНН \"&VLOOKUP($A$3,Таблица!$A$2:$L$8,9)","v":"ИНН 202201234568"}]
[{"$f":"Данные!C12&\" \"&A3&\" от \"&Дата!F2&\" года, \"&Данные!C13&Дата!I2&\" месяц \"&Дата!J2&\" года.\"","v":"     Предъявляется для взыскания с расчетного счета Общества с ограниченной ответственностью «Управление» № 12345678998745632145, открытого в АКБ «БАНККРЕДИТПРОСТОМБАНК» ПАО удостоверение комиссии по трудовым спорам Общества с ограниченной ответственностью «Управление» № 1 от 24 июня 2017 года, на выплату заработной платы за май месяц 2017 года."}]
[{"$f":"Данные!C14&FLOOR(VLOOKUP(A3,Таблица!A2:L8,11),1)&\" \"&VLOOKUP(A3,Таблица!A2:L8,12)&Данные!C15&VLOOKUP($A$3,Таблица!$A$2:$L$8,10)&Данные!C16","v":"     на сумму 6500 (Шесть тысяч пятьсот) рублей 00 коп. к списанию в мою пользу на лицевой счет № 00000000000000000002 в АКБ «БАНККРЕДИТПРОСТОМБАНК» ПАО."}]
[null,{"$f":"Дата!B2","v":"2017-06-24"}]
[null,{"$f":"VLOOKUP($A$3,Таблица!$A$2:$L$8,2)","v":"Сидоров Сидор Сидорович"}]
[null,"Фамилия Имя Отчество","Подпись"]

{"sheet":"2","index":4,"n_rows":42,"n_cols":3,"rows_kept":42,"cut":false,"hidden":false,"merged":[[14,1,14,3],[1,1,1,3],[2,0,2,3],[3,1,3,3],[4,0,4,3],[6,1,6,3],[7,0,7,1],[8,0,8,3],[9,0,9,3],[10,1,10,3],[11,0,11,3],[12,0,12,3],[41,2,41,3],[15,2,15,3],[16,2,16,3],[30,1,30,3],[31,1,31,3],[34,1,34,3],[35,1,35,3],[36,1,36,3],[37,0,37,3],[38,0,38,3],[39,1,39,3],[40,2,40,3]]}
[]
[null,"Комиссия по трудовым спорам\nОбщества с ограниченной ответственностью \n«Управление ЖКХ»"]
[{"$f":"--RIGHTB(SUBSTITUTE(CELL(\"filename\",D1),\"]\",REPT(\" \",31)),31)","v":2}]
[null,{"$f":"Дата!B2","v":"2017-06-24"}]
[{"$f":"Данные!B2&\" \"&Дата!A2&\" от \"&Дата!G2&\" года \"&Данные!B3&Дата!I2&\" месяц \"&Дата!J2&\" года.\"","v":"     Настоящее удостоверение выдано на основании Решения КТС Общества с ограниченной ответственностью «Управление» № 6 от 25 июня 2017 года о взыскании невыплаченной своевременно заработной платы за май месяц 2017 года."}]
["в пользу:",{"$f":"VLOOKUP(A3,Таблица!A2:L8,3)","v":"Иванова Ивана Ивановича"}]
["в сумме:",{"$f":"FLOOR(VLOOKUP(A3,Таблица!A2:L8,11),1)&\" \"&VLOOKUP(A3,Таблица!A2:L8,12)","v":"9800 (Девять тысяч восемьсот) рублей 00 коп."}]
["     Решение комиссии по трудовым спорам:"]
[{"$f":"Данные!B4&\" в пользу:\"","v":"     Взыскать с Общества с ограниченной ответственностью «Управление»  юридический адрес: 444444, г. Энска, мкр. Стройка, д. 1, Банковские реквизиты:  АКБ «БАНККРЕДИТПРОСТОМБАНК» ПАО г. Энска, р/счет 98765432100000123456, Кор. счет 98765432100000000123, ИНН 222004444, БИК 012345678  в пользу:"}]
[{"$f":"VLOOKUP($A$3,Таблица!$A$2:$L$8,3)&\", дата рождения \"&TEXT((VLOOKUP($A$3,Таблица!$A$2:$L$8,5)),\"ДД.ММ.ГГГГ\")&\" года, \"&\"место рождения: \"&VLOOKUP($A$3,Таблица!$A$2:$L$8,6)&\", адрес: \"&VLOOKUP(A3,Таблица!A2:L8,8)&Данные!B5&Дата!I2&\" месяц \"&Дата!J2&\" года\"&\" в сумме: \"&FLOOR(VLOOKUP(A3,Таблица!A2:L8,11),1)&\" \"&VLOOKUP(A3,Таблица!A2:L8,12)","v":"Иванова Ивана Ивановича, дата рождения 21.10.1961 года, место рождения: с.Чужое Энского района, адрес: Энская Республика, г. Энск, ул. Ленина, 1, кв. 2, невыплаченную заработную плату за май месяц 2017 года в сумме: 9800 (Девять тысяч восемьсот) рублей 00 коп."}]
[null,{"$f":"Дата!D2","v":"2017-06-26"}]
[{"$f":"Данные!B6","v":"     Настоящее удостоверение имеет силу исполнительного листа и предъявляется к исполнению не позднее 3-х месяцев со следующего дня его выдачи."}]
[{"$f":"Данные!B7","v":"     Налог на доходы физических лиц, налог в пенсионный фонд с указанной суммы удержаны."}]
[]
[null,{"$f":"Дата!B2","v":"2017-06-24"}]
[null,"Председатель КТС:",{"$f":"Данные!B8","v":"Антонова А.П."}]
[null,"Секретарь КТС:",{"$f":"Данные!B9","v":"Гашуткина Г.И."}]
[]
[]
[]
[]
[]
[]
[]
[]
[]
[]
[]
[]
[]
[null,"АКБ «ЧУВАШКРЕДИТПРОМБАНК» ПАО"]
[null,"Чувашская Республика, город Алатырь, улица Горшенина, 26"]
[null,"БИК 04970625"]
[null,{"$f":"VLOOKUP($A$3,Таблица!$A$2:$L$8,3)","v":"Иванова Ивана Ивановича"}]
[null,{"$f":"\"Паспорт: \"&VLOOKUP($A$3,Таблица!$A$2:$L$8,7)","v":"Паспорт: 98 01 № 123456 выдан Отделением УФМС России по Энской Республике в Энском районе 15 ноября 2007 г."}]
[null,{"$f":"\"Адрес: \"&VLOOKUP($A$3,Таблица!$A$2:$L$8,8)","v":"Адрес: Энская Республика, г. Энск, ул. Ленина, 1, кв. 2"}]
[null,{"$f":"\"ИНН \"&VLOOKUP($A$3,Таблица!$A$2:$L$8,9)","v":"ИНН 202201234567"}]
[{"$f":"Данные!C12&\" \"&A3&\" от \"&Дата!F2&\" года, \"&Данные!C13&Дата!I2&\" месяц \"&Дата!J2&\" года.\"","v":"     Предъявляется для взыскания с расчетного счета Общества с ограниченной ответственностью «Управление» № 12345678998745632145, открытого в АКБ «БАНККРЕДИТПРОСТОМБАНК» ПАО удостоверение комиссии по трудовым спорам Общества с ограниченной ответственностью «Управление» № 2 от 24 июня 2017 года, на выплату заработной платы за май месяц 2017 года."}]
[{"$f":"Данные!C14&FLOOR(VLOOKUP(A3,Таблица!A2:L8,11),1)&\" \"&VLOOKUP(A3,Таблица!A2:L8,12)&Данные!C15&VLOOKUP($A$3,Таблица!$A$2:$L$8,10)&Данные!C16","v":"     на сумму 9800 (Девять тысяч восемьсот) рублей 00 коп. к списанию в мою пользу на лицевой счет № 00000000000000000001 в АКБ «БАНККРЕДИТПРОСТОМБАНК» ПАО."}]
[null,{"$f":"Дата!B2","v":"2017-06-24"}]
[null,{"$f":"VLOOKUP($A$3,Таблица!$A$2:$L$8,2)","v":"Иванов Иван Иванович"}]
[null,"Фамилия Имя Отчество","Подпись"]

{"sheet":"Данные","index":5,"n_rows":16,"n_cols":3,"rows_kept":16,"cut":false,"hidden":false,"merged":[]}
[]
[null,"     Настоящее удостоверение выдано на основании Решения КТС Общества с ограниченной ответственностью «Управление» №","     Рассмотрев на заседании заявления работников Общества с ограниченной ответственностью «Управление» от "]
[null,"о взыскании невыплаченной своевременно заработной платы за "," о невыплате заработной платы за "]
[null,"     Взыскать с Общества с ограниченной ответственностью «Управление»  юридический адрес: 444444, г. Энска, мкр. Стройка, д. 1, Банковские реквизиты:  АКБ «БАНККРЕДИТПРОСТОМБАНК» ПАО г. Энска, р/счет 98765432100000123456, Кор. счет 98765432100000000123, ИНН 222004444, БИК 012345678 ","     Заявители – работники Общества с ограниченной ответственностью «Управление» просят взыскать с администрации Общества с ограниченной ответственностью «Управление» заработную плату за "]
[null,", невыплаченную заработную плату за ","     Факт невыплаты заработной платы подтверждается поданными заявлениями работников от "]
[null,"     Настоящее удостоверение имеет силу исполнительного листа и предъявляется к исполнению не позднее 3-х месяцев со следующего дня его выдачи.",", а ее сумма прилагаемыми справками о причитающейся заработной плате."]
[null,"     Налог на доходы физических лиц, налог в пенсионный фонд с указанной суммы удержаны.","     Выслушав стороны и исследовав документы, комиссия находит, что требования заявителей подлежать удовлетворению, так как в соответствии со ст. 136 Трудового кодекса РФ выплата заработной платы должна производиться не реже, чем каждые полмесяца."]
["Председатель КТС:","Антонова А.П.","     На основании изложенного, комиссия приняла единогласное решение удовлетворить требования заявителей о выплате заработной платы, и руководствуясь ст.ст. 383-395 Трудового кодекса РФ"]
["Секретарь КТС:","Гашуткина Г.И.","     Взыскать с Общества с ограниченной ответственностью «Управление» в пользу работников ООО «Управление» заработную плату на общую сумму "]
[null,null,"     Настоящее удостоверение выдано на основании Решения КТС Общества с ограниченной ответственностью «Управление» №"]
[null,null," о взыскании невыплаченной своевременно заработной платы за "]
[null,null,"     Предъявляется для взыскания с расчетного счета Общества с ограниченной ответственностью «Управление» № 12345678998745632145, открытого в АКБ «БАНККРЕДИТПРОСТОМБАНК» ПАО удостоверение комиссии по трудовым спорам Общества с ограниченной ответственностью «Управление» №"]
[null,null,"на выплату заработной платы за "]
[null,null,"     на сумму "]
[null,null," к списанию в мою пользу на лицевой счет № "]
[null,null," в АКБ «БАНККРЕДИТПРОСТОМБАНК» ПАО."]