{"text_format":"1","workbook":"xlsx","n_sheets":2,"sheets":["Лист1","Лист2"],"not_rendered":{"charts":0,"images":0,"macros":1,"external_links":0,"defined_names":2,"comments":0,"pivot_tables":0},"unopened":[],"bounds":{"document_bytes":16777216,"sheet_cells":100000,"rows_first":2000,"rows_last":500,"rows_between":2000,"halvings":0,"cell_chars":16384,"cell_head_chars":4096},"cells_cut":0,"cells_raw":0,"read":"whole","date_system":"1900"}

{"sheet":"Лист1","index":0,"n_rows":34,"n_cols":3,"rows_kept":34,"cut":false,"hidden":false,"merged":[[0,0,0,1]]}
["Диапазон"]
["от",1]
["до",13]
["действие","-"]
["действие","+"]
[]
[]
[]
[null,null,{"$f":"Лист2!A6&Лист2!A7&Лист2!A8","v":"1177"}]
[]
[]
[]
[]
[null,null,{"$f":"Лист2!A11&Лист2!A12&Лист2!A13","v":"636"}]
[]
{"$rows_left_out":20}
{"sheet":"Лист2","index":1,"n_rows":25,"n_cols":34,"rows_kept":25,"cut":false,"hidden":false,"merged":[]}
[{"$f":"RANDBETWEEN(Лист1!$B$2,Лист1!$B$3)","v":9},{"$f":"INDEX(Лист1!$B$4:$B$5,RANDBETWEEN(1,2))","v":"+"},{"$f":"IF(B1=Лист1!$B$4,RANDBETWEEN(Лист1!$B$2,A1),RANDBETWEEN(Лист1!$B$2,Лист1!$B$3))","v":1},"=",null,{"$f":"RANDBETWEEN(Лист1!$B$2,Лист1!$B$3)","v":4},{"$f":"INDEX(Лист1!$B$4:$B$5,RANDBETWEEN(1,2))","v":"-"},{"$f":"IF(G1=Лист1!$B$4,RANDBETWEEN(Лист1!$B$2,F1),RANDBETWEEN(Лист1!$B$2,Лист1!$B$3))","v":4},"=",null,{"$f":"RANDBETWEEN(Лист1!$B$2,Лист1!$B$3)","v":12},{"$f":"INDEX(Лист1!$B$4:$B$5,RANDBETWEEN(1,2))","v":"-"},{"$f":"IF(L1=Лист1!$B$4,RANDBETWEEN(Лист1!$B$2,K1),RANDBETWEEN(Лист1!$B$2,Лист1!$B$3))","v":6},"=",null,{"$f":"RANDBETWEEN(Лист1!$B$2,Лист1!$B$3)","v":10},{"$f":"INDEX(Лист1!$B$4:$B$5,RANDBETWEEN(1,2))","v":"-"},{"$f":"IF(Q1=Лист1!$B$4,RANDBETWEEN(Лист1!$B$2,P1),RANDBETWEEN(Лист1!$B$2,Лист1!$B$3))","v":7},"=",null,{"$f":"RANDBETWEEN(Лист1!$B$2,Лист1!$B$3)","v":11},{"$f":"INDEX(Лист1!$B$4:$B$5,RANDBETWEEN(1,2))","v":"+"},{"$f":"IF(V1=Лист1!$B$4,RANDBETWEEN(Лист1!$B$2,U1),RANDBETWEEN(Лист1!$B$2,Лист1!$B$3))","v":7},"=",null,{"$f":"RANDBETWEEN(Лист1!$B$2,Лист1!$B$3)","v":11},{"$f":"INDEX(Лист1!$B$4:$B$5,RANDBETWEEN(1,2))","v":"+"},{"$f":"IF(AA1=Лист1!$B$4,RANDBETWEEN(Лист1!$B$2,Z1),RANDBETWEEN(Лист1!$B$2,Лист1!$B$3))","v":8},"=",null,{"$f":"RANDBETWEEN(Лист1!$B$2,Лист1!$B$3)","v":8},{"$f":"INDEX(Лист1!$B$4:$B$5,RANDBETWEEN(1,2))","v":"-"},{"$f":"IF(AF1=Лист1!$B$4,RANDBETWEEN(Лист1!$B$2,AE1),RANDBETWEEN(Лист1!$B$2,Лист1!$B$3))","v":5},"="]
[{"$f":"RANDBETWEEN(Лист1!$B$2,Лист1!$B$3)","v":13},{"$f":"INDEX(Лист1!$B$4:$B$5,RANDBETWEEN(1,2))","v":"+"},{"$f":"IF(B2=Лист1!$B$4,RANDBETWEEN(Лист1!$B$2,A2),RANDBETWEEN(Лист1!$B$2,Лист1!$B$3))","v":13},"=",null,{"$f":"RANDBETWEEN(Лист1!$B$2,Лист1!$B$3)","v":5},{"$f":"INDEX(Лист1!$B$4:$B$5,RANDBETWEEN(1,2))","v":"+"},{"$f":"IF(G2=Лист1!$B$4,RANDBETWEEN(Лист1!$B$2,F2),RANDBETWEEN(Лист1!$B$2,Лист1!$B$3))","v":2},"=",null,{"$f":"RANDBETWEEN(Лист1!$B$2,Лист1!$B$3)","v":12},{"$f":"INDEX(Лист1!$B$4:$B$5,RANDBETWEEN(1,2))","v":"+"},{"$f":"IF(L2=Лист1!$B$4,RANDBETWEEN(Лист1!$B$2,K2),RANDBETWEEN(Лист1!$B$2,Лист1!$B$3))","v":12},"=",null,{"$f":"RANDBETWEEN(Лист1!$B$2,Лист1!$B$3)","v":7},{"$f":"INDEX(Лист1!$B$4:$B$5,RANDBETWEEN(1,2))","v":"-"},{"$f":"IF(Q2=Лист1!$B$4,RANDBETWEEN(Лист1!$B$2,P2),RANDBETWEEN(Лист1!$B$2,Лист1!$B$3))","v":5},"=",null,{"$f":"RANDBETWEEN(Лист1!$B$2,Лист1!$B$3)","v":7},{"$f":"INDEX(Лист1!$B$4:$B$5,RANDBETWEEN(1,2))","v":"-"},{"$f":"IF(V2=Лист1!$B$4,RANDBETWEEN(Лист1!$B$2,U2),RANDBETWEEN(Лист1!$B$2,Лист1!$B$3))","v":5},"=",null,{"$f":"RANDBETWEEN(Лист1!$B$2,Лист1!$B$3)","v":2},{"$f":"INDEX(Лист1!$B$4:$B$5,RANDBETWEEN(1,2))","v":"-"},{"$f":"IF(AA2=Лист1!$B$4,RANDBETWEEN(Лист1!$B$2,Z2),RANDBETWEEN(Лист1!$B$2,Лист1!$B$3))","v":1},"=",null,{"$f":"RANDBETWEEN(Лист1!$B$2,Лист1!$B$3)","v":13},{"$f":"INDEX(Лист1!$B$4:$B$5,RANDBETWEEN(1,2))","v":"-"},{"$f":"IF(AF2=Лист1!$B$4,RANDBETWEEN(Лист1!$B$2,AE2),RANDBETWEEN(Лист1!$B$2,Лист1!$B$3))","v":11},"="]
[{"$f":"RANDBETWEEN(Лист1!$B$2,Лист1!$B$3)","v":1},{"$f":"INDEX(Лист1!$B$4:$B$5,RANDBETWEEN(1,2))","v":"-"},{"$f":"IF(B3=Лист1!$B$4,RANDBETWEEN(Лист1!$B$2,A3),RANDBETWEEN(Лист1!$B$2,Лист1!$B$3))","v":1},"=",null,{"$f":"RANDBETWEEN(Лист1!$B$2,Лист1!$B$3)","v":7},{"$f":"INDEX(Лист1!$B$4:$B$5,RANDBETWEEN(1,2))","v":"+"},{"$f":"IF(G3=Лист1!$B$4,RANDBETWEEN(Лист1!$B$2,F3),RANDBETWEEN(Лист1!$B$2,Лист1!$B$3))","v":2},"=",null,{"$f":"RANDBETWEEN(Лист1!$B$2,Лист1!$B$3)","v":6},{"$f":"INDEX(Лист1!$B$4:$B$5,RANDBETWEEN(1,2))","v":"-"},{"$f":"IF(L3=Лист1!$B$4,RANDBETWEEN(Лист1!$B$2,K3),RANDBETWEEN(Лист1!$B$2,Лист1!$B$3))","v":6},"=",null,{"$f":"RANDBETWEEN(Лист1!$B$2,Лист1!$B$3)","v":8},{"$f":"INDEX(Лист1!$B$4:$B$5,RANDBETWEEN(1,2))","v":"-"},{"$f":"IF(Q3=Лист1!$B$4,RANDBETWEEN(Лист1!$B$2,P3),RANDBETWEEN(Лист1!$B$2,Лист1!$B$3))","v":2},"=",null,{"$f":"RANDBETWEEN(Лист1!$B$2,Лист1!$B$3)","v":11},{"$f":"INDEX(Лист1!$B$4:$B$5,RANDBETWEEN(1,2))","v":"-"},{"$f":"IF(V3=Лист1!$B$4,RANDBETWEEN(Лист1!$B$2,U3),RANDBETWEEN(Лист1!$B$2,Лист1!$B$3))","v":7},"=",null,{"$f":"RANDBETWEEN(Лист1!$B$2,Лист1!$B$3)","v":5},{"$f":"INDEX(Лист1!$B$4:$B$5,RANDBETWEEN(1,2))","v":"-"},{"$f":"IF(AA3=Лист1!$B$4,RANDBETWEEN(Лист1!$B$2,Z3),RANDBETWEEN(Лист1!$B$2,Лист1!$B$3))","v":3},"=",null,{"$f":"RANDBETWEEN(Лист1!$B$2,Лист1!$B$3)","v":12},{"$f":"INDEX(Лист1!$B$4:$B$5,RANDBETWEEN(1,2))","v":"+"},{"$f":"IF(AF3=Лист1!$B$4,RANDBETWEEN(Лист1!$B$2,AE3),RANDBETWEEN(Лист1!$B$2,Лист1!$B$3))","v":2},"="]
[{"$f":"RANDBETWEEN(Лист1!$B$2,Лист1!$B$3)","v":3},{"$f":"INDEX(Лист1!$B$4:$B$5,RANDBETWEEN(1,2))","v":"+"},{"$f":"IF(B4=Лист1!$B$4,RANDBETWEEN(Лист1!$B$2,A4),RANDBETWEEN(Лист1!$B$2,Лист1!$B$3))","v":7},"=",null,{"$f":"RANDBETWEEN(Лист1!$B$2,Лист1!$B$3)","v":7},{"$f":"INDEX(Лист1!$B$4:$B$5,RANDBETWEEN(1,2))","v":"-"},{"$f":"IF(G4=Лист1!$B$4,RANDBETWEEN(Лист1!$B$2,F4),RANDBETWEEN(Лист1!$B$2,Лист1!$B$3))","v":1},"=",null,{"$f":"RANDBETWEEN(Лист1!$B$2,Лист1!$B$3)","v":11},{"$f":"INDEX(Лист1!$B$4:$B$5,RANDBETWEEN(1,2))","v":"+"},{"$f":"IF(L4=Лист1!$B$4,RANDBETWEEN(Лист1!$B$2,K4),RANDBETWEEN(Лист1!$B$2,Лист1!$B$3))","v":5},"=",null,{"$f":"RANDBETWEEN(Лист1!$B$2,Лист1!$B$3)","v":4},{"$f":"INDEX(Лист1!$B$4:$B$5,RANDBETWEEN(1,2))","v":"+"},{"$f":"IF(Q4=Лист1!$B$4,RANDBETWEEN(Лист1!$B$2,P4),RANDBETWEEN(Лист1!$B$2,Лист1!$B$3))","v":2},"=",null,{"$f":"RANDBETWEEN(Лист1!$B$2,Лист1!$B$3)","v":4},{"$f":"INDEX(Лист1!$B$4:$B$5,RANDBETWEEN(1,2))","v":"+"},{"$f":"IF(V4=Лист1!$B$4,RANDBETWEEN(Лист1!$B$2,U4),RANDBETWEEN(Лист1!$B$2,Лист1!$B$3))","v":10},"=",null,{"$f":"RANDBETWEEN(Лист1!$B$2,Лист1!$B$3)","v":6},{"$f":"INDEX(Лист1!$B$4:$B$5,RANDBETWEEN(1,2))","v":"+"},{"$f":"IF(AA4=Лист1!$B$4,RANDBETWEEN(Лист1!$B$2,Z4),RANDBETWEEN(Лист1!$B$2,Лист1!$B$3))","v":7},"=",null,{"$f":"RANDBETWEEN(Лист1!$B$2,Лист1!$B$3)","v":9},{"$f":"INDEX(Лист1!$B$4:$B$5,RANDBETWEEN(1,2))","v":"+"},{"$f":"IF(AF4=Лист1!$B$4,RANDBETWEEN(Лист1!$B$2,AE4),RANDBETWEEN(Лист1!$B$2,Лист1!$B$3))","v":12},"="]
[{"$f":"RANDBETWEEN(Лист1!$B$2,Лист1!$B$3)","v":7},{"$f":"INDEX(Лист1!$B$4:$B$5,RANDBETWEEN(1,2))","v":"+"},{"$f":"IF(B5=Лист1!$B$4,RANDBETWEEN(Лист1!$B$2,A5),RANDBETWEEN(Лист1!$B$2,Лист1!$B$3))","v":4},"=",null,{"$f":"RANDBETWEEN(Лист1!$B$2,Лист1!$B$3)","v":10},{"$f":"INDEX(Лист1!$B$4:$B$5,RANDBETWEEN(1,2))","v":"-"},{"$f":"IF(G5=Лист1!$B$4,RANDBETWEEN(Лист1!$B$2,F5),RANDBETWEEN(Лист1!$B$2,Лист1!$B$3))","v":6},"=",null,{"$f":"RANDBETWEEN(Лист1!$B$2,Лист1!$B$3)","v":8},{"$f":"INDEX(Лист1!$B$4:$B$5,RANDBETWEEN(1,2))","v":"-"},{"$f":"IF(L5=Лист1!$B$4,RANDBETWEEN(Лист1!$B$2,K5),RANDBETWEEN(Лист1!$B$2,Лист1!$B$3))","v":8},"=",null,{"$f":"RANDBETWEEN(Лист1!$B$2,Лист1!$B$3)","v":11},{"$f":"INDEX(Лист1!$B$4:$B$5,RANDBETWEEN(1,2))","v":"-"},{"$f":"IF(Q5=Лист1!$B$4,RANDBETWEEN(Лист1!$B$2,P5),RANDBETWEEN(Лист1!$B$2,Лист1!$B$3))","v":7},"=",null,{"$f":"RANDBETWEEN(Лист1!$B$2,Лист1!$B$3)","v":7},{"$f":"INDEX(Лист1!$B$4:$B$5,RANDBETWEEN(1,2))","v":"+"},{"$f":"IF(V5=Лист1!$B$4,RANDBETWEEN(Лист1!$B$2,U5),RANDBETWEEN(Лист1!$B$2,Лист1!$B$3))","v":4},"=",null,{"$f":"RANDBETWEEN(Лист1!$B$2,Лист1!$B$3)","v":10},{"$f":"INDEX(Лист1!$B$4:$B$5,RANDBETWEEN(1,2))","v":"+"},{"$f":"IF(AA5=Лист1!$B$4,RANDBETWEEN(Лист1!$B$2,Z5),RANDBETWEEN(Лист1!$B$2,Лист1!$B$3))","v":13},"=",null,{"$f":"RANDBETWEEN(Лист1!$B$2,Лист1!$B$3)","v":5},{"$f":"INDEX(Лист1!$B$4:$B$5,RANDBETWEEN(1,2))","v":"-"},{"$f":"IF(AF5=Лист1!$B$4,RANDBETWEEN(Лист1!$B$2,AE5),RANDBETWEEN(Лист1!$B$2,Лист1!$B$3))","v":5},"="]
[{"$f":"RANDBETWEEN(Лист1!$B$2,Лист1!$B$3)","v":11},{"$f":"INDEX(Лист1!$B$4:$B$5,RANDBETWEEN(1,2))","v":"-"},{"$f":"IF(B6=Лист1!$B$4,RANDBETWEEN(Лист1!$B$2,A6),RANDBETWEEN(Лист1!$B$2,Лист1!$B$3))","v":1},"=",null,{"$f":"RANDBETWEEN(Лист1!$B$2,Лист1!$B$3)","v":5},{"$f":"INDEX(Лист1!$B$4:$B$5,RANDBETWEEN(1,2))","v":"-"},{"$f":"IF(G6=Лист1!$B$4,RANDBETWEEN(Лист1!$B$2,F6),RANDBETWEEN(Лист1!$B$2,Лист1!$B$3))","v":3},"=",null,{"$f":"RANDBETWEEN(Лист1!$B$2,Лист1!$B$3)","v":3},{"$f":"INDEX(Лист1!$B$4:$B$5,RANDBETWEEN(1,2))","v":"-"},{"$f":"IF(L6=Лист1!$B$4,RANDBETWEEN(Лист1!$B$2,K6),RANDBETWEEN(Лист1!$B$2,Лист1!$B$3))","v":2},"=",null,{"$f":"RANDBETWEEN(Лист1!$B$2,Лист1!$B$3)","v":6},{"$f":"INDEX(Лист1!$B$4:$B$5,RANDBETWEEN(1,2))","v":"+"},{"$f":"IF(Q6=Лист1!$B$4,RANDBETWEEN(Лист1!$B$2,P6),RANDBETWEEN(Лист1!$B$2,Лист1!$B$3))","v":12},"=",null,{"$f":"RANDBETWEEN(Лист1!$B$2,Лист1!$B$3)","v":8},{"$f":"INDEX(Лист1!$B$4:$B$5,RANDBETWEEN(1,2))","v":"+"},{"$f":"IF(V6=Лист1!$B$4,RANDBETWEEN(Лист1!$B$2,U6),RANDBETWEEN(Лист1!$B$2,Лист1!$B$3))","v":8},"=",null,{"$f":"RANDBETWEEN(Лист1!$B$2,Лист1!$B$3)","v":10},{"$f":"INDEX(Лист1!$B$4:$B$5,RANDBETWEEN(1,2))","v":"+"},{"$f":"IF(AA6=Лист1!$B$4,RANDBETWEEN(Лист1!$B$2,Z6),RANDBETWEEN(Лист1!$B$2,Лист1!$B$3))","v":11},"=",null,{"$f":"RANDBETWEEN(Лист1!$B$2,Лист1!$B$3)","v":6},{"$f":"INDEX(Лист1!$B$4:$B$5,RANDBETWEEN(1,2))","v":"+"},{"$f":"IF(AF6=Лист1!$B$4,RANDBETWEEN(Лист1!$B$2,AE6),RANDBETWEEN(Лист1!$B$2,Лист1!$B$3))","v":12},"="]
[{"$f":"RANDBETWEEN(Лист1!$B$2,Лист1!$B$3)","v":7},{"$f":"INDEX(Лист1!$B$4:$B$5,RANDBETWEEN(1,2))","v":"-"},{"$f":"IF(B7=Лист1!$B$4,RANDBETWEEN(Лист1!$B$2,A7),RANDBETWEEN(Лист1!$B$2,Лист1!$B$3))","v":6},"=",null,{"$f":"RANDBETWEEN(Лист1!$B$2,Лист1!$B$3)","v":6},{"$f":"INDEX(Лист1!$B$4:$B$5,RANDBETWEEN(1,2))","v":"+"},{"$f":"IF(G7=Лист1!$B$4,RANDBETWEEN(Лист1!$B$2,F7),RANDBETWEEN(Лист1!$B$2,Лист1!$B$3))","v":11},"=",null,{"$f":"RANDBETWEEN(Лист1!$B$2,Лист1!$B$3)","v":12},{"$f":"INDEX(Лист1!$B$4:$B$5,RANDBETWEEN(1,2))","v":"+"},{"$f":"IF(L7=Лист1!$B$4,RANDBETWEEN(Лист1!$B$2,K7),RANDBETWEEN(Лист1!$B$2,Лист1!$B$3))","v":8},"=",null,{"$f":"RANDBETWEEN(Лист1!$B$2,Лист1!$B$3)","v":2},{"$f":"INDEX(Лист1!$B$4:$B$5,RANDBETWEEN(1,2))","v":"+"},{"$f":"IF(Q7=Лист1!$B$4,RANDBETWEEN(Лист1!$B$2,P7),RANDBETWEEN(Лист1!$B$2,Лист1!$B$3))","v":1},"=",null,{"$f":"RANDBETWEEN(Лист1!$B$2,Лист1!$B$3)","v":6},{"$f":"INDEX(Лист1!$B$4:$B$5,RANDBETWEEN(1,2))","v":"-"},{"$f":"IF(V7=Лист1!$B$4,RANDBETWEEN(Лист1!$B$2,U7),RANDBETWEEN(Лист1!$B$2,Лист1!$B$3))","v":5},"=",null,{"$f":"RANDBETWEEN(Лист1!$B$2,Лист1!$B$3)","v":6},{"$f":"INDEX(Лист1!$B$4:$B$5,RANDBETWEEN(1,2))","v":"-"},{"$f":"IF(AA7=Лист1!$B$4,RANDBETWEEN(Лист1!$B$2,Z7),RANDBETWEEN(Лист1!$B$2,Лист1!$B$3))","v":6},"=",null,{"$f":"RANDBETWEEN(Лист1!$B$2,Лист1!$B$3)","v":13},{"$f":"INDEX(Лист1!$B$4:$B$5,RANDBETWEEN(1,2))","v":"+"},{"$f":"IF(AF7=Лист1!$B$4,RANDBETWEEN(Лист1!$B$2,AE7),RANDBETWEEN(Лист1!$B$2,Лист1!$B$3))","v":3},"="]
[{"$f":"RANDBETWEEN(Лист1!$B$2,Лист1!$B$3)","v":7},{"$f":"INDEX(Лист1!$B$4:$B$5,RANDBETWEEN(1,2))","v":"+"},{"$f":"IF(B8=Лист1!$B$4,RANDBETWEEN(Лист1!$B$2,A8),RANDBETWEEN(Лист1!$B$2,Лист1!$B$3))","v":9},"=",null,{"$f":"RANDBETWEEN(Лист1!$B$2,Лист1!$B$3)","v":12},{"$f":"INDEX(Лист1!$B$4:$B$5,RANDBETWEEN(1,2))","v":"-"},{"$f":"IF(G8=Лист1!$B$4,RANDBETWEEN(Лист1!$B$2,F8),RANDBETWEEN(Лист1!$B$2,Лист1!$B$3))","v":6},"=",null,{"$f":"RANDBETWEEN(Лист1!$B$2,Лист1!$B$3)","v":13},{"$f":"INDEX(Лист1!$B$4:$B$5,RANDBETWEEN(1,2))","v":"-"},{"$f":"IF(L8=Лист1!$B$4,RANDBETWEEN(Лист1!$B$2,K8),RANDBETWEEN(Лист1!$B$2,Лист1!$B$3))","v":5},"=",null,{"$f":"RANDBETWEEN(Лист1!$B$2,Лист1!$B$3)","v":12},{"$f":"INDEX(Лист1!$B$4:$B$5,RANDBETWEEN(1,2))","v":"+"},{"$f":"IF(Q8=Лист1!$B$4,RANDBETWEEN(Лист1!$B$2,P8),RANDBETWEEN(Лист1!$B$2,Лист1!$B$3))","v":9},"=",null,{"$f":"RANDBETWEEN(Лист1!$B$2,Лист1!$B$3)","v":5},{"$f":"INDEX(Лист1!$B$4:$B$5,RANDBETWEEN(1,2))","v":"+"},{"$f":"IF(V8=Лист1!$B$4,RANDBETWEEN(Лист1!$B$2,U8),RANDBETWEEN(Лист1!$B$2,Лист1!$B$3))","v":1},"=",null,{"$f":"RANDBETWEEN(Лист1!$B$2,Лист1!$B$3)","v":10},{"$f":"INDEX(Лист1!$B$4:$B$5,RANDBETWEEN(1,2))","v":"+"},{"$f":"IF(AA8=Лист1!$B$4,RANDBETWEEN(Лист1!$B$2,Z8),RANDBETWEEN(Лист1!$B$2,Лист1!$B$3))","v":3},"=",null,{"$f":"RANDBETWEEN(Лист1!$B$2,Лист1!$B$3)","v":5},{"$f":"INDEX(Лист1!$B$4:$B$5,RANDBETWEEN(1,2))","v":"-"},{"$f":"IF(AF8=Лист1!$B$4,RANDBETWEEN(Лист1!$B$2,AE8),RANDBETWEEN(Лист1!$B$2,Лист1!$B$3))","v":2},"="]
[{"$f":"RANDBETWEEN(Лист1!$B$2,Лист1!$B$3)","v":3},{"$f":"INDEX(Лист1!$B$4:$B$5,RANDBETWEEN(1,2))","v":"-"},{"$f":"IF(B9=Лист1!$B$4,RANDBETWEEN(Лист1!$B$2,A9),RANDBETWEEN(Лист1!$B$2,Лист1!$B$3))","v":3},"=",null,{"$f":"RANDBETWEEN(Лист1!$B$2,Лист1!$B$3)","v":1},{"$f":"INDEX(Лист1!$B$4:$B$5,RANDBETWEEN(1,2))","v":"+"},{"$f":"IF(G9=Лист1!$B$4,RANDBETWEEN(Лист1!$B$2,F9),RANDBETWEEN(Лист1!$B$2,Лист1!$B$3))","v":2},"=",null,{"$f":"RANDBETWEEN(Лист1!$B$2,Лист1!$B$3)","v":11},{"$f":"INDEX(Лист1!$B$4:$B$5,RANDBETWEEN(1,2))","v":"+"},{"$f":"IF(L9=Лист1!$B$4,RANDBETWEEN(Лист1!$B$2,K9),RANDBETWEEN(Лист1!$B$2,Лист1!$B$3))","v":8},"=",null,{"$f":"RANDBETWEEN(Лист1!$B$2,Лист1!$B$3)","v":12},{"$f":"INDEX(Лист1!$B$4:$B$5,RANDBETWEEN(1,2))","v":"-"},{"$f":"IF(Q9=Лист1!$B$4,RANDBETWEEN(Лист1!$B$2,P9),RANDBETWEEN(Лист1!$B$2,Лист1!$B$3))","v":8},"=",null,{"$f":"RANDBETWEEN(Лист1!$B$2,Лист1!$B$3)","v":7},{"$f":"INDEX(Лист1!$B$4:$B$5,RANDBETWEEN(1,2))","v":"-"},{"$f":"IF(V9=Лист1!$B$4,RANDBETWEEN(Лист1!$B$2,U9),RANDBETWEEN(Лист1!$B$2,Лист1!$B$3))","v":1},"=",null,{"$f":"RANDBETWEEN(Лист1!$B$2,Лист1!$B$3)","v":4},{"$f":"INDEX(Лист1!$B$4:$B$5,RANDBETWEEN(1,2))","v":"-"},{"$f":"IF(AA9=Лист1!$B$4,RANDBETWEEN(Лист1!$B$2,Z9),RANDBETWEEN(Лист1!$B$2,Лист1!$B$3))","v":1},"=",null,{"$f":"RANDBETWEEN(Лист1!$B$2,Лист1!$B$3)","v":1},{"$f":"INDEX(Лист1!$B$4:$B$5,RANDBETWEEN(1,2))","v":"-"},{"$f":"IF(AF9=Лист1!$B$4,RANDBETWEEN(Лист1!$B$2,AE9),RANDBETWEEN(Лист1!$B$2,Лист1!$B$3))","v":1},"="]
[{"$f":"RANDBETWEEN(Лист1!$B$2,Лист1!$B$3)","v":9},{"$f":"INDEX(Лист1!$B$4:$B$5,RANDBETWEEN(1,2))","v":"-"},{"$f":"IF(B10=Лист1!$B$4,RANDBETWEEN(Лист1!$B$2,A10),RANDBETWEEN(Лист1!$B$2,Лист1!$B$3))","v":4},"=",null,{"$f":"RANDBETWEEN(Лист1!$B$2,Лист1!$B$3)","v":10},{"$f":"INDEX(Лист1!$B$4:$B$5,RANDBETWEEN(1,2))","v":"+"},{"$f":"IF(G10=Лист1!$B$4,RANDBETWEEN(Лист1!$B$2,F10),RANDBETWEEN(Лист1!$B$2,Лист1!$B$3))","v":13},"=",null,{"$f":"RANDBETWEEN(Лист1!$B$2,Лист1!$B$3)","v":10},{"$f":"INDEX(Лист1!$B$4:$B$5,RANDBETWEEN(1,2))","v":"+"},{"$f":"IF(L10=Лист1!$B$4,RANDBETWEEN(Лист1!$B$2,K10),RANDBETWEEN(Лист1!$B$2,Лист1!$B$3))","v":3},"=",null,{"$f":"RANDBETWEEN(Лист1!$B$2,Лист1!$B$3)","v":8},{"$f":"INDEX(Лист1!$B$4:$B$5,RANDBETWEEN(1,2))","v":"+"},{"$f":"IF(Q10=Лист1!$B$4,RANDBETWEEN(Лист1!$B$2,P10),RANDBETWEEN(Лист1!$B$2,Лист1!$B$3))","v":2},"=",null,{"$f":"RANDBETWEEN(Лист1!$B$2,Лист1!$B$3)","v":10},{"$f":"INDEX(Лист1!$B$4:$B$5,RANDBETWEEN(1,2))","v":"+"},{"$f":"IF(V10=Лист1!$B$4,RANDBETWEEN(Лист1!$B$2,U10),RANDBETWEEN(Лист1!$B$2,Лист1!$B$3))","v":7},"=",null,{"$f":"RANDBETWEEN(Лист1!$B$2,Лист1!$B$3)","v":5},{"$f":"INDEX(Лист1!$B$4:$B$5,RANDBETWEEN(1,2))","v":"+"},{"$f":"IF(AA10=Лист1!$B$4,RANDBETWEEN(Лист1!$B$2,Z10),RANDBETWEEN(Лист1!$B$2,Лист1!$B$3))","v":6},"=",null,{"$f":"RANDBETWEEN(Лист1!$B$2,Лист1!$B$3)","v":12},{"$f":"INDEX(Лист1!$B$4:$B$5,RANDBETWEEN(1,2))","v":"-"},{"$f":"IF(AF10=Лист1!$B$4,RANDBETWEEN(Лист1!$B$2,AE10),RANDBETWEEN(Лист1!$B$2,Лист1!$B$3))","v":10},"="]
[{"$f":"RANDBETWEEN(Лист1!$B$2,Лист1!$B$3)","v":6},{"$f":"INDEX(Лист1!$B$4:$B$5,RANDBETWEEN(1,2))","v":"+"},{"$f":"IF(B11=Лист1!$B$4,RANDBETWEEN(Лист1!$B$2,A11),RANDBETWEEN(Лист1!$B$2,Лист1!$B$3))","v":6},"=",null,{"$f":"RANDBETWEEN(Лист1!$B$2,Лист1!$B$3)","v":5},{"$f":"INDEX(Лист1!$B$4:$B$5,RANDBETWEEN(1,2))","v":"+"},{"$f":"IF(G11=Лист1!$B$4,RANDBETWEEN(Лист1!$B$2,F11),RANDBETWEEN(Лист1!$B$2,Лист1!$B$3))","v":7},"=",null,{"$f":"RANDBETWEEN(Лист1!$B$2,Лист1!$B$3)","v":10},{"$f":"INDEX(Лист1!$B$4:$B$5,RANDBETWEEN(1,2))","v":"-"},{"$f":"IF(L11=Лист1!$B$4,RANDBETWEEN(Лист1!$B$2,K11),RANDBETWEEN(Лист1!$B$2,Лист1!$B$3))","v":10},"=",null,{"$f":"RANDBETWEEN(Лист1!$B$2,Лист1!$B$3)","v":11},{"$f":"INDEX(Лист1!$B$4:$B$5,RANDBETWEEN(1,2))","v":"+"},{"$f":"IF(Q11=Лист1!$B$4,RANDBETWEEN(Лист1!$B$2,P11),RANDBETWEEN(Лист1!$B$2,Лист1!$B$3))","v":13},"=",null,{"$f":"RANDBETWEEN(Лист1!$B$2,Лист1!$B$3)","v":2},{"$f":"INDEX(Лист1!$B$4:$B$5,RANDBETWEEN(1,2))","v":"-"},{"$f":"IF(V11=Лист1!$B$4,RANDBETWEEN(Лист1!$B$2,U11),RANDBETWEEN(Лист1!$B$2,Лист1!$B$3))","v":2},"=",null,{"$f":"RANDBETWEEN(Лист1!$B$2,Лист1!$B$3)","v":3},{"$f":"INDEX(Лист1!$B$4:$B$5,RANDBETWEEN(1,2))","v":"+"},{"$f":"IF(AA11=Лист1!$B$4,RANDBETWEEN(Лист1!$B$2,Z11),RANDBETWEEN(Лист1!$B$2,Лист1!$B$3))","v":8},"=",null,{"$f":"RANDBETWEEN(Лист1!$B$2,Лист1!$B$3)","v":10},{"$f":"INDEX(Лист1!$B$4:$B$5,RANDBETWEEN(1,2))","v":"-"},{"$f":"IF(AF11=Лист1!$B$4,RANDBETWEEN(Лист1!$B$2,AE11),RANDBETWEEN(Лист1!$B$2,Лист1!$B$3))","v":7},"="]
[{"$f":"RANDBETWEEN(Лист1!$B$2,Лист1!$B$3)","v":3},{"$f":"INDEX(Лист1!$B$4:$B$5,RANDBETWEEN(1,2))","v":"-"},{"$f":"IF(B12=Лист1!$B$4,RANDBETWEEN(Лист1!$B$2,A12),RANDBETWEEN(Лист1!$B$2,Лист1!$B$3))","v":1},"=",null,{"$f":"RANDBETWEEN(Лист1!$B$2,Лист1!$B$3)","v":7},{"$f":"INDEX(Лист1!$B$4:$B$5,RANDBETWEEN(1,2))","v":"-"},{"$f":"IF(G12=Лист1!$B$4,RANDBETWEEN(Лист1!$B$2,F12),RANDBETWEEN(Лист1!$B$2,Лист1!$B$3))","v":6},"=",null,{"$f":"RANDBETWEEN(Лист1!$B$2,Лист1!$B$3)","v":6},{"$f":"INDEX(Лист1!$B$4:$B$5,RANDBETWEEN(1,2))","v":"-"},{"$f":"IF(L12=Лист1!$B$4,RANDBETWEEN(Лист1!$B$2,K12),RANDBETWEEN(Лист1!$B$2,Лист1!$B$3))","v":3},"=",null,{"$f":"RANDBETWEEN(Лист1!$B$2,Лист1!$B$3)","v":11},{"$f":"INDEX(Лист1!$B$4:$B$5,RANDBETWEEN(1,2))","v":"+"},{"$f":"IF(Q12=Лист1!$B$4,RANDBETWEEN(Лист1!$B$2,P12),RANDBETWEEN(Лист1!$B$2,Лист1!$B$3))","v":7},"=",null,{"$f":"RANDBETWEEN(Лист1!$B$2,Лист1!$B$3)","v":8},{"$f":"INDEX(Лист1!$B$4:$B$5,RANDBETWEEN(1,2))","v":"-"},{"$f":"IF(V12=Лист1!$B$4,RANDBETWEEN(Лист1!$B$2,U12),RANDBETWEEN(Лист1!$B$2,Лист1!$B$3))","v":2},"=",null,{"$f":"RANDBETWEEN(Лист1!$B$2,Лист1!$B$3)","v":13},{"$f":"INDEX(Лист1!$B$4:$B$5,RANDBETWEEN(1,2))","v":"-"},{"$f":"IF(AA12=Лист1!$B$4,RANDBETWEEN(Лист1!$B$2,Z12),RANDBETWEEN(Лист1!$B$2,Лист1!$B$3))","v":1},"=",null,{"$f":"RANDBETWEEN(Лист1!$B$2,Лист1!$B$3)","v":2},{"$f":"INDEX(Лист1!$B$4:$B$5,RANDBETWEEN(1,2))","v":"+"},{"$f":"IF(AF12=Лист1!$B$4,RANDBETWEEN(Лист1!$B$2,AE12),RANDBETWEEN(Лист1!$B$2,Лист1!$B$3))","v":4},"="]
[{"$f":"RANDBETWEEN(Лист1!$B$2,Лист1!$B$3)","v":6},{"$f":"INDEX(Лист1!$B$4:$B$5,RANDBETWEEN(1,2))","v":"-"},{"$f":"IF(B13=Лист1!$B$4,RANDBETWEEN(Лист1!$B$2,A13),RANDBETWEEN(Лист1!$B$2,Лист1!$B$3))","v":2},"=",null,{"$f":"RANDBETWEEN(Лист1!$B$2,Лист1!$B$3)","v":1},{"$f":"INDEX(Лист1!$B$4:$B$5,RANDBETWEEN(1,2))","v":"-"},{"$f":"IF(G13=Лист1!$B$4,RANDBETWEEN(Лист1!$B$2,F13),RANDBETWEEN(Лист1!$B$2,Лист1!$B$3))","v":1},"=",null,{"$f":"RANDBETWEEN(Лист1!$B$2,Лист1!$B$3)","v":1},{"$f":"INDEX(Лист1!$B$4:$B$5,RANDBETWEEN(1,2))","v":"-"},{"$f":"IF(L13=Лист1!$B$4,RANDBETWEEN(Лист1!$B$2,K13),RANDBETWEEN(Лист1!$B$2,Лист1!$B$3))","v":1},"=",null,{"$f":"RANDBETWEEN(Лист1!$B$2,Лист1!$B$3)","v":7},{"$f":"INDEX(Лист1!$B$4:$B$5,RANDBETWEEN(1,2))","v":"-"},{"$f":"IF(Q13=Лист1!$B$4,RANDBETWEEN(Лист1!$B$2,P13),RANDBETWEEN(Лист1!$B$2,Лист1!$B$3))","v":2},"=",null,{"$f":"RANDBETWEEN(Лист1!$B$2,Лист1!$B$3)","v":11},{"$f":"INDEX(Лист1!$B$4:$B$5,RANDBETWEEN(1,2))","v":"-"},{"$f":"IF(V13=Лист1!$B$4,RANDBETWEEN(Лист1!$B$2,U13),RANDBETWEEN(Лист1!$B$2,Лист1!$B$3))","v":9},"=",null,{"$f":"RANDBETWEEN(Лист1!$B$2,Лист1!$B$3)","v":4},{"$f":"INDEX(Лист1!$B$4:$B$5,RANDBETWEEN(1,2))","v":"+"},{"$f":"IF(AA13=Лист1!$B$4,RANDBETWEEN(Лист1!$B$2,Z13),RANDBETWEEN(Лист1!$B$2,Лист1!$B$3))","v":12},"=",null,{"$f":"RANDBETWEEN(Лист1!$B$2,Лист1!$B$3)","v":7},{"$f":"INDEX(Лист1!$B$4:$B$5,RANDBETWEEN(1,2))","v":"+"},{"$f":"IF(AF13=Лист1!$B$4,RANDBETWEEN(Лист1!$B$2,AE13),RANDBETWEEN(Лист1!$B$2,Лист1!$B$3))","v":7},"="]
[{"$f":"RANDBETWEEN(Лист1!$B$2,Лист1!$B$3)","v":7},{"$f":"INDEX(Лист1!$B$4:$B$5,RANDBETWEEN(1,2))","v":"+"},{"$f":"IF(B14=Лист1!$B$4,RANDBETWEEN(Лист1!$B$2,A14),RANDBETWEEN(Лист1!$B$2,Лист1!$B$3))","v":13},"=",null,{"$f":"RANDBETWEEN(Лист1!$B$2,Лист1!$B$3)","v":4},{"$f":"INDEX(Лист1!$B$4:$B$5,RANDBETWEEN(1,2))","v":"-"},{"$f":"IF(G14=Лист1!$B$4,RANDBETWEEN(Лист1!$B$2,F14),RANDBETWEEN(Лист1!$B$2,Лист1!$B$3))","v":4},"=",null,{"$f":"RANDBETWEEN(Лист1!$B$2,Лист1!$B$3)","v":9},{"$f":"INDEX(Лист1!$B$4:$B$5,RANDBETWEEN(1,2))","v":"-"},{"$f":"IF(L14=Лист1!$B$4,RANDBETWEEN(Лист1!$B$2,K14),RANDBETWEEN(Лист1!$B$2,Лист1!$B$3))","v":8},"=",null,{"$f":"RANDBETWEEN(Лист1!$B$2,Лист1!$B$3)","v":4},{"$f":"INDEX(Лист1!$B$4:$B$5,RANDBETWEEN(1,2))","v":"-"},{"$f":"IF(Q14=Лист1!$B$4,RANDBETWEEN(Лист1!$B$2,P14),RANDBETWEEN(Лист1!$B$2,Лист1!$B$3))","v":2},"=",null,{"$f":"RANDBETWEEN(Лист1!$B$2,Лист1!$B$3)","v":5},{"$f":"INDEX(Лист1!$B$4:$B$5,RANDBETWEEN(1,2))","v":"-"},{"$f":"IF(V14=Лист1!$B$4,RANDBETWEEN(Лист1!$B$2,U14),RANDBETWEEN(Лист1!$B$2,Лист1!$B$3))","v":2},"=",null,{"$f":"RANDBETWEEN(Лист1!$B$2,Лист1!$B$3)","v":9},{"$f":"INDEX(Лист1!$B$4:$B$5,RANDBETWEEN(1,2))","v":"-"},{"$f":"IF(AA14=Лист1!$B$4,RANDBETWEEN(Лист1!$B$2,Z14),RANDBETWEEN(Лист1!$B$2,Лист1!$B$3))","v":4},"=",null,{"$f":"RANDBETWEEN(Лист1!$B$2,Лист1!$B$3)","v":13},{"$f":"INDEX(Лист1!$B$4:$B$5,RANDBETWEEN(1,2))","v":"-"},{"$f":"IF(AF14=Лист1!$B$4,RANDBETWEEN(Лист1!$B$2,AE14),RANDBETWEEN(Лист1!$B$2,Лист1!$B$3))","v":3},"="]
[{"$f":"RANDBETWEEN(Лист1!$B$2,Лист1!$B$3)","v":9},{"$f":"INDEX(Лист1!$B$4:$B$5,RANDBETWEEN(1,2))","v":"+"},{"$f":"IF(B15=Лист1!$B$4,RANDBETWEEN(Лист1!$B$2,A15),RANDBETWEEN(Лист1!$B$2,Лист1!$B$3))","v":5},"=",null,{"$f":"RANDBETWEEN(Лист1!$B$2,Лист1!$B$3)","v":9},{"$f":"INDEX(Лист1!$B$4:$B$5,RANDBETWEEN(1,2))","v":"+"},{"$f":"IF(G15=Лист1!$B$4,RANDBETWEEN(Лист1!$B$2,F15),RANDBETWEEN(Лист1!$B$2,Лист1!$B$3))","v":4},"=",null,{"$f":"RANDBETWEEN(Лист1!$B$2,Лист1!$B$3)","v":4},{"$f":"INDEX(Лист1!$B$4:$B$5,RANDBETWEEN(1,2))","v":"-"},{"$f":"IF(L15=Лист1!$B$4,RANDBETWEEN(Лист1!$B$2,K15),RANDBETWEEN(Лист1!$B$2,Лист1!$B$3))","v":1},"=",null,{"$f":"RANDBETWEEN(Лист1!$B$2,Лист1!$B$3)","v":13},{"$f":"INDEX(Лист1!$B$4:$B$5,RANDBETWEEN(1,2))","v":"+"},{"$f":"IF(Q15=Лист1!$B$4,RANDBETWEEN(Лист1!$B$2,P15),RANDBETWEEN(Лист1!$B$2,Лист1!$B$3))","v":5},"=",null,{"$f":"RANDBETWEEN(Лист1!$B$2,Лист1!$B$3)","v":7},{"$f":"INDEX(Лист1!$B$4:$B$5,RANDBETWEEN(1,2))","v":"-"},{"$f":"IF(V15=Лист1!$B$4,RANDBETWEEN(Лист1!$B$2,U15),RANDBETWEEN(Лист1!$B$2,Лист1!$B$3))","v":6},"=",null,{"$f":"RANDBETWEEN(Лист1!$B$2,Лист1!$B$3)","v":5},{"$f":"INDEX(Лист1!$B$4:$B$5,RANDBETWEEN(1,2))","v":"+"},{"$f":"IF(AA15=Лист1!$B$4,RANDBETWEEN(Лист1!$B$2,Z15),RANDBETWEEN(Лист1!$B$2,Лист1!$B$3))","v":12},"=",null,{"$f":"RANDBETWEEN(Лист1!$B$2,Лист1!$B$3)","v":9},{"$f":"INDEX(Лист1!$B$4:$B$5,RANDBETWEEN(1,2))","v":"+"},{"$f":"IF(AF15=Лист1!$B$4,RANDBETWEEN(Лист1!$B$2,AE15),RANDBETWEEN(Лист1!$B$2,Лист1!$B$3))","v":9},"="]
{"$rows_left_out":10}