{"text_format":"1","workbook":"xlsx","n_sheets":8,"sheets":["м","ОСН","плавание (2)","отжимание (2)","Стрельба (2)","плавание","отжимание","Стрельба"],"not_rendered":{"charts":0,"images":0,"macros":1,"external_links":1,"defined_names":7,"comments":0,"pivot_tables":0},"unopened":[],"bounds":{"document_bytes":16777216,"sheet_cells":100000,"rows_first":2000,"rows_last":500,"rows_between":2000,"halvings":0,"cell_chars":16384,"cell_head_chars":4096},"cells_cut":0,"cells_raw":0,"read":"whole","date_system":"1900"}

{"sheet":"м","index":0,"n_rows":23,"n_cols":30,"rows_kept":23,"cut":false,"hidden":false,"merged":[[2,20,2,22],[2,23,2,24],[2,25,2,27],[1,27,1,28],[0,0,0,28],[2,5,3,5],[2,0,3,0],[2,1,3,1],[2,2,3,2],[2,8,2,10],[2,11,2,13],[2,3,3,3],[2,4,3,4],[2,6,3,6],[1,0,1,1],[2,14,2,16],[2,17,2,19]]}
[]
[]
["Номер","Имя ",null,null,null,null,"номер","команда","вид 1",null,null,"вид 2",null,null,"вид 3",null,null,"вид 4",null,null,"вид 5",null,null,"вид 6",null,"вид 7",null,null,"многоборье","вид 2"]
[null,null,null,null,null,null,null,"школа","рез-т","очки","место","рез-т","очки","место","рез-т","очки","место","рез-т","очки","место","рез-т","очки","место","рез-т","очки","рез-т","очки","место","сумма","место"]
[]
[1,"Иван","2001-10-13",{"$f":"DATEDIF(C6,TODAY(),\"y\")","v":15},{"$f":"LOOKUP(DATEDIF(C6,TODAY(),\"y\"),{6;7;8;9;10;11;12;13;14;15;16;17;18;19;20;21;22;23;24;25;26;27;28;29;30;31;32;33;34;35;36;37;38;39;40;41;42;43;44;45;46;47;48;49;50;51;52;53;54;55;56;57;58;59;60;61;62;63;64;65;66;67;68;69;70},{\"1\";\"1\";\"1\";\"2\";\"2\";\"3\";\"3\";\"4\";\"4\";\"4\";\"5\";\"5\";\"6\";\"6\";\"6\";\"6\";\"6\";\"6\";\"6\";\"6\";\"6\";\"6\";\"6\";\"6\";\"7\";\"7\";\"7\";\"7\";\"7\";\"7\";\"7\";\"7\";\"7\";\"7\";\"8\";\"8\";\"8\";\"8\";\"8\";\"8\";\"8\";\"8\";\"8\";\"8\";\"9\";\"9\";\"9\";\"9\";\"9\";\"9\";\"9\";\"9\";\"9\";\"9\";\"10\";\"10\";\"10\";\"10\";\"10\";\"10\";\"10\";\"10\";\"10\";\"10\";\"11\"})","v":"4"},"муж","00-00-0000011","№2",6,{"$f":"IF(I6>50,100,MATCH(I6,ОСН!$B$1:$B$100,0)*IF(I6=0,0,1))*IF(I6=0,0,1)","v":6},{"$f":"SUM(N(FREQUENCY((J6<J$6:J$23)*J$6:J$23,J$6:J$23)>0))","v":10},27,{"$f":"IFERROR(MATCH(L6,ОСН!$D$1:$D$100,-1),MATCH(\"0:\"&L6,ОСН!$D$1:$D$100,-1))","v":98},{"$f":"SUM(N(FREQUENCY((M6<M$6:M$23)*M$6:M$23,M$6:M$23)>0))","v":2},61,{"$f":"MATCH(O6,ОСН!$E$1:$E$100,1)","v":42},{"$f":"SUM(N(FREQUENCY((P6<P$6:P$23)*P$6:P$23,P$6:P$23)>0))","v":3},266,{"$f":"MATCH(R6,ОСН!$A$1:$A$100,1)","v":68},{"$f":"SUM(N(FREQUENCY((S6<S$6:S$23)*S$6:S$23,S$6:S$23)>0))","v":1},17,{"$f":"MATCH(U6,ОСН!$G$1:$G$100,1)","v":44},{"$f":"SUM(N(FREQUENCY((V6<V$6:V$23)*V$6:V$23,V$6:V$23)>0))","v":2},0,{"$f":"MATCH(X6,ОСН!$C$1:$C$100,1)","v":20},35.090000000000003,0,{"$f":"SUM(N(FREQUENCY((AA6<AA$6:AA$23)*AA$6:AA$23,AA$6:AA$23)>0))","v":8},{"$f":"SUM(J6,M6,P6,S6,AA6,V6,Y6)","v":278},1]
[2,"Дмитрий","2001-10-13",{"$f":"DATEDIF(C7,TODAY(),\"y\")","v":15},{"$f":"LOOKUP(DATEDIF(C7,TODAY(),\"y\"),{6;7;8;9;10;11;12;13;14;15;16;17;18;19;20;21;22;23;24;25;26;27;28;29;30;31;32;33;34;35;36;37;38;39;40;41;42;43;44;45;46;47;48;49;50;51;52;53;54;55;56;57;58;59;60;61;62;63;64;65;66;67;68;69;70},{\"1\";\"1\";\"1\";\"2\";\"2\";\"3\";\"3\";\"4\";\"4\";\"4\";\"5\";\"5\";\"6\";\"6\";\"6\";\"6\";\"6\";\"6\";\"6\";\"6\";\"6\";\"6\";\"6\";\"6\";\"7\";\"7\";\"7\";\"7\";\"7\";\"7\";\"7\";\"7\";\"7\";\"7\";\"8\";\"8\";\"8\";\"8\";\"8\";\"8\";\"8\";\"8\";\"8\";\"8\";\"9\";\"9\";\"9\";\"9\";\"9\";\"9\";\"9\";\"9\";\"9\";\"9\";\"10\";\"10\";\"10\";\"10\";\"10\";\"10\";\"10\";\"10\";\"10\";\"10\";\"11\"})","v":"4"},"муж","00-00-0000001","№12",10,{"$f":"IF(I7>50,100,MATCH(I7,ОСН!$B$1:$B$100,0)*IF(I7=0,0,1))*IF(I7=0,0,1)","v":10},{"$f":"SUM(N(FREQUENCY((J7<J$6:J$23)*J$6:J$23,J$6:J$23)>0))","v":8},null,{"$f":"IFERROR(MATCH(L7,ОСН!$D$1:$D$100,-1),MATCH(\"0:\"&L7,ОСН!$D$1:$D$100,-1))","v":100},{"$f":"SUM(N(FREQUENCY((M7<M$6:M$23)*M$6:M$23,M$6:M$23)>0))","v":1},47,{"$f":"MATCH(O7,ОСН!$E$1:$E$100,1)","v":27},{"$f":"SUM(N(FREQUENCY((P7<P$6:P$23)*P$6:P$23,P$6:P$23)>0))","v":11},205,{"$f":"MATCH(R7,ОСН!$A$1:$A$100,1)","v":38},{"$f":"SUM(N(FREQUENCY((S7<S$6:S$23)*S$6:S$23,S$6:S$23)>0))","v":10},2,{"$f":"MATCH(U7,ОСН!$G$1:$G$100,1)","v":4},{"$f":"SUM(N(FREQUENCY((V7<V$6:V$23)*V$6:V$23,V$6:V$23)>0))","v":13},0,{"$f":"MATCH(X7,ОСН!$C$1:$C$100,1)","v":20},null,{"$f":"MATCH(Z7,ОСН!$F$1:$F$100,-1)*IF(Z7=0,0,1)","v":0},{"$f":"SUM(N(FREQUENCY((AA7<AA$6:AA$23)*AA$6:AA$23,AA$6:AA$23)>0))","v":8},{"$f":"SUM(J7,M7,P7,S7,AA7,V7,Y7)","v":199},2]
[3,"Валерий","2001-10-13",{"$f":"DATEDIF(C8,TODAY(),\"y\")","v":15},{"$f":"LOOKUP(DATEDIF(C8,TODAY(),\"y\"),{6;7;8;9;10;11;12;13;14;15;16;17;18;19;20;21;22;23;24;25;26;27;28;29;30;31;32;33;34;35;36;37;38;39;40;41;42;43;44;45;46;47;48;49;50;51;52;53;54;55;56;57;58;59;60;61;62;63;64;65;66;67;68;69;70},{\"1\";\"1\";\"1\";\"2\";\"2\";\"3\";\"3\";\"4\";\"4\";\"4\";\"5\";\"5\";\"6\";\"6\";\"6\";\"6\";\"6\";\"6\";\"6\";\"6\";\"6\";\"6\";\"6\";\"6\";\"7\";\"7\";\"7\";\"7\";\"7\";\"7\";\"7\";\"7\";\"7\";\"7\";\"8\";\"8\";\"8\";\"8\";\"8\";\"8\";\"8\";\"8\";\"8\";\"8\";\"9\";\"9\";\"9\";\"9\";\"9\";\"9\";\"9\";\"9\";\"9\";\"9\";\"10\";\"10\";\"10\";\"10\";\"10\";\"10\";\"10\";\"10\";\"10\";\"10\";\"11\"})","v":"4"},"муж","00-00-0000010","№10",13,{"$f":"IF(I8>50,100,MATCH(I8,ОСН!$B$1:$B$100,0)*IF(I8=0,0,1))*IF(I8=0,0,1)","v":16},{"$f":"SUM(N(FREQUENCY((J8<J$6:J$23)*J$6:J$23,J$6:J$23)>0))","v":7},32.799999999999997,{"$f":"IFERROR(MATCH(L8,ОСН!$D$1:$D$100,-1),MATCH(\"0:\"&L8,ОСН!$D$1:$D$100,-1))","v":78},{"$f":"SUM(N(FREQUENCY((M8<M$6:M$23)*M$6:M$23,M$6:M$23)>0))","v":3},47,{"$f":"MATCH(O8,ОСН!$E$1:$E$100,1)","v":27},{"$f":"SUM(N(FREQUENCY((P8<P$6:P$23)*P$6:P$23,P$6:P$23)>0))","v":11},209,{"$f":"MATCH(R8,ОСН!$A$1:$A$100,1)","v":39},{"$f":"SUM(N(FREQUENCY((S8<S$6:S$23)*S$6:S$23,S$6:S$23)>0))","v":9},2,{"$f":"MATCH(U8,ОСН!$G$1:$G$100,1)","v":4},{"$f":"SUM(N(FREQUENCY((V8<V$6:V$23)*V$6:V$23,V$6:V$23)>0))","v":13},0,{"$f":"MATCH(X8,ОСН!$C$1:$C$100,1)","v":20},null,{"$f":"MATCH(Z8,ОСН!$F$1:$F$100,-1)*IF(Z8=0,0,1)","v":0},{"$f":"SUM(N(FREQUENCY((AA8<AA$6:AA$23)*AA$6:AA$23,AA$6:AA$23)>0))","v":8},{"$f":"SUM(J8,M8,P8,S8,AA8,V8,Y8)","v":184},3]
[4,"Александр","2001-10-13",{"$f":"DATEDIF(C9,TODAY(),\"y\")","v":15},{"$f":"LOOKUP(DATEDIF(C9,TODAY(),\"y\"),{6;7;8;9;10;11;12;13;14;15;16;17;18;19;20;21;22;23;24;25;26;27;28;29;30;31;32;33;34;35;36;37;38;39;40;41;42;43;44;45;46;47;48;49;50;51;52;53;54;55;56;57;58;59;60;61;62;63;64;65;66;67;68;69;70},{\"1\";\"1\";\"1\";\"2\";\"2\";\"3\";\"3\";\"4\";\"4\";\"4\";\"5\";\"5\";\"6\";\"6\";\"6\";\"6\";\"6\";\"6\";\"6\";\"6\";\"6\";\"6\";\"6\";\"6\";\"7\";\"7\";\"7\";\"7\";\"7\";\"7\";\"7\";\"7\";\"7\";\"7\";\"8\";\"8\";\"8\";\"8\";\"8\";\"8\";\"8\";\"8\";\"8\";\"8\";\"9\";\"9\";\"9\";\"9\";\"9\";\"9\";\"9\";\"9\";\"9\";\"9\";\"10\";\"10\";\"10\";\"10\";\"10\";\"10\";\"10\";\"10\";\"10\";\"10\";\"11\"})","v":"4"},"муж",null,"№3",9,{"$f":"IF(I9>50,100,MATCH(I9,ОСН!$B$1:$B$100,0)*IF(I9=0,0,1))*IF(I9=0,0,1)","v":9},{"$f":"SUM(N(FREQUENCY((J9<J$6:J$23)*J$6:J$23,J$6:J$23)>0))","v":9},41.9,{"$f":"IFERROR(MATCH(L9,ОСН!$D$1:$D$100,-1),MATCH(\"0:\"&L9,ОСН!$D$1:$D$100,-1))","v":56},{"$f":"SUM(N(FREQUENCY((M9<M$6:M$23)*M$6:M$23,M$6:M$23)>0))","v":4},51,{"$f":"MATCH(O9,ОСН!$E$1:$E$100,1)","v":31},{"$f":"SUM(N(FREQUENCY((P9<P$6:P$23)*P$6:P$23,P$6:P$23)>0))","v":9},240,{"$f":"MATCH(R9,ОСН!$A$1:$A$100,1)","v":55},{"$f":"SUM(N(FREQUENCY((S9<S$6:S$23)*S$6:S$23,S$6:S$23)>0))","v":2},14,{"$f":"MATCH(U9,ОСН!$G$1:$G$100,1)","v":38},{"$f":"SUM(N(FREQUENCY((V9<V$6:V$23)*V$6:V$23,V$6:V$23)>0))","v":4},10,{"$f":"MATCH(X9,ОСН!$C$1:$C$100,1)","v":40},0,0,{"$f":"SUM(N(FREQUENCY((AA9<AA$6:AA$23)*AA$6:AA$23,AA$6:AA$23)>0))","v":8},{"$f":"SUM(J9,M9,P9,S9,AA9,V9,Y9)","v":229},4]
[5,"Андрей","2001-10-13",{"$f":"DATEDIF(C10,TODAY(),\"y\")","v":15},{"$f":"LOOKUP(DATEDIF(C10,TODAY(),\"y\"),{6;7;8;9;10;11;12;13;14;15;16;17;18;19;20;21;22;23;24;25;26;27;28;29;30;31;32;33;34;35;36;37;38;39;40;41;42;43;44;45;46;47;48;49;50;51;52;53;54;55;56;57;58;59;60;61;62;63;64;65;66;67;68;69;70},{\"1\";\"1\";\"1\";\"2\";\"2\";\"3\";\"3\";\"4\";\"4\";\"4\";\"5\";\"5\";\"6\";\"6\";\"6\";\"6\";\"6\";\"6\";\"6\";\"6\";\"6\";\"6\";\"6\";\"6\";\"7\";\"7\";\"7\";\"7\";\"7\";\"7\";\"7\";\"7\";\"7\";\"7\";\"8\";\"8\";\"8\";\"8\";\"8\";\"8\";\"8\";\"8\";\"8\";\"8\";\"9\";\"9\";\"9\";\"9\";\"9\";\"9\";\"9\";\"9\";\"9\";\"9\";\"10\";\"10\";\"10\";\"10\";\"10\";\"10\";\"10\";\"10\";\"10\";\"10\";\"11\"})","v":"4"},"муж","00-00-0000014","№1",14,{"$f":"IF(I10>50,100,MATCH(I10,ОСН!$B$1:$B$100,0)*IF(I10=0,0,1))*IF(I10=0,0,1)","v":18},{"$f":"SUM(N(FREQUENCY((J10<J$6:J$23)*J$6:J$23,J$6:J$23)>0))","v":6},42.7,{"$f":"IFERROR(MATCH(L10,ОСН!$D$1:$D$100,-1),MATCH(\"0:\"&L10,ОСН!$D$1:$D$100,-1))","v":54},{"$f":"SUM(N(FREQUENCY((M10<M$6:M$23)*M$6:M$23,M$6:M$23)>0))","v":5},68,{"$f":"MATCH(O10,ОСН!$E$1:$E$100,1)","v":56},{"$f":"SUM(N(FREQUENCY((P10<P$6:P$23)*P$6:P$23,P$6:P$23)>0))","v":1},230,{"$f":"MATCH(R10,ОСН!$A$1:$A$100,1)","v":50},{"$f":"SUM(N(FREQUENCY((S10<S$6:S$23)*S$6:S$23,S$6:S$23)>0))","v":4},12,{"$f":"MATCH(U10,ОСН!$G$1:$G$100,1)","v":34},{"$f":"SUM(N(FREQUENCY((V10<V$6:V$23)*V$6:V$23,V$6:V$23)>0))","v":5},0,{"$f":"MATCH(X10,ОСН!$C$1:$C$100,1)","v":20},9.43,{"$f":"MATCH(Z10,ОСН!$F$1:$F$100,-1)*IF(Z10=0,0,1)","v":81},{"$f":"SUM(N(FREQUENCY((AA10<AA$6:AA$23)*AA$6:AA$23,AA$6:AA$23)>0))","v":1},{"$f":"SUM(J10,M10,P10,S10,AA10,V10,Y10)","v":313},5]
[6,"Дмитрий","2001-10-13",{"$f":"DATEDIF(C11,TODAY(),\"y\")","v":15},{"$f":"LOOKUP(DATEDIF(C11,TODAY(),\"y\"),{6;7;8;9;10;11;12;13;14;15;16;17;18;19;20;21;22;23;24;25;26;27;28;29;30;31;32;33;34;35;36;37;38;39;40;41;42;43;44;45;46;47;48;49;50;51;52;53;54;55;56;57;58;59;60;61;62;63;64;65;66;67;68;69;70},{\"1\";\"1\";\"1\";\"2\";\"2\";\"3\";\"3\";\"4\";\"4\";\"4\";\"5\";\"5\";\"6\";\"6\";\"6\";\"6\";\"6\";\"6\";\"6\";\"6\";\"6\";\"6\";\"6\";\"6\";\"7\";\"7\";\"7\";\"7\";\"7\";\"7\";\"7\";\"7\";\"7\";\"7\";\"8\";\"8\";\"8\";\"8\";\"8\";\"8\";\"8\";\"8\";\"8\";\"8\";\"9\";\"9\";\"9\";\"9\";\"9\";\"9\";\"9\";\"9\";\"9\";\"9\";\"10\";\"10\";\"10\";\"10\";\"10\";\"10\";\"10\";\"10\";\"10\";\"10\";\"11\"})","v":"4"},"муж","00-00-0000005","№6",22,{"$f":"IF(I11>50,100,MATCH(I11,ОСН!$B$1:$B$100,0)*IF(I11=0,0,1))*IF(I11=0,0,1)","v":34},{"$f":"SUM(N(FREQUENCY((J11<J$6:J$23)*J$6:J$23,J$6:J$23)>0))","v":3},43.3,{"$f":"IFERROR(MATCH(L11,ОСН!$D$1:$D$100,-1),MATCH(\"0:\"&L11,ОСН!$D$1:$D$100,-1))","v":53},{"$f":"SUM(N(FREQUENCY((M11<M$6:M$23)*M$6:M$23,M$6:M$23)>0))","v":6},66,{"$f":"MATCH(O11,ОСН!$E$1:$E$100,1)","v":52},{"$f":"SUM(N(FREQUENCY((P11<P$6:P$23)*P$6:P$23,P$6:P$23)>0))","v":2},220,{"$f":"MATCH(R11,ОСН!$A$1:$A$100,1)","v":45},{"$f":"SUM(N(FREQUENCY((S11<S$6:S$23)*S$6:S$23,S$6:S$23)>0))","v":6},19,{"$f":"MATCH(U11,ОСН!$G$1:$G$100,1)","v":48},{"$f":"SUM(N(FREQUENCY((V11<V$6:V$23)*V$6:V$23,V$6:V$23)>0))","v":1},0,{"$f":"MATCH(X11,ОСН!$C$1:$C$100,1)","v":20},20.47,{"$f":"MATCH(Z11,ОСН!$F$1:$F$100,-1)*IF(Z11=0,0,1)","v":17},{"$f":"SUM(N(FREQUENCY((AA11<AA$6:AA$23)*AA$6:AA$23,AA$6:AA$23)>0))","v":4},{"$f":"SUM(J11,M11,P11,S11,AA11,V11,Y11)","v":269},6]
[7,"Андрей","2001-10-13",{"$f":"DATEDIF(C12,TODAY(),\"y\")","v":15},{"$f":"LOOKUP(DATEDIF(C12,TODAY(),\"y\"),{6;7;8;9;10;11;12;13;14;15;16;17;18;19;20;21;22;23;24;25;26;27;28;29;30;31;32;33;34;35;36;37;38;39;40;41;42;43;44;45;46;47;48;49;50;51;52;53;54;55;56;57;58;59;60;61;62;63;64;65;66;67;68;69;70},{\"1\";\"1\";\"1\";\"2\";\"2\";\"3\";\"3\";\"4\";\"4\";\"4\";\"5\";\"5\";\"6\";\"6\";\"6\";\"6\";\"6\";\"6\";\"6\";\"6\";\"6\";\"6\";\"6\";\"6\";\"7\";\"7\";\"7\";\"7\";\"7\";\"7\";\"7\";\"7\";\"7\";\"7\";\"8\";\"8\";\"8\";\"8\";\"8\";\"8\";\"8\";\"8\";\"8\";\"8\";\"9\";\"9\";\"9\";\"9\";\"9\";\"9\";\"9\";\"9\";\"9\";\"9\";\"10\";\"10\";\"10\";\"10\";\"10\";\"10\";\"10\";\"10\";\"10\";\"10\";\"11\"})","v":"4"},"муж","00-00-0000003","№9",26,{"$f":"IF(I12>50,100,MATCH(I12,ОСН!$B$1:$B$100,0)*IF(I12=0,0,1))*IF(I12=0,0,1)","v":42},{"$f":"SUM(N(FREQUENCY((J12<J$6:J$23)*J$6:J$23,J$6:J$23)>0))","v":2},44.6,{"$f":"IFERROR(MATCH(L12,ОСН!$D$1:$D$100,-1),MATCH(\"0:\"&L12,ОСН!$D$1:$D$100,-1))","v":51},{"$f":"SUM(N(FREQUENCY((M12<M$6:M$23)*M$6:M$23,M$6:M$23)>0))","v":7},50,{"$f":"MATCH(O12,ОСН!$E$1:$E$100,1)","v":30},{"$f":"SUM(N(FREQUENCY((P12<P$6:P$23)*P$6:P$23,P$6:P$23)>0))","v":10},211,{"$f":"MATCH(R12,ОСН!$A$1:$A$100,1)","v":40},{"$f":"SUM(N(FREQUENCY((S12<S$6:S$23)*S$6:S$23,S$6:S$23)>0))","v":8},12,{"$f":"MATCH(U12,ОСН!$G$1:$G$100,1)","v":34},{"$f":"SUM(N(FREQUENCY((V12<V$6:V$23)*V$6:V$23,V$6:V$23)>0))","v":5},-5,{"$f":"MATCH(X12,ОСН!$C$1:$C$100,1)","v":10},null,{"$f":"MATCH(Z12,ОСН!$F$1:$F$100,-1)*IF(Z12=0,0,1)","v":0},{"$f":"SUM(N(FREQUENCY((AA12<AA$6:AA$23)*AA$6:AA$23,AA$6:AA$23)>0))","v":8},{"$f":"SUM(J12,M12,P12,S12,AA12,V12,Y12)","v":207},7]
[8,"Антон","2001-10-13",{"$f":"DATEDIF(C13,TODAY(),\"y\")","v":15},{"$f":"LOOKUP(DATEDIF(C13,TODAY(),\"y\"),{6;7;8;9;10;11;12;13;14;15;16;17;18;19;20;21;22;23;24;25;26;27;28;29;30;31;32;33;34;35;36;37;38;39;40;41;42;43;44;45;46;47;48;49;50;51;52;53;54;55;56;57;58;59;60;61;62;63;64;65;66;67;68;69;70},{\"1\";\"1\";\"1\";\"2\";\"2\";\"3\";\"3\";\"4\";\"4\";\"4\";\"5\";\"5\";\"6\";\"6\";\"6\";\"6\";\"6\";\"6\";\"6\";\"6\";\"6\";\"6\";\"6\";\"6\";\"7\";\"7\";\"7\";\"7\";\"7\";\"7\";\"7\";\"7\";\"7\";\"7\";\"8\";\"8\";\"8\";\"8\";\"8\";\"8\";\"8\";\"8\";\"8\";\"8\";\"9\";\"9\";\"9\";\"9\";\"9\";\"9\";\"9\";\"9\";\"9\";\"9\";\"10\";\"10\";\"10\";\"10\";\"10\";\"10\";\"10\";\"10\";\"10\";\"10\";\"11\"})","v":"4"},"муж","00-00-0000016","№15",3,{"$f":"IF(I13>50,100,MATCH(I13,ОСН!$B$1:$B$100,0)*IF(I13=0,0,1))*IF(I13=0,0,1)","v":3},{"$f":"SUM(N(FREQUENCY((J13<J$6:J$23)*J$6:J$23,J$6:J$23)>0))","v":12},44.6,{"$f":"IFERROR(MATCH(L13,ОСН!$D$1:$D$100,-1),MATCH(\"0:\"&L13,ОСН!$D$1:$D$100,-1))","v":51},{"$f":"SUM(N(FREQUENCY((M13<M$6:M$23)*M$6:M$23,M$6:M$23)>0))","v":7},54,{"$f":"MATCH(O13,ОСН!$E$1:$E$100,1)","v":34},{"$f":"SUM(N(FREQUENCY((P13<P$6:P$23)*P$6:P$23,P$6:P$23)>0))","v":7},198,{"$f":"MATCH(R13,ОСН!$A$1:$A$100,1)","v":36},{"$f":"SUM(N(FREQUENCY((S13<S$6:S$23)*S$6:S$23,S$6:S$23)>0))","v":12},7,{"$f":"MATCH(U13,ОСН!$G$1:$G$100,1)","v":19},{"$f":"SUM(N(FREQUENCY((V13<V$6:V$23)*V$6:V$23,V$6:V$23)>0))","v":10},-5,{"$f":"MATCH(X13,ОСН!$C$1:$C$100,1)","v":10},18.39,{"$f":"MATCH(Z13,ОСН!$F$1:$F$100,-1)*IF(Z13=0,0,1)","v":24},{"$f":"SUM(N(FREQUENCY((AA13<AA$6:AA$23)*AA$6:AA$23,AA$6:AA$23)>0))","v":2},{"$f":"SUM(J13,M13,P13,S13,AA13,V13,Y13)","v":177},7]
[9,"Константин","2001-10-13",{"$f":"DATEDIF(C14,TODAY(),\"y\")","v":15},{"$f":"LOOKUP(DATEDIF(C14,TODAY(),\"y\"),{6;7;8;9;10;11;12;13;14;15;16;17;18;19;20;21;22;23;24;25;26;27;28;29;30;31;32;33;34;35;36;37;38;39;40;41;42;43;44;45;46;47;48;49;50;51;52;53;54;55;56;57;58;59;60;61;62;63;64;65;66;67;68;69;70},{\"1\";\"1\";\"1\";\"2\";\"2\";\"3\";\"3\";\"4\";\"4\";\"4\";\"5\";\"5\";\"6\";\"6\";\"6\";\"6\";\"6\";\"6\";\"6\";\"6\";\"6\";\"6\";\"6\";\"6\";\"7\";\"7\";\"7\";\"7\";\"7\";\"7\";\"7\";\"7\";\"7\";\"7\";\"8\";\"8\";\"8\";\"8\";\"8\";\"8\";\"8\";\"8\";\"8\";\"8\";\"9\";\"9\";\"9\";\"9\";\"9\";\"9\";\"9\";\"9\";\"9\";\"9\";\"10\";\"10\";\"10\";\"10\";\"10\";\"10\";\"10\";\"10\";\"10\";\"10\";\"11\"})","v":"4"},"муж","00-00-0000017","№14",26,{"$f":"IF(I14>50,100,MATCH(I14,ОСН!$B$1:$B$100,0)*IF(I14=0,0,1))*IF(I14=0,0,1)","v":42},{"$f":"SUM(N(FREQUENCY((J14<J$6:J$23)*J$6:J$23,J$6:J$23)>0))","v":2},45.4,{"$f":"IFERROR(MATCH(L14,ОСН!$D$1:$D$100,-1),MATCH(\"0:\"&L14,ОСН!$D$1:$D$100,-1))","v":50},{"$f":"SUM(N(FREQUENCY((M14<M$6:M$23)*M$6:M$23,M$6:M$23)>0))","v":8},54,{"$f":"MATCH(O14,ОСН!$E$1:$E$100,1)","v":34},{"$f":"SUM(N(FREQUENCY((P14<P$6:P$23)*P$6:P$23,P$6:P$23)>0))","v":7},201,{"$f":"MATCH(R14,ОСН!$A$1:$A$100,1)","v":37},{"$f":"SUM(N(FREQUENCY((S14<S$6:S$23)*S$6:S$23,S$6:S$23)>0))","v":11},8,{"$f":"MATCH(U14,ОСН!$G$1:$G$100,1)","v":22},{"$f":"SUM(N(FREQUENCY((V14<V$6:V$23)*V$6:V$23,V$6:V$23)>0))","v":9},0,{"$f":"MATCH(X14,ОСН!$C$1:$C$100,1)","v":20},19.579999999999998,{"$f":"MATCH(Z14,ОСН!$F$1:$F$100,-1)*IF(Z14=0,0,1)","v":20},{"$f":"SUM(N(FREQUENCY((AA14<AA$6:AA$23)*AA$6:AA$23,AA$6:AA$23)>0))","v":3},{"$f":"SUM(J14,M14,P14,S14,AA14,V14,Y14)","v":225},8]
[10,"Степан","2001-10-13",{"$f":"DATEDIF(C15,TODAY(),\"y\")","v":15},{"$f":"LOOKUP(DATEDIF(C15,TODAY(),\"y\"),{6;7;8;9;10;11;12;13;14;15;16;17;18;19;20;21;22;23;24;25;26;27;28;29;30;31;32;33;34;35;36;37;38;39;40;41;42;43;44;45;46;47;48;49;50;51;52;53;54;55;56;57;58;59;60;61;62;63;64;65;66;67;68;69;70},{\"1\";\"1\";\"1\";\"2\";\"2\";\"3\";\"3\";\"4\";\"4\";\"4\";\"5\";\"5\";\"6\";\"6\";\"6\";\"6\";\"6\";\"6\";\"6\";\"6\";\"6\";\"6\";\"6\";\"6\";\"7\";\"7\";\"7\";\"7\";\"7\";\"7\";\"7\";\"7\";\"7\";\"7\";\"8\";\"8\";\"8\";\"8\";\"8\";\"8\";\"8\";\"8\";\"8\";\"8\";\"9\";\"9\";\"9\";\"9\";\"9\";\"9\";\"9\";\"9\";\"9\";\"9\";\"10\";\"10\";\"10\";\"10\";\"10\";\"10\";\"10\";\"10\";\"10\";\"10\";\"11\"})","v":"4"},"муж","00-00-0000018","№8",0,0,{"$f":"SUM(N(FREQUENCY((J15<J$6:J$23)*J$6:J$23,J$6:J$23)>0))","v":14},47.6,{"$f":"IFERROR(MATCH(L15,ОСН!$D$1:$D$100,-1),MATCH(\"0:\"&L15,ОСН!$D$1:$D$100,-1))","v":48},{"$f":"SUM(N(FREQUENCY((M15<M$6:M$23)*M$6:M$23,M$6:M$23)>0))","v":9},59,{"$f":"MATCH(O15,ОСН!$E$1:$E$100,1)","v":39},{"$f":"SUM(N(FREQUENCY((P15<P$6:P$23)*P$6:P$23,P$6:P$23)>0))","v":4},215,{"$f":"MATCH(R15,ОСН!$A$1:$A$100,1)","v":42},{"$f":"SUM(N(FREQUENCY((S15<S$6:S$23)*S$6:S$23,S$6:S$23)>0))","v":7},6,{"$f":"MATCH(U15,ОСН!$G$1:$G$100,1)","v":16},{"$f":"SUM(N(FREQUENCY((V15<V$6:V$23)*V$6:V$23,V$6:V$23)>0))","v":11},0,{"$f":"MATCH(X15,ОСН!$C$1:$C$100,1)","v":20},22.2,{"$f":"MATCH(Z15,ОСН!$F$1:$F$100,-1)*IF(Z15=0,0,1)","v":13},{"$f":"SUM(N(FREQUENCY((AA15<AA$6:AA$23)*AA$6:AA$23,AA$6:AA$23)>0))","v":5},{"$f":"SUM(J15,M15,P15,S15,AA15,V15,Y15)","v":178},9]
{"$rows_left_out":9}
{"sheet":"ОСН","index":1,"n_rows":100,"n_cols":7,"rows_kept":100,"cut":false,"hidden":false,"merged":[]}
[70,1,-10,"2.00,0",3,30,1]
[76,2,-9,"1.57,0",6,29.1,"-"]
[81,3,"-","1.54,0",9,28.2,"-"]
[86,4,-8,"1.52,0",12,27.4,2]
[90,5,"-","1.50,0",15,27,"-"]
[94,6,-7,"1.48,0",18,26.2,"-"]
[98,7,"-","1.46,0",20,25.4,3]
[102,8,-6,"1.44,0",22,25,"-"]
[106,9,"-","1.42,0",24,24.3,"-"]
[110,10,-5,"1.40,0",26,24,4]
[114,"-","-","1.38,0",28,23.3,"-"]
[118,11,-4,"1.36,0",30,23,"-"]
[122,"-","-","1.34,0",32,22.35,5]
[126,12,-3,"1.32,0",34,22.1,"-"]
[130,"-","-","1.30,0",35,21.45,"-"]
{"$rows_left_out":86}
{"sheet":"плавание (2)","index":2,"n_rows":102,"n_cols":2,"rows_kept":102,"cut":false,"hidden":true,"merged":[[0,1,1,1],[0,3,1,3]]}
["плавание","Очки"]
["25 м"]
[60.1,1]
[60.05,2]
[1.02,3]
[1,4]
[58,5]
[57,6]
[56,7]
[55,8]
[54,9]
[53,10]
[52,11]
[51,12]
[50,13]
{"$rows_left_out":88}
{"sheet":"отжимание (2)","index":3,"n_rows":102,"n_cols":19,"rows_kept":102,"cut":false,"hidden":true,"merged":[[0,1,1,1],[0,3,1,3]]}
["Стрельба ","Очки"]
["ВП\n5в\n"]
["-",1,null,null,null,null,null,null,null,null,null,null,null,null,null,null,null,null,1]
["-",2,null,null,null,null,null,null,null,null,null,null,null,null,null,null,null,null,2]
[1,3,null,null,null,null,null,null,null,null,null,null,null,null,null,null,null,null,3]
["-",4]
["-",5]
[2,6]
["-",7]
["-",8]
[3,9]
["-",10]
["-",11]
[4,12]
["-",13]
{"$rows_left_out":88}
{"sheet":"Стрельба (2)","index":4,"n_rows":102,"n_cols":19,"rows_kept":102,"cut":false,"hidden":true,"merged":[[0,3,1,3],[0,1,1,1]]}
["Стрельба ","Очки"]
["ВП\n5в\n"]
[1,1,null,null,null,null,null,null,null,null,null,null,null,null,null,null,null,null,1]
[2,2,null,null,null,null,null,null,null,null,null,null,null,null,null,null,null,null,2]
[3,3,null,null,null,null,null,null,null,null,null,null,null,null,null,null,null,null,3]
[4,4]
[5,5]
[6,6]
[7,7]
[8,8]
[9,9]
[10,10]
["-",11]
[11,12]
["-",13]
{"$rows_left_out":88}
{"sheet":"плавание","index":5,"n_rows":102,"n_cols":2,"rows_kept":102,"cut":false,"hidden":true,"merged":[[0,1,1,1],[0,3,1,3]]}
["плавание","Очки"]
["25 м"]
[60.1,1]
[60.05,2]
[1.02,3]
[1,4]
[58,5]
[57,6]
[56,7]
[55,8]
[54,9]
[53,10]
[52,11]
[51,12]
[50,13]
{"$rows_left_out":88}
{"sheet":"отжимание","index":6,"n_rows":102,"n_cols":19,"rows_kept":102,"cut":false,"hidden":true,"merged":[[0,1,1,1],[0,3,1,3]]}
["Стрельба ","Очки"]
["ВП\n5в\n"]
["-",1,null,null,null,null,null,null,null,null,null,null,null,null,null,null,null,null,1]
["-",2,null,null,null,null,null,null,null,null,null,null,null,null,null,null,null,null,2]
[1,3,null,null,null,null,null,null,null,null,null,null,null,null,null,null,null,null,3]
["-",4]
["-",5]
[2,6]
["-",7]
["-",8]
[3,9]
["-",10]
["-",11]
[4,12]
["-",13]
{"$rows_left_out":88}
{"sheet":"Стрельба","index":7,"n_rows":102,"n_cols":19,"rows_kept":102,"cut":false,"hidden":true,"merged":[[0,3,1,3],[0,1,1,1]]}
["Стрельба ","Очки"]
["ВП\n5в\n"]
[1,1,null,null,null,null,null,null,null,null,null,null,null,null,null,null,null,null,1]
[2,2,null,null,null,null,null,null,null,null,null,null,null,null,null,null,null,null,2]
[3,3,null,null,null,null,null,null,null,null,null,null,null,null,null,null,null,null,3]
[4,4]
[5,5]
[6,6]
[7,7]
[8,8]
[9,9]
[10,10]
["-",11]
[11,12]
["-",13]
{"$rows_left_out":87}