{"text_format":"1","workbook":"xlsx","n_sheets":8,"sheets":["свод","м_1","м_2","м_3","м_11","ж_1","ж_2","ж_11"],"not_rendered":{"charts":0,"images":0,"macros":1,"external_links":1,"defined_names":0,"comments":0,"pivot_tables":0},"unopened":[],"bounds":{"document_bytes":16777216,"sheet_cells":100000,"rows_first":2000,"rows_last":500,"rows_between":2000,"halvings":0,"cell_chars":16384,"cell_head_chars":4096},"cells_cut":0,"cells_raw":0,"read":"whole","date_system":"1900"}

{"sheet":"свод","index":0,"n_rows":11,"n_cols":2,"rows_kept":11,"cut":false,"hidden":false,"merged":[]}
["Номер","Фамилия, Имя "]
[1]
[2]
[3]
[4]
[5]
[6]
[7]
[8]
[9]
[10]

{"sheet":"м_1","index":1,"n_rows":26,"n_cols":27,"rows_kept":26,"cut":false,"hidden":false,"merged":[[2,23,2,24],[2,26,3,26],[2,6,2,7],[2,8,2,9],[2,11,2,12],[2,14,2,15],[2,17,2,18],[2,20,2,21],[2,5,3,5],[2,0,3,0],[2,1,3,1],[2,2,3,2],[2,3,3,3],[2,4,3,4]]}
[]
[]
["Номер","Фамилия, Имя ",null,null,null,null,null,null,"плавание",null,null,"стрельба",null,null,"пресс",null,null,"отжимание",null,null,"прыжок",null,null,"наклон",null,null,"Сумма многоборья"]
[null,null,null,null,null,null,null,null,"рез-т","очки","место","рез-т","очки","место","рез-т","очки","место","рез-т","очки","место","рез-т","очки","место","рез-т","очки","место"]
[]
[1,"Иван",null,null,null,null,null,null,73,5,{"$f":"RANK(J6,J$6:J$26)","v":16},57,74,{"$f":"RANK(M6,M$6:M$15)","v":3},133,26,{"$f":"RANK(P6,P$6:P$15)","v":4},4.1500000000000004,85,{"$f":"RANK(S6,S$6:S$15)","v":2},18,80,{"$f":"RANK(V6,V$6:V$15)","v":1},10,55,{"$f":"RANK(Y6,Y$6:Y$15)","v":6},324]
[2,"Егор",null,null,null,null,null,null,99,13,{"$f":"RANK(J7,J$6:J$26)","v":12},65,90,{"$f":"RANK(M7,M$6:M$15)","v":1},103,14,{"$f":"RANK(P7,P$6:P$15)","v":5},9.15,4,{"$f":"RANK(S7,S$6:S$15)","v":8},11,64,{"$f":"RANK(V7,V$6:V$15)","v":5},21,88,{"$f":"RANK(Y7,Y$6:Y$15)","v":3},318]
[3,"Толя",null,null,null,null,null,null,60.5,2,18,47,54,6,73,5,8,9.07,5,7,3,26,9,25,100,1,290]
[4,"Сергей",null,null,null,null,null,null,103,14,10,58,76,2,189,59,2,5.56,51,3,17,78,2,-1,22,8,290]
[5,"Федор",null,null,null,null,null,null,145,32,6,5,5,10,90,10,7,3.3,100,1,15,74,3,13,64,5,257]
[6,"Тимофей",null,null,null,null,null,null,133,26,8,53,66,4,201,71,1,6.3,40,5,10,60,6,-2,19,9,257]
[7,"Андрей",null,null,null,null,null,null,189,59,4,13,13,9,99,13,6,9.11,4,8,4,32,8,23,94,2,221]
[8,"Никита",null,null,null,null,null,null,90,10,14,32,32,8,145,32,3,10,1,10,13,70,4,18,79,4,219]
[9,"Петя",null,null,null,null,null,null,60,2,18,35,35,7,60.5,2,9,6.21,43,4,2,18,10,5,40,7,202]
[10,"Вася",null,null,null,null,null,null,201,71,2,51,62,5,60,2,9,6.54,32,6,9,56,7,-5,9,10,163]
[null,null,null,null,null,null,null,null,73,5,16]
[null,null,null,null,null,null,null,null,99,13,12]
[null,null,null,null,null,null,null,null,60.5,2,18]
[null,null,null,null,null,null,null,null,103,14,10]
[null,null,null,null,null,null,null,null,145,32,6]
[null,null,null,null,null,null,null,null,133,26,8]
[null,null,null,null,null,null,null,null,189,59,4]
[null,null,null,null,null,null,null,null,90,10,14]
[null,null,null,null,null,null,null,null,60,2,18]
[null,null,null,null,null,null,null,null,201,71,2]
[null,null,null,null,null,null,null,null,221,91,1]

{"sheet":"м_2","index":2,"n_rows":15,"n_cols":21,"rows_kept":15,"cut":false,"hidden":false,"merged":[[2,18,2,19],[2,20,3,20],[2,6,2,7],[2,8,2,9],[2,10,2,11],[2,12,2,13],[2,14,2,15],[2,16,2,17],[2,5,3,5],[2,0,3,0],[2,1,3,1],[2,2,3,2],[2,3,3,3],[2,4,3,4]]}
[]
[]
["Номер","Фамилия, Имя ",null,null,null,null,null,null,"плавание",null,"стрельба",null,"пресс",null,"отжимание",null,"прыжок",null,"наклон",null,"Сумма многоборья"]
[null,null,null,null,null,null,null,null,"рез-т","очки","рез-т","очки","рез-т","очки","рез-т","очки","рез-т","очки","рез-т","очки"]
[]
[1,"Сергей",null,null,null,null,null,null,36.4,31,70,100,230,100,6,50,28,100,-5,9,390]
[2,"Федор",null,null,null,null,null,null,"1.02,0",3,77,100,225,95,6.03,49,23,90,-3,16,353]
[3,"Иван",null,null,null,null,null,null,36.5,31,65,90,256,100,7.3,20,27,98,-4,13,352]
[4,"Андрей",null,null,null,null,null,null,55,8,57,74,133,26,4.1500000000000004,85,18,80,10,55,328]
[5,"Вася",null,null,null,null,null,null,25.5,58,65,90,103,14,9.15,4,11,64,21,88,318]
[6,"Петя",null,null,null,null,null,null,15.7,96,32,32,145,32,10,1,13,70,18,79,310]
[7,"Егор",null,null,null,null,null,null,55.5,7,58,76,189,59,5.56,51,17,78,-1,22,293]
[8,"Тимофей",null,null,null,null,null,null,36,32,45,50,227,97,5.45,55,1,10,0,25,269]
[9,"Толя",null,null,null,null,null,null,55,8,5,5,90,10,3.3,100,15,74,13,64,261]
[10,"Никита",null,null,null,null,null,null,"1.08,0",1,53,66,201,71,6.3,40,10,60,-2,19,257]

{"sheet":"м_3","index":3,"n_rows":15,"n_cols":23,"rows_kept":15,"cut":false,"hidden":false,"merged":[[2,18,2,19],[2,20,2,21],[2,22,3,22],[2,6,2,7],[2,8,2,9],[2,10,2,11],[2,12,2,13],[2,14,2,15],[2,16,2,17],[2,5,3,5],[2,0,3,0],[2,1,3,1],[2,2,3,2],[2,3,3,3],[2,4,3,4]]}
[]
[]
["Номер","Фамилия, Имя ",null,null,null,null,null,null,"стрельба",null,"плавание",null,"пресс",null,"длина",null,"лыжи",null,"отжимание",null,"наклон",null,"Сумма многоборья"]
[null,null,null,null,null,null,null,null,"рез-т","очки","рез-т","очки","рез-т","очки","рез-т","очки","рез-т","очки","рез-т","очки","рез-т","очки"]
[]
[1,"Сергей",null,null,null,null,null,null,27,44,73,{"$f":"MATCH(K6,[1]ОСН_М1!$B$1:$B$100,1)","v":5},79,98,261,100,5.45,100,39,100,0,10,493]
[2,"Федор",null,null,null,null,null,null,31,52,99,{"$f":"MATCH(K7,[1]ОСН_М1!$B$1:$B$100,1)","v":13},81,100,256,96,7.3,83,27,78,-4,2,484]
[3,"Иван",null,null,null,null,null,null,17,24,60.5,{"$f":"MATCH(K8,[1]ОСН_М1!$B$1:$B$100,1)","v":2},78,96,260,100,6,100,31,86,-5,1,447]
[4,"Тимофей",null,null,null,null,null,null,23,36,103,{"$f":"MATCH(K9,[1]ОСН_М1!$B$1:$B$100,1)","v":14},78,96,155,28,4.2,100,40,100,7,31,431]
[5,"Никита",null,null,null,null,null,null,25,40,145,{"$f":"MATCH(K10,[1]ОСН_М1!$B$1:$B$100,1)","v":32},80,100,225,65,6.03,99,23,70,-3,4,416]
[6,"Петя",null,null,null,null,null,null,11,12,133,{"$f":"MATCH(K11,[1]ОСН_М1!$B$1:$B$100,1)","v":26},5,2,235,75,14.57,22,45,100,13,49,300]
[7,"Егор",null,null,null,null,null,null,11,12,189,{"$f":"MATCH(K12,[1]ОСН_М1!$B$1:$B$100,1)","v":59},56,52,201,50,6.3,94,10,37,-2,6,283]
[8,"Толя",null,null,null,null,null,null,9,9,90,{"$f":"MATCH(K13,[1]ОСН_М1!$B$1:$B$100,1)","v":10},57,54,156,28,14.55,23,18,60,10,40,254]
[9,"Андрей",null,null,null,null,null,null,10,10,60,{"$f":"MATCH(K14,[1]ОСН_М1!$B$1:$B$100,1)","v":2},58,56,189,44,14.5,23,17,58,-1,8,238]
[10,"Вася",null,null,null,null,null,null,5,5,201,{"$f":"MATCH(K15,[1]ОСН_М1!$B$1:$B$100,1)","v":71},32,22,145,25,12.25,41,13,46,15,55,234]

{"sheet":"м_11","index":4,"n_rows":15,"n_cols":19,"rows_kept":15,"cut":false,"hidden":false,"merged":[[2,18,3,18],[2,6,2,7],[2,8,2,9],[2,10,2,11],[2,12,2,13],[2,14,2,15],[2,16,2,17],[2,5,3,5],[2,0,3,0],[2,1,3,1],[2,2,3,2],[2,3,3,3],[2,4,3,4]]}
[]
[]
["Номер","Фамилия, Имя ",null,null,null,null,null,null,"плавание",null,"наклон",null,"пресс",null,"отжимание",null,"прыжок",null,"Сумма многоборья"]
[null,null,null,null,null,null,null,null,"рез-т","очки","рез-т","очки","рез-т","очки","рез-т","очки","рез-т","очки"]
[]
[1,"Толя",null,null,null,null,null,null,23.5,65,47,74,9.07,81,25,45,5,55,320]
[2,"Петя",null,null,null,null,null,null,23.6,64,35,50,7.39,98,5,19,5,55,286]
[3,"Егор",null,null,null,null,null,null,58,5,60,100,9.15,79,39,59,0,40,283]
[4,"Вася",null,null,null,null,null,null,"1.00,2",3,51,82,7.3,100,23,43,-5,25,253]
[5,"Андрей",null,null,null,null,null,null,23.4,65,13,13,9.11,79,33,53,1,43,253]
[6,"Иван",null,null,null,null,null,null,59.5,4,57,94,14.55,23,42,62,10,70,253]
[7,"Сергей",null,null,null,null,null,null,59,4,58,96,14.5,23,43,63,-1,37,223]
[8,"Тимофей",null,null,null,null,null,null,59.9,4,56,92,15.3,21,44,64,-12,1,182]
[9,"Никита",null,null,null,null,null,null,58.1,4,32,44,12.25,41,40,60,-5,25,174]
[10,"Федор",null,null,null,null,null,null,58.9,4,5,5,14.57,23,41,61,-9,13,106]

{"sheet":"ж_1","index":5,"n_rows":14,"n_cols":21,"rows_kept":14,"cut":false,"hidden":false,"merged":[[2,18,2,19],[2,20,3,20],[2,6,2,7],[2,8,2,9],[2,10,2,11],[2,12,2,13],[2,14,2,15],[2,16,2,17],[2,5,3,5],[2,0,3,0],[2,1,3,1],[2,2,3,2],[2,3,3,3],[2,4,3,4]]}
[]
[]
["Номер","Фамилия, Имя ",null,null,null,null,null,null,"плавание",null,"стрельба",null,"прыжок",null,"отжимание",null,"пресс",null,"наклон",null,"Сумма многоборья"]
[null,null,null,null,null,null,null,null,"рез-т","очки","рез-т","очки","рез-т","очки","рез-т","очки","рез-т","очки","рез-т","очки"]
[]
[1,"Юля",null,null,null,null,null,null,55.5,10,58,86,189,74,3.59,97,43,79,-1,13,359]
[2,"Маша",null,null,null,null,null,null,16.899999999999999,95,47,64,73,8,9.07,9,25,61,25,91,328]
[3,"Галя",null,null,null,null,null,null,33.799999999999997,39,57,84,156,45,8.56,10,42,78,10,46,302]
[4,"Варя",null,null,null,null,null,null,58,9,65,100,103,19,9.15,8,39,75,21,79,290]
[5,"Даша",null,null,null,null,null,null,23.4,68,13,13,99,17,9.11,8,33,69,27,97,272]
[6,"Полина",null,null,null,null,null,null,"1.00,0",8,32,34,145,40,11.59,1,40,76,15,61,220]
[7,"Ката",null,null,null,null,null,null,23.6,68,35,40,49,2,6.21,49,5,22,5,31,212]
[8,"Света",null,null,null,null,null,null,55,11,5,5,133,34,11,3,41,77,13,55,185]
[9,"Ира",null,null,null,null,null,null,"1.00,2",7,51,72,40,1,6.54,38,23,59,-5,1,178]

{"sheet":"ж_2","index":6,"n_rows":14,"n_cols":21,"rows_kept":14,"cut":false,"hidden":false,"merged":[[2,18,2,19],[2,20,3,20],[2,6,2,7],[2,8,2,9],[2,10,2,11],[2,12,2,13],[2,14,2,15],[2,16,2,17],[2,5,3,5],[2,0,3,0],[2,1,3,1],[2,2,3,2],[2,3,3,3],[2,4,3,4]]}
[]
[]
["Номер","Фамилия, Имя ",null,null,null,null,null,null,"плавание",null,"стрельба",null,"прыжок",null,"отжимание",null,"пресс",null,"наклон",null,"Сумма многоборья"]
[null,null,null,null,null,null,null,null,"рез-т","очки","рез-т","очки","рез-т","очки","рез-т","очки","рез-т","очки","рез-т","очки"]
[]
[1,"Юля",null,null,null,null,null,null,55.5,10,58,86,189,74,3.59,97,43,79,-1,13,359]
[2,"Галя",null,null,null,null,null,null,33.799999999999997,39,57,84,156,45,8.56,10,42,78,10,46,302]
[3,"Маша",null,null,null,null,null,null,23.5,68,47,64,73,8,9.07,9,25,61,25,91,301]
[4,"Варя",null,null,null,null,null,null,58,9,65,100,103,19,9.15,8,39,75,21,79,290]
[5,"Даша",null,null,null,null,null,null,23.4,68,13,13,99,17,9.11,8,33,69,27,97,272]
[6,"Полина",null,null,null,null,null,null,"1.00,0",8,32,34,145,40,11.59,1,40,76,15,61,220]
[7,"Ката",null,null,null,null,null,null,23.6,68,35,40,49,2,6.21,49,5,22,5,31,212]
[8,"Света",null,null,null,null,null,null,55,11,5,5,133,34,11,3,41,77,13,55,185]
[9,"Ира",null,null,null,null,null,null,"1.00,2",7,51,72,40,1,6.54,38,23,59,-5,1,178]

{"sheet":"ж_11","index":7,"n_rows":14,"n_cols":19,"rows_kept":14,"cut":false,"hidden":false,"merged":[[2,18,3,18],[2,6,2,7],[2,8,2,9],[2,10,2,11],[2,12,2,13],[2,14,2,15],[2,16,2,17],[2,5,3,5],[2,0,3,0],[2,1,3,1],[2,2,3,2],[2,3,3,3],[2,4,3,4]]}
[]
[]
["Номер","Фамилия, Имя ",null,null,null,null,null,null,"плавание",null,"стрельба",null,"лыжи",null,"отжимание",null,"наклон",null,"Сумма многоборья"]
[null,null,null,null,null,null,null,null,"рез-т","очки","рез-т","очки","рез-т","очки","рез-т","очки","рез-т","очки"]
[]
[1,"Полина",null,null,null,null,null,null,"1.20,0",1,41,82,12.25,46,51,85,7,46,260]
[2,"Маша",null,null,null,null,null,null,36.5,34,23,46,9.19,71,56,88,-4,13,252]
[3,"Ката",null,null,null,null,null,null,"1.02,0",7,29,58,9.15,72,55,87,-3,16,240]
[4,"Варя",null,null,null,null,null,null,36,35,35,70,23.59,1,80,100,0,25,231]
[5,"Ира",null,null,null,null,null,null,"1.00,1",7,24,48,9.18,72,44,82,-2,19,228]
[6,"Света",null,null,null,null,null,null,"1.02,0",7,37,74,17.14,19,25,65,9,52,217]
[7,"Юля",null,null,null,null,null,null,59.9,8,17,34,9.24,71,1,5,14,67,185]
[8,"Даша",null,null,null,null,null,null,36.4,34,20,40,22.59,2,57,88,-5,10,174]
[9,"Галя",null,null,null,null,null,null,58,9,19,38,21.21,6,29,69,4,37,159]