{"text_format":"1","workbook":"xlsx","n_sheets":10,"sheets":["м_3","м_4","ОСН_М3","ОСН_М4","плавание (2)","отжимание (2)","Стрельба (2)","плавание","отжимание","Стрельба"],"not_rendered":{"charts":0,"images":0,"macros":1,"external_links":1,"defined_names":7,"comments":0,"pivot_tables":0},"unopened":[],"bounds":{"document_bytes":16777216,"sheet_cells":100000,"rows_first":2000,"rows_last":500,"rows_between":2000,"halvings":0,"cell_chars":16384,"cell_head_chars":4096},"cells_cut":0,"cells_raw":0,"read":"whole","date_system":"1900"}

{"sheet":"м_3","index":0,"n_rows":16,"n_cols":21,"rows_kept":16,"cut":false,"hidden":false,"merged":[[2,21,3,21],[2,14,2,16],[2,17,2,19],[0,0,0,20],[2,20,3,20],[2,5,3,5],[2,0,3,0],[2,1,3,1],[2,2,3,2],[2,8,2,10],[2,11,2,13],[2,3,3,3],[2,4,3,4],[2,6,3,6],[1,0,1,1]]}
[]
[]
["Номер",null,null,null,null,null,null,null,null,null,null,null,null,null,null,null,null,null,null,null,"Сумма многоборья"]
[null,null,null,null,null,null,null,null,"рез-т","очки","место","рез-т","очки","место","рез-т","очки","место","рез-т","очки","место"]
[]
[1,null,null,null,null,null,null,null,12,{"$f":"IF(I6>50,100,MATCH(I6,ОСН_М3!$B$1:$B$100,0)*IF(I6=0,0,1))*IF(I6=0,0,1)","v":14},{"$f":"SUM(N(FREQUENCY((J6<J$6:J$16)*J$6:J$16,J$6:J$16)>0))","v":6},59.6,{"$f":"IFERROR(MATCH(L6,ОСН_М3!$C$1:$C$100,-1),MATCH(\"0:\"&L6,ОСН_М3!$C$1:$C$100,-1))","v":40},{"$f":"SUM(N(FREQUENCY((M6<M$6:M$16)*M$6:M$16,M$6:M$16)>0))","v":2},48,{"$f":"MATCH(O6,ОСН_М3!$D$1:$D$100,1)","v":38},{"$f":"SUM(N(FREQUENCY((P6<P$6:P$16)*P$6:P$16,P$6:P$16)>0))","v":4},194,{"$f":"MATCH(R6,ОСН_М3!$A$1:$A$100,1)","v":47},{"$f":"SUM(N(FREQUENCY((S6<S$6:S$16)*S$6:S$16,S$6:S$16)>0))","v":2},{"$f":"SUM(J6,M6,P6,S6)","v":139}]
[2,null,null,null,null,null,null,null,0,0,10,0,0,10,0,0,9,0,0,8,{"$f":"SUM(J7,M7,P7,S7)","v":0}]
[3,null,null,null,null,null,null,null,29,{"$f":"IF(I8>50,100,MATCH(I8,ОСН_М3!$B$1:$B$100,0)*IF(I8=0,0,1))*IF(I8=0,0,1)","v":48},1,34.299999999999997,{"$f":"IFERROR(MATCH(L8,ОСН_М3!$C$1:$C$100,-1),MATCH(\"0:\"&L8,ОСН_М3!$C$1:$C$100,-1))","v":79},1,44,{"$f":"MATCH(O8,ОСН_М3!$D$1:$D$100,1)","v":34},6,167,{"$f":"MATCH(R8,ОСН_М3!$A$1:$A$100,1)","v":33},6,194]
[4,null,null,null,null,null,null,null,20,{"$f":"IF(I9>50,100,MATCH(I9,ОСН_М3!$B$1:$B$100,0)*IF(I9=0,0,1))*IF(I9=0,0,1)","v":30},3,"1.42,9",{"$f":"IFERROR(MATCH(L9,ОСН_М3!$C$1:$C$100,-1),MATCH(\"0:\"&L9,ОСН_М3!$C$1:$C$100,-1))","v":12},9,54,{"$f":"MATCH(O9,ОСН_М3!$D$1:$D$100,1)","v":48},2,178,{"$f":"MATCH(R9,ОСН_М3!$A$1:$A$100,1)","v":39},3,129]
[5,null,null,null,null,null,null,null,13,{"$f":"IF(I10>50,100,MATCH(I10,ОСН_М3!$B$1:$B$100,0)*IF(I10=0,0,1))*IF(I10=0,0,1)","v":16},5,"1.10,6",{"$f":"IFERROR(MATCH(L10,ОСН_М3!$C$1:$C$100,-1),MATCH(\"0:\"&L10,ОСН_М3!$C$1:$C$100,-1))","v":29},7,0,0,9,0,0,8,45]
[6,null,null,null,null,null,null,null,21,{"$f":"IF(I11>50,100,MATCH(I11,ОСН_М3!$B$1:$B$100,0)*IF(I11=0,0,1))*IF(I11=0,0,1)","v":32},2,0,0,10,42,{"$f":"MATCH(O11,ОСН_М3!$D$1:$D$100,1)","v":32},7,158,{"$f":"MATCH(R11,ОСН_М3!$A$1:$A$100,1)","v":29},7,93]
[7,null,null,null,null,null,null,null,5,{"$f":"IF(I12>50,100,MATCH(I12,ОСН_М3!$B$1:$B$100,0)*IF(I12=0,0,1))*IF(I12=0,0,1)","v":5},9,"1.01,2",{"$f":"IFERROR(MATCH(L12,ОСН_М3!$C$1:$C$100,-1),MATCH(\"0:\"&L12,ОСН_М3!$C$1:$C$100,-1))","v":38},3,56,{"$f":"MATCH(O12,ОСН_М3!$D$1:$D$100,1)","v":52},1,200,{"$f":"MATCH(R12,ОСН_М3!$A$1:$A$100,1)","v":50},1,145]
[8,null,null,null,null,null,null,null,11,{"$f":"IF(I13>50,100,MATCH(I13,ОСН_М3!$B$1:$B$100,0)*IF(I13=0,0,1))*IF(I13=0,0,1)","v":12},7,"1.02,1",{"$f":"IFERROR(MATCH(L13,ОСН_М3!$C$1:$C$100,-1),MATCH(\"0:\"&L13,ОСН_М3!$C$1:$C$100,-1))","v":37},4,51,{"$f":"MATCH(O13,ОСН_М3!$D$1:$D$100,1)","v":42},3,170,{"$f":"MATCH(R13,ОСН_М3!$A$1:$A$100,1)","v":35},4,126]
[9,null,null,null,null,null,null,null,18,{"$f":"IF(I14>50,100,MATCH(I14,ОСН_М3!$B$1:$B$100,0)*IF(I14=0,0,1))*IF(I14=0,0,1)","v":26},4,"1.06,5",{"$f":"IFERROR(MATCH(L14,ОСН_М3!$C$1:$C$100,-1),MATCH(\"0:\"&L14,ОСН_М3!$C$1:$C$100,-1))","v":33},5,41,{"$f":"MATCH(O14,ОСН_М3!$D$1:$D$100,1)","v":31},8,169,{"$f":"MATCH(R14,ОСН_М3!$A$1:$A$100,1)","v":34},5,124]
[10,null,null,null,null,null,null,null,10,{"$f":"IF(I15>50,100,MATCH(I15,ОСН_М3!$B$1:$B$100,0)*IF(I15=0,0,1))*IF(I15=0,0,1)","v":10},8,"1.19,3",{"$f":"IFERROR(MATCH(L15,ОСН_М3!$C$1:$C$100,-1),MATCH(\"0:\"&L15,ОСН_М3!$C$1:$C$100,-1))","v":20},8,47,{"$f":"MATCH(O15,ОСН_М3!$D$1:$D$100,1)","v":37},5,170,{"$f":"MATCH(R15,ОСН_М3!$A$1:$A$100,1)","v":35},4,102]
[11,null,null,null,null,null,null,null,0,0,10,"1.07,7",{"$f":"IFERROR(MATCH(L16,ОСН_М3!$C$1:$C$100,-1),MATCH(\"0:\"&L16,ОСН_М3!$C$1:$C$100,-1))","v":32},6,54,{"$f":"MATCH(O16,ОСН_М3!$D$1:$D$100,1)","v":48},2,178,{"$f":"MATCH(R16,ОСН_М3!$A$1:$A$100,1)","v":39},3,119]

{"sheet":"м_4","index":1,"n_rows":23,"n_cols":21,"rows_kept":23,"cut":false,"hidden":false,"merged":[[2,21,3,21],[2,14,2,16],[2,17,2,19],[0,0,0,20],[2,20,3,20],[2,5,3,5],[2,0,3,0],[2,1,3,1],[2,2,3,2],[2,8,2,10],[2,11,2,13],[2,3,3,3],[2,4,3,4],[2,6,3,6],[1,0,1,1]]}
[]
[]
["Номер","Фамилия, Имя ",null,null,null,null,null,null,null,null,null,null,null,null,null,null,null,null,null,null,"Сумма многоборья"]
[null,null,null,null,null,null,null,null,"рез-т","очки","место","рез-т","очки","место","рез-т","очки","место","рез-т","очки","место"]
[]
[1,null,null,null,null,null,null,null,0,0,{"$f":"SUM(N(FREQUENCY((J6<J$6:J$23)*J$6:J$23,J$6:J$23)>0))","v":14},47.6,{"$f":"IFERROR(MATCH(L6,ОСН_М4!$C$1:$C$100,-1),MATCH(\"0:\"&L6,ОСН_М4!$C$1:$C$100,-1))","v":48},{"$f":"SUM(N(FREQUENCY((M6<M$6:M$23)*M$6:M$23,M$6:M$23)>0))","v":9},59,{"$f":"MATCH(O6,ОСН_М4!$D$1:$D$100,1)","v":39},{"$f":"SUM(N(FREQUENCY((P6<P$6:P$23)*P$6:P$23,P$6:P$23)>0))","v":4},215,{"$f":"MATCH(R6,ОСН_М4!$A$1:$A$100,1)","v":42},{"$f":"SUM(N(FREQUENCY((S6<S$6:S$23)*S$6:S$23,S$6:S$23)>0))","v":7},{"$f":"SUM(J6,M6,P6,S6)","v":129}]
[2,null,null,null,null,null,null,null,26,{"$f":"IF(I7>50,100,MATCH(I7,ОСН_М4!$B$1:$B$100,0)*IF(I7=0,0,1))*IF(I7=0,0,1)","v":42},2,44.6,{"$f":"IFERROR(MATCH(L7,ОСН_М4!$C$1:$C$100,-1),MATCH(\"0:\"&L7,ОСН_М4!$C$1:$C$100,-1))","v":51},7,50,{"$f":"MATCH(O7,ОСН_М4!$D$1:$D$100,1)","v":30},10,211,{"$f":"MATCH(R7,ОСН_М4!$A$1:$A$100,1)","v":40},8,{"$f":"SUM(J7,M7,P7,S7)","v":163}]
[3,null,null,null,null,null,null,null,5,{"$f":"IF(I8>50,100,MATCH(I8,ОСН_М4!$B$1:$B$100,0)*IF(I8=0,0,1))*IF(I8=0,0,1)","v":5},11,0,0,13,54,{"$f":"MATCH(O8,ОСН_М4!$D$1:$D$100,1)","v":34},7,229,{"$f":"MATCH(R8,ОСН_М4!$A$1:$A$100,1)","v":49},5,88]
[4,null,null,null,null,null,null,null,6,{"$f":"IF(I9>50,100,MATCH(I9,ОСН_М4!$B$1:$B$100,0)*IF(I9=0,0,1))*IF(I9=0,0,1)","v":6},10,27,{"$f":"IFERROR(MATCH(L9,ОСН_М4!$C$1:$C$100,-1),MATCH(\"0:\"&L9,ОСН_М4!$C$1:$C$100,-1))","v":98},2,61,{"$f":"MATCH(O9,ОСН_М4!$D$1:$D$100,1)","v":42},3,266,{"$f":"MATCH(R9,ОСН_М4!$A$1:$A$100,1)","v":68},1,214]
[5,null,null,null,null,null,null,null,15,{"$f":"IF(I10>50,100,MATCH(I10,ОСН_М4!$B$1:$B$100,0)*IF(I10=0,0,1))*IF(I10=0,0,1)","v":20},5,0,0,13,50,{"$f":"MATCH(O10,ОСН_М4!$D$1:$D$100,1)","v":30},10,235,{"$f":"MATCH(R10,ОСН_М4!$A$1:$A$100,1)","v":52},3,102]
[6,null,null,null,null,null,null,null,2,{"$f":"IF(I11>50,100,MATCH(I11,ОСН_М4!$B$1:$B$100,0)*IF(I11=0,0,1))*IF(I11=0,0,1)","v":2},13,0,0,13,0,0,13,0,0,15,2]
[7,null,null,null,null,null,null,null,18,{"$f":"IF(I12>50,100,MATCH(I12,ОСН_М4!$B$1:$B$100,0)*IF(I12=0,0,1))*IF(I12=0,0,1)","v":26},4,0,0,13,52,{"$f":"MATCH(O12,ОСН_М4!$D$1:$D$100,1)","v":32},8,207,{"$f":"MATCH(R12,ОСН_М4!$A$1:$A$100,1)","v":39},9,97]
[8,null,null,null,null,null,null,null,10,{"$f":"IF(I13>50,100,MATCH(I13,ОСН_М4!$B$1:$B$100,0)*IF(I13=0,0,1))*IF(I13=0,0,1)","v":10},8,null,{"$f":"IFERROR(MATCH(L13,ОСН_М4!$C$1:$C$100,-1),MATCH(\"0:\"&L13,ОСН_М4!$C$1:$C$100,-1))","v":100},1,47,{"$f":"MATCH(O13,ОСН_М4!$D$1:$D$100,1)","v":27},11,205,{"$f":"MATCH(R13,ОСН_М4!$A$1:$A$100,1)","v":38},10,175]
[9,null,null,null,null,null,null,null,13,{"$f":"IF(I14>50,100,MATCH(I14,ОСН_М4!$B$1:$B$100,0)*IF(I14=0,0,1))*IF(I14=0,0,1)","v":16},7,32.799999999999997,{"$f":"IFERROR(MATCH(L14,ОСН_М4!$C$1:$C$100,-1),MATCH(\"0:\"&L14,ОСН_М4!$C$1:$C$100,-1))","v":78},3,47,{"$f":"MATCH(O14,ОСН_М4!$D$1:$D$100,1)","v":27},11,209,{"$f":"MATCH(R14,ОСН_М4!$A$1:$A$100,1)","v":39},9,160]
[10,null,null,null,null,null,null,null,30,{"$f":"IF(I15>50,100,MATCH(I15,ОСН_М4!$B$1:$B$100,0)*IF(I15=0,0,1))*IF(I15=0,0,1)","v":50},1,52.2,{"$f":"IFERROR(MATCH(L15,ОСН_М4!$C$1:$C$100,-1),MATCH(\"0:\"&L15,ОСН_М4!$C$1:$C$100,-1))","v":42},11,56,{"$f":"MATCH(O15,ОСН_М4!$D$1:$D$100,1)","v":36},6,214,{"$f":"MATCH(R15,ОСН_М4!$A$1:$A$100,1)","v":42},7,170]
[11,null,null,null,null,null,null,null,22,{"$f":"IF(I16>50,100,MATCH(I16,ОСН_М4!$B$1:$B$100,0)*IF(I16=0,0,1))*IF(I16=0,0,1)","v":34},3,43.3,{"$f":"IFERROR(MATCH(L16,ОСН_М4!$C$1:$C$100,-1),MATCH(\"0:\"&L16,ОСН_М4!$C$1:$C$100,-1))","v":53},6,66,{"$f":"MATCH(O16,ОСН_М4!$D$1:$D$100,1)","v":52},2,220,{"$f":"MATCH(R16,ОСН_М4!$A$1:$A$100,1)","v":45},6,184]
[12,null,null,null,null,null,null,null,9,{"$f":"IF(I17>50,100,MATCH(I17,ОСН_М4!$B$1:$B$100,0)*IF(I17=0,0,1))*IF(I17=0,0,1)","v":9},9,41.9,{"$f":"IFERROR(MATCH(L17,ОСН_М4!$C$1:$C$100,-1),MATCH(\"0:\"&L17,ОСН_М4!$C$1:$C$100,-1))","v":56},4,51,{"$f":"MATCH(O17,ОСН_М4!$D$1:$D$100,1)","v":31},9,240,{"$f":"MATCH(R17,ОСН_М4!$A$1:$A$100,1)","v":55},2,151]
[13,null,null,null,null,null,null,null,26,{"$f":"IF(I18>50,100,MATCH(I18,ОСН_М4!$B$1:$B$100,0)*IF(I18=0,0,1))*IF(I18=0,0,1)","v":42},2,45.4,{"$f":"IFERROR(MATCH(L18,ОСН_М4!$C$1:$C$100,-1),MATCH(\"0:\"&L18,ОСН_М4!$C$1:$C$100,-1))","v":50},8,54,{"$f":"MATCH(O18,ОСН_М4!$D$1:$D$100,1)","v":34},7,201,{"$f":"MATCH(R18,ОСН_М4!$A$1:$A$100,1)","v":37},11,163]
[14,null,null,null,null,null,null,null,22,{"$f":"IF(I19>50,100,MATCH(I19,ОСН_М4!$B$1:$B$100,0)*IF(I19=0,0,1))*IF(I19=0,0,1)","v":34},3,52.6,{"$f":"IFERROR(MATCH(L19,ОСН_М4!$C$1:$C$100,-1),MATCH(\"0:\"&L19,ОСН_М4!$C$1:$C$100,-1))","v":42},11,41,{"$f":"MATCH(O19,ОСН_М4!$D$1:$D$100,1)","v":21},12,195,{"$f":"MATCH(R19,ОСН_М4!$A$1:$A$100,1)","v":35},13,132]
[15,null,null,null,null,null,null,null,10,{"$f":"IF(I20>50,100,MATCH(I20,ОСН_М4!$B$1:$B$100,0)*IF(I20=0,0,1))*IF(I20=0,0,1)","v":10},8,"1.18,9",{"$f":"IFERROR(MATCH(L20,ОСН_М4!$C$1:$C$100,-1),MATCH(\"0:\"&L20,ОСН_М4!$C$1:$C$100,-1))","v":20},12,68,{"$f":"MATCH(O20,ОСН_М4!$D$1:$D$100,1)","v":56},1,194,{"$f":"MATCH(R20,ОСН_М4!$A$1:$A$100,1)","v":34},14,120]
[16,null,null,null,null,null,null,null,3,{"$f":"IF(I21>50,100,MATCH(I21,ОСН_М4!$B$1:$B$100,0)*IF(I21=0,0,1))*IF(I21=0,0,1)","v":3},12,44.6,{"$f":"IFERROR(MATCH(L21,ОСН_М4!$C$1:$C$100,-1),MATCH(\"0:\"&L21,ОСН_М4!$C$1:$C$100,-1))","v":51},7,54,{"$f":"MATCH(O21,ОСН_М4!$D$1:$D$100,1)","v":34},7,198,{"$f":"MATCH(R21,ОСН_М4!$A$1:$A$100,1)","v":36},12,124]
[17,null,null,null,null,null,null,null,14,{"$f":"IF(I22>50,100,MATCH(I22,ОСН_М4!$B$1:$B$100,0)*IF(I22=0,0,1))*IF(I22=0,0,1)","v":18},6,42.7,{"$f":"IFERROR(MATCH(L22,ОСН_М4!$C$1:$C$100,-1),MATCH(\"0:\"&L22,ОСН_М4!$C$1:$C$100,-1))","v":54},5,68,{"$f":"MATCH(O22,ОСН_М4!$D$1:$D$100,1)","v":56},1,230,{"$f":"MATCH(R22,ОСН_М4!$A$1:$A$100,1)","v":50},4,178]
[18,null,null,null,null,null,null,null,9,{"$f":"IF(I23>50,100,MATCH(I23,ОСН_М4!$B$1:$B$100,0)*IF(I23=0,0,1))*IF(I23=0,0,1)","v":9},9,50.9,{"$f":"IFERROR(MATCH(L23,ОСН_М4!$C$1:$C$100,-1),MATCH(\"0:\"&L23,ОСН_М4!$C$1:$C$100,-1))","v":44},10,58,{"$f":"MATCH(O23,ОСН_М4!$D$1:$D$100,1)","v":38},5,205,{"$f":"MATCH(R23,ОСН_М4!$A$1:$A$100,1)","v":38},10,129]

{"sheet":"ОСН_М3","index":2,"n_rows":100,"n_cols":4,"rows_kept":100,"cut":false,"hidden":false,"merged":[]}
[60,1,"2.30,0",2]
[66,2,"2.23,0",4]
[71,3,"2.18,0",6]
[76,4,"2.14,0",8]
[80,5,"2.10,0",10]
[84,6,"2.06,0",12]
[88,7,"2.02,0",14]
[92,8,"1.58,0",16]
[96,9,"1.54,0",18]
[100,10,"1.50,0",20]
[103,null,"1.47,0",21]
[106,11,"1.44,0",22]
[109,null,"1.41,0",23]
[112,12,"1.38,0",24]
[115,null,"1.35,0",25]
[118,13,"1.32,0",26]
[121,null,"1.29,0",27]
[124,14,"1.26,0",28]
[127,null,"1.23,0",29]
[130,15,"1.20,0",30]
[133,null,"1.19,0",31]
[136,16,"1.18,0",32]
[139,null,"1.17,0",33]
[142,17,"1.16,0",34]
[145,null,"1.15,0",35]
[148,18,"1.14,0",36]
[151,null,"1.13,0",37]
[154,19,"1.12,0",38]
[157,null,"1.11,0",39]
[160,20,"1.10,0",40]
[162,null,"1.09,0",41]
[164,21,"1.08,0",42]
[166,null,"1.07,0",43]
[168,22,"1.06,0",44]
[170,null,"1.05,0",45]
[172,23,"1.04,0",46]
[174,null,"1.03,0",47]
[176,24,"1.02,0",48]
[178,null,"1.01,0",49]
[180,25,"1.00,0",50]
[182,null,59,"-"]
[184,26,58,51]
[186,null,57,"-"]
[188,27,56,52]
[190,null,55,"-"]
[192,28,54,53]
[194,null,53,"-"]
[196,29,52,54]
[198,null,51,"-"]
[200,30,50,55]
[202,null,49,"-"]
[204,31,48.2,56]
[206,null,47.4,"-"]
[208,32,46.6,57]
[210,null,45.8,"-"]
[212,33,45,58]
[214,null,44.4,"-"]
[216,34,43.8,59]
[218,null,43.2,"-"]
[220,35,42.6,60]
[221,null,42,"-"]
[222,36,41.5,61]
[223,null,41,"-"]
[224,37,40.5,62]
[225,null,40,"-"]
[226,38,39.6,63]
[227,null,39.200000000000003,"-"]
[228,39,38.799999999999997,64]
[229,null,38.4,"-"]
[230,40,38,65]
[231,null,37.6,"-"]
[232,null,37.200000000000003,66]
[233,41,36.799999999999997,"-"]
[234,null,36.4,67]
[235,null,36,"-"]
[236,42,35.6,68]
[237,null,35.200000000000003,"-"]
[238,null,34.799999999999997,69]
[239,43,34.4,"-"]
[240,null,34,70]
[241,null,33.700000000000003,"-"]
[242,44,33.4,71]
[243,null,33.1,"-"]
[244,null,32.799999999999997,72]
[245,45,32.5,"-"]
[246,null,32.200000000000003,73]
[247,null,31.9,"-"]
[248,46,31.6,74]
[249,null,31.3,"-"]
[250,null,31,75]
[251,47,30.8,"-"]
[252,null,30.6,76]
[253,null,30.4,"-"]
[254,48,30.2,77]
[255,null,30,"-"]
[256,null,29.8,78]
[257,49,29.6,"-"]
[258,null,29.4,79]
[259,null,29.2,"-"]
[260,50,29,80]

{"sheet":"ОСН_М4","index":3,"n_rows":100,"n_cols":4,"rows_kept":100,"cut":false,"hidden":false,"merged":[]}
[70,1,"2.00,0",3]
[76,2,"1.57,0",6]
[81,3,"1.54,0",9]
[86,4,"1.52,0",12]
[90,5,"1.50,0",15]
[94,6,"1.48,0",18]
[98,7,"1.46,0",20]
[102,8,"1.44,0",22]
[106,9,"1.42,0",24]
[110,10,"1.40,0",26]
[114,"-","1.38,0",28]
[118,11,"1.36,0",30]
[122,"-","1.34,0",32]
[126,12,"1.32,0",34]
[130,"-","1.30,0",35]
[134,13,"1.28,0",36]
[138,"-","1.26,0",37]
[142,14,"1.24,0",38]
[146,"-","1.22,0",39]
[150,15,"1.20,0",40]
[153,"-","1.18,0",41]
[156,16,"1.16,0",42]
[159,"-","1.14,0",43]
[162,17,"1.12,0",44]
[165,"-","1.10,0",45]
[168,18,"1.09,0",46]
[171,"-","1.08,0",47]
[174,19,"1.07,0",48]
[177,"-","1.06,0",49]
[180,20,"1.05,0",50]
[183,"-","1.04,0",51]
[186,21,"1.03,0",52]
[189,"-","1.02,0",53]
[192,22,"1.01,0",54]
[195,"-","1.00,0",55]
[198,23,59,56]
[201,"-",58,57]
[204,24,57,58]
[207,"-",56,59]
[210,25,55,60]
[212,"-",54,"-"]
[214,26,53,61]
[216,"-",52,"-"]
[218,27,51,62]
[220,"-",50,"-"]
[222,28,49.2,63]
[224,"-",48.4,"-"]
[226,29,47.6,64]
[228,"-",46.8,"-"]
[230,30,46,65]
[232,"-",45.2,"-"]
[234,31,44.4,66]
[236,"-",43.8,"-"]
[238,32,43.2,67]
[240,"-",42.6,"-"]
[242,33,42,68]
[244,"-",41.5,"-"]
[246,34,41,69]
[248,"-",40.5,"-"]
[250,35,40,70]
[252,"-",39.6,"-"]
[254,36,39.200000000000003,71]
[256,"-",38.799999999999997,"-"]
[258,37,38.4,72]
[260,"-",38,"-"]
[262,38,37.6,73]
[264,"-",37.200000000000003,"-"]
[266,39,36.799999999999997,74]
[268,"-",36.4,"-"]
[270,40,36,75]
[271,"-",35.6,"-"]
[272,"-",35.200000000000003,76]
[273,41,34.799999999999997,"-"]
[274,"-",34.4,77]
[275,"-",34,"-"]
[276,42,33.6,78]
[277,"-",33.200000000000003,"-"]
[278,"-",32.799999999999997,79]
[279,43,32.4,"-"]
[280,"-",32,80]
[281,"-",31.6,"-"]
[282,44,31.2,81]
[283,"-",30.8,"-"]
[284,"-",30.5,82]
[285,45,30.2,"-"]
[286,"-",29.9,83]
[287,"-",29.6,"-"]
[288,46,29.3,84]
[289,"-",29,"-"]
[290,"-",28.7,85]
[291,47,28.4,"-"]
[292,"-",28.2,86]
[293,"-",28,"-"]
[294,48,27.8,87]
[295,"-",27.6,"-"]
[296,"-",27.4,88]
[297,49,27.2,"-"]
[298,"-",27,89]
[299,"-",26.8,"-"]
[300,50,26.6,90]

{"sheet":"плавание (2)","index":4,"n_rows":102,"n_cols":2,"rows_kept":102,"cut":false,"hidden":true,"merged":[[0,1,1,1],[0,3,1,3]]}
["плавание","Очки"]
["25 м"]
[60.1,1]
[60.05,2]
[1.02,3]
[1,4]
[58,5]
[57,6]
[56,7]
[55,8]
[54,9]
[53,10]
[52,11]
[51,12]
[50,13]
[49,14]
[48,15]
[47,16]
[46,17]
[45,18]
[44.2,19]
[43.4,20]
[42.6,21]
[41.8,22]
[41,23]
[40.4,24]
[39.799999999999997,25]
[39.200000000000003,26]
[38.6,27]
[38,28]
[37.5,29]
[37,30]
[36.5,31]
[36,32]
[35.5,33]
[35,34]
[34.5,35]
[34,36]
[33.5,37]
[33,38]
[32.5,39]
[32,40]
[31.6,41]
[31.2,42]
[30.8,43]
[30.4,44]
[30,45]
[29.6,46]
[29.2,47]
[28.8,48]
[28.4,49]
[28,50]
[27.7,51]
[27.4,52]
[27.1,53]
[26.8,54]
[26.5,55]
[26.2,56]
[25.9,57]
[25.6,58]
[25.3,59]
[25,60]
[24.7,61]
[24.4,62]
[24.1,63]
[23.8,64]
[23.5,65]
[23.2,66]
[22.9,67]
[22.6,68]
[22.3,69]
[22,70]
[21.7,71]
[21.4,72]
[21.1,73]
[20.8,74]
[20.5,75]
[20.2,76]
[19.899999999999999,77]
[19.600000000000001,78]
[19.3,79]
[19,80]
[18.8,81]
[18.600000000000001,82]
[18.399999999999999,83]
[18.2,84]
[18,85]
[17.8,86]
[17.600000000000001,87]
[17.399999999999999,88]
[17.2,89]
[17,90]
[16.8,91]
[16.600000000000001,92]
[16.399999999999999,93]
[16.2,94]
[16,95]
[15.8,96]
[15.6,97]
[15.4,98]
[15.2,99]
[15,100]

{"sheet":"отжимание (2)","index":5,"n_rows":102,"n_cols":19,"rows_kept":102,"cut":false,"hidden":true,"merged":[[0,1,1,1],[0,3,1,3]]}
["Стрельба ","Очки"]
["ВП\n5в\n"]
["-",1,null,null,null,null,null,null,null,null,null,null,null,null,null,null,null,null,1]
["-",2,null,null,null,null,null,null,null,null,null,null,null,null,null,null,null,null,2]
[1,3,null,null,null,null,null,null,null,null,null,null,null,null,null,null,null,null,3]
["-",4]
["-",5]
[2,6]
["-",7]
["-",8]
[3,9]
["-",10]
["-",11]
[4,12]
["-",13]
["-",14]
[5,15]
["-",16]
["-",17]
[6,18]
["-",19]
["-",20]
[7,21]
["-",22]
["-",23]
[8,24]
["-",25]
["-",26]
[9,27]
["-",28]
["-",29]
[10,30]
["-",31]
[11,32]
["-",33]
[12,34]
["-",35]
[13,36]
["-",37]
[14,38]
["-",39]
[15,40]
["-",41]
[16,42]
["-",43]
[17,44]
["-",45]
[18,46]
["-",47]
[19,48]
["-",49]
[20,50]
[21,51]
[22,52]
[23,53]
[24,54]
[25,55]
[26,56]
[27,57]
[28,58]
[29,59]
[30,60]
[31,61]
[32,62]
[33,63]
[34,64]
[35,65]
[36,66]
[37,67]
[38,68]
[39,69]
[40,70]
[42,71]
[44,72]
[46,73]
[48,74]
[50,75]
[52,76]
[54,77]
[56,78]
[58,79]
[60,80]
[62,81]
[64,82]
[66,83]
[68,84]
[70,85]
[72,86]
[74,87]
[76,88]
[78,89]
[80,90]
[82,91]
[84,92]
[86,93]
[88,94]
[90,95]
[92,96]
[94,97]
[96,98]
[98,99]
[100,100]

{"sheet":"Стрельба (2)","index":6,"n_rows":102,"n_cols":19,"rows_kept":102,"cut":false,"hidden":true,"merged":[[0,3,1,3],[0,1,1,1]]}
["Стрельба ","Очки"]
["ВП\n5в\n"]
[1,1,null,null,null,null,null,null,null,null,null,null,null,null,null,null,null,null,1]
[2,2,null,null,null,null,null,null,null,null,null,null,null,null,null,null,null,null,2]
[3,3,null,null,null,null,null,null,null,null,null,null,null,null,null,null,null,null,3]
[4,4]
[5,5]
[6,6]
[7,7]
[8,8]
[9,9]
[10,10]
["-",11]
[11,12]
["-",13]
[12,14]
["-",15]
[13,16]
["-",17]
[14,18]
["-",19]
[15,20]
["-",21]
[16,22]
["-",23]
[17,24]
["-",25]
[18,26]
["-",27]
[19,28]
["-",29]
[20,30]
["-",31]
[21,32]
["-",33]
[22,34]
["-",35]
[23,36]
["-",37]
[24,38]
["-",39]
[25,40]
["-",41]
[26,42]
["-",43]
[27,44]
["-",45]
[28,46]
["-",47]
[29,48]
["-",49]
[30,50]
["-",51]
[31,52]
["-",53]
[32,54]
["-",55]
[33,56]
["-",57]
[34,58]
["-",59]
[35,60]
["-",61]
[36,62]
["-",63]
[37,64]
["-",65]
[38,66]
["-",67]
[39,68]
["-",69]
[40,70]
["-",71]
["-",72]
[41,73]
["-",74]
["-",75]
[42,76]
["-",77]
["-",78]
[43,79]
["-",80]
["-",81]
[44,82]
["-",83]
["-",84]
[45,85]
["-",86]
["-",87]
[46,88]
["-",89]
["-",90]
[47,91]
["-",92]
["-",93]
[48,94]
["-",95]
["-",96]
[49,97]
["-",98]
["-",99]
[50,100]

{"sheet":"плавание","index":7,"n_rows":102,"n_cols":2,"rows_kept":102,"cut":false,"hidden":true,"merged":[[0,1,1,1],[0,3,1,3]]}
["плавание","Очки"]
["25 м"]
[60.1,1]
[60.05,2]
[1.02,3]
[1,4]
[58,5]
[57,6]
[56,7]
[55,8]
[54,9]
[53,10]
[52,11]
[51,12]
[50,13]
[49,14]
[48,15]
[47,16]
[46,17]
[45,18]
[44.2,19]
[43.4,20]
[42.6,21]
[41.8,22]
[41,23]
[40.4,24]
[39.799999999999997,25]
[39.200000000000003,26]
[38.6,27]
[38,28]
[37.5,29]
[37,30]
[36.5,31]
[36,32]
[35.5,33]
[35,34]
[34.5,35]
[34,36]
[33.5,37]
[33,38]
[32.5,39]
[32,40]
[31.6,41]
[31.2,42]
[30.8,43]
[30.4,44]
[30,45]
[29.6,46]
[29.2,47]
[28.8,48]
[28.4,49]
[28,50]
[27.7,51]
[27.4,52]
[27.1,53]
[26.8,54]
[26.5,55]
[26.2,56]
[25.9,57]
[25.6,58]
[25.3,59]
[25,60]
[24.7,61]
[24.4,62]
[24.1,63]
[23.8,64]
[23.5,65]
[23.2,66]
[22.9,67]
[22.6,68]
[22.3,69]
[22,70]
[21.7,71]
[21.4,72]
[21.1,73]
[20.8,74]
[20.5,75]
[20.2,76]
[19.899999999999999,77]
[19.600000000000001,78]
[19.3,79]
[19,80]
[18.8,81]
[18.600000000000001,82]
[18.399999999999999,83]
[18.2,84]
[18,85]
[17.8,86]
[17.600000000000001,87]
[17.399999999999999,88]
[17.2,89]
[17,90]
[16.8,91]
[16.600000000000001,92]
[16.399999999999999,93]
[16.2,94]
[16,95]
[15.8,96]
[15.6,97]
[15.4,98]
[15.2,99]
[15,100]

{"sheet":"отжимание","index":8,"n_rows":102,"n_cols":19,"rows_kept":102,"cut":false,"hidden":true,"merged":[[0,1,1,1],[0,3,1,3]]}
["Стрельба ","Очки"]
["ВП\n5в\n"]
["-",1,null,null,null,null,null,null,null,null,null,null,null,null,null,null,null,null,1]
["-",2,null,null,null,null,null,null,null,null,null,null,null,null,null,null,null,null,2]
[1,3,null,null,null,null,null,null,null,null,null,null,null,null,null,null,null,null,3]
["-",4]
["-",5]
[2,6]
["-",7]
["-",8]
[3,9]
["-",10]
["-",11]
[4,12]
["-",13]
["-",14]
[5,15]
["-",16]
["-",17]
[6,18]
["-",19]
["-",20]
[7,21]
["-",22]
["-",23]
[8,24]
["-",25]
["-",26]
[9,27]
["-",28]
["-",29]
[10,30]
["-",31]
[11,32]
["-",33]
[12,34]
["-",35]
[13,36]
["-",37]
[14,38]
["-",39]
[15,40]
["-",41]
[16,42]
["-",43]
[17,44]
["-",45]
[18,46]
["-",47]
[19,48]
["-",49]
[20,50]
[21,51]
[22,52]
[23,53]
[24,54]
[25,55]
[26,56]
[27,57]
[28,58]
[29,59]
[30,60]
[31,61]
[32,62]
[33,63]
[34,64]
[35,65]
[36,66]
[37,67]
[38,68]
[39,69]
[40,70]
[42,71]
[44,72]
[46,73]
[48,74]
[50,75]
[52,76]
[54,77]
[56,78]
[58,79]
[60,80]
[62,81]
[64,82]
[66,83]
[68,84]
[70,85]
[72,86]
[74,87]
[76,88]
[78,89]
[80,90]
[82,91]
[84,92]
[86,93]
[88,94]
[90,95]
[92,96]
[94,97]
[96,98]
[98,99]
[100,100]

{"sheet":"Стрельба","index":9,"n_rows":102,"n_cols":19,"rows_kept":102,"cut":false,"hidden":true,"merged":[[0,3,1,3],[0,1,1,1]]}
["Стрельба ","Очки"]
["ВП\n5в\n"]
[1,1,null,null,null,null,null,null,null,null,null,null,null,null,null,null,null,null,1]
[2,2,null,null,null,null,null,null,null,null,null,null,null,null,null,null,null,null,2]
[3,3,null,null,null,null,null,null,null,null,null,null,null,null,null,null,null,null,3]
[4,4]
[5,5]
[6,6]
[7,7]
[8,8]
[9,9]
[10,10]
["-",11]
[11,12]
["-",13]
[12,14]
["-",15]
[13,16]
["-",17]
[14,18]
["-",19]
[15,20]
["-",21]
[16,22]
["-",23]
[17,24]
["-",25]
[18,26]
["-",27]
[19,28]
["-",29]
[20,30]
["-",31]
[21,32]
["-",33]
[22,34]
["-",35]
[23,36]
["-",37]
[24,38]
["-",39]
[25,40]
["-",41]
[26,42]
["-",43]
[27,44]
["-",45]
[28,46]
["-",47]
[29,48]
["-",49]
[30,50]
["-",51]
[31,52]
["-",53]
[32,54]
["-",55]
[33,56]
["-",57]
[34,58]
["-",59]
[35,60]
["-",61]
[36,62]
["-",63]
[37,64]
["-",65]
[38,66]
["-",67]
[39,68]
["-",69]
[40,70]
["-",71]
["-",72]
[41,73]
["-",74]
["-",75]
[42,76]
["-",77]
["-",78]
[43,79]
["-",80]
["-",81]
[44,82]
["-",83]
["-",84]
[45,85]
["-",86]
["-",87]
[46,88]
["-",89]
["-",90]
[47,91]
["-",92]
["-",93]
[48,94]
["-",95]
["-",96]
[49,97]
["-",98]
["-",99]
[50,100]