{"text_format":"1","workbook":"xlsx","n_sheets":3,"sheets":["Лист1","Лист2","Лист3"],"not_rendered":{"charts":0,"images":0,"macros":1,"external_links":0,"defined_names":0,"comments":0,"pivot_tables":0},"unopened":[],"bounds":{"document_bytes":16777216,"sheet_cells":100000,"rows_first":2000,"rows_last":500,"rows_between":2000,"halvings":0,"cell_chars":16384,"cell_head_chars":4096},"cells_cut":0,"cells_raw":0,"read":"whole","date_system":"1900"}

{"sheet":"Лист1","index":0,"n_rows":86,"n_cols":12,"rows_kept":86,"cut":false,"hidden":false,"merged":[]}
["А",111,null,null,"А",111,"А",111,null,null,{"$f":"111","v":111},111]
["Æ",113,null,null,"Æ",113,"Æ",112,null,null,{"$f":"K1+1","v":112},{"$f":"L1+2","v":113}]
["Б",115,null,null,"Б",115,"Б",113,null,null,{"$f":"K2+1","v":113},{"$f":"L2+2","v":115}]
["В",117,null,null,"В",117,"В",114,null,null,114,117]
["Г",119,null,null,"Г",119,"Г",115,null,null,115,119]
["Гъ",121,null,null,"Гъ",121,"Гъ",116,null,null,116,121]
{"$rows_left_out":81}
{"sheet":"Лист2","index":1,"n_rows":50,"n_cols":46,"rows_kept":50,"cut":false,"hidden":false,"merged":[]}
["КъæпвУЗПъяпжэрЕгъкЧъщЩтвЛ",{"$f":"LEN(A1)","v":25},{"$f":"$G1&$H1&$I1&$J1&$K1&$L1&$M1&$N1&$O1&$P1&$Q1&$R1&$S1&$T1&$U1&$V1&$W1&$X1&$Y1&$Z1&$AA1&$AB1&$AC1&$AD1&$AE1&$AF1&$AG1&$AH1&$AI1&$AJ1&$AK1&$AL1&$AM1&$AN1&$AO1&$AP1&$AR1&$AS1&$AT1","v":"ÆГТъфдзбьТъаКъфлд"},null,null,{"$f":"ROUND(RAND()*29+1,0)","v":13},{"$f":"IF((COLUMN()-COLUMN($F$1))>$F1,\"\",INDEX(Лист1!$A$1:$A$86,ROUND(RAND()*85+1,0)))","v":"Æ"},{"$f":"IF((COLUMN()-COLUMN($F$1))>$F1,\"\",INDEX(Лист1!$A$1:$A$86,ROUND(RAND()*85+1,0)))","v":"Г"},{"$f":"IF((COLUMN()-COLUMN($F$1))>$F1,\"\",INDEX(Лист1!$A$1:$A$86,ROUND(RAND()*85+1,0)))","v":"Тъ"},{"$f":"IF((COLUMN()-COLUMN($F$1))>$F1,\"\",INDEX(Лист1!$A$1:$A$86,ROUND(RAND()*85+1,0)))","v":"ф"},{"$f":"IF((COLUMN()-COLUMN($F$1))>$F1,\"\",INDEX(Лист1!$A$1:$A$86,ROUND(RAND()*85+1,0)))","v":"дз"},{"$f":"IF((COLUMN()-COLUMN($F$1))>$F1,\"\",INDEX(Лист1!$A$1:$A$86,ROUND(RAND()*85+1,0)))","v":"б"},{"$f":"IF((COLUMN()-COLUMN($F$1))>$F1,\"\",INDEX(Лист1!$A$1:$A$86,ROUND(RAND()*85+1,0)))","v":"ь"},{"$f":"IF((COLUMN()-COLUMN($F$1))>$F1,\"\",INDEX(Лист1!$A$1:$A$86,ROUND(RAND()*85+1,0)))","v":"Тъ"},{"$f":"IF((COLUMN()-COLUMN($F$1))>$F1,\"\",INDEX(Лист1!$A$1:$A$86,ROUND(RAND()*85+1,0)))","v":"а"},{"$f":"IF((COLUMN()-COLUMN($F$1))>$F1,\"\",INDEX(Лист1!$A$1:$A$86,ROUND(RAND()*85+1,0)))","v":"Къ"},{"$f":"IF((COLUMN()-COLUMN($F$1))>$F1,\"\",INDEX(Лист1!$A$1:$A$86,ROUND(RAND()*85+1,0)))","v":"ф"},{"$f":"IF((COLUMN()-COLUMN($F$1))>$F1,\"\",INDEX(Лист1!$A$1:$A$86,ROUND(RAND()*85+1,0)))","v":"л"},{"$f":"IF((COLUMN()-COLUMN($F$1))>$F1,\"\",INDEX(Лист1!$A$1:$A$86,ROUND(RAND()*85+1,0)))","v":"д"},{"$f":"IF((COLUMN()-COLUMN($F$1))>$F1,\"\",INDEX(Лист1!$A$1:$A$86,ROUND(RAND()*85+1,0)))","v":""},{"$f":"IF((COLUMN()-COLUMN($F$1))>$F1,\"\",INDEX(Лист1!$A$1:$A$86,ROUND(RAND()*85+1,0)))","v":""},{"$f":"IF((COLUMN()-COLUMN($F$1))>$F1,\"\",INDEX(Лист1!$A$1:$A$86,ROUND(RAND()*85+1,0)))","v":""},{"$f":"IF((COLUMN()-COLUMN($F$1))>$F1,\"\",INDEX(Лист1!$A$1:$A$86,ROUND(RAND()*85+1,0)))","v":""},{"$f":"IF((COLUMN()-COLUMN($F$1))>$F1,\"\",INDEX(Лист1!$A$1:$A$86,ROUND(RAND()*85+1,0)))","v":""},{"$f":"IF((COLUMN()-COLUMN($F$1))>$F1,\"\",INDEX(Лист1!$A$1:$A$86,ROUND(RAND()*85+1,0)))","v":""},{"$f":"IF((COLUMN()-COLUMN($F$1))>$F1,\"\",INDEX(Лист1!$A$1:$A$86,ROUND(RAND()*85+1,0)))","v":""},{"$f":"IF((COLUMN()-COLUMN($F$1))>$F1,\"\",INDEX(Лист1!$A$1:$A$86,ROUND(RAND()*85+1,0)))","v":""},{"$f":"IF((COLUMN()-COLUMN($F$1))>$F1,\"\",INDEX(Лист1!$A$1:$A$86,ROUND(RAND()*85+1,0)))","v":""},{"$f":"IF((COLUMN()-COLUMN($F$1))>$F1,\"\",INDEX(Лист1!$A$1:$A$86,ROUND(RAND()*85+1,0)))","v":""},{"$f":"IF((COLUMN()-COLUMN($F$1))>$F1,\"\",INDEX(Лист1!$A$1:$A$86,ROUND(RAND()*85+1,0)))","v":""},{"$f":"IF((COLUMN()-COLUMN($F$1))>$F1,\"\",INDEX(Лист1!$A$1:$A$86,ROUND(RAND()*85+1,0)))","v":""},{"$f":"IF((COLUMN()-COLUMN($F$1))>$F1,\"\",INDEX(Лист1!$A$1:$A$86,ROUND(RAND()*85+1,0)))","v":""},{"$f":"IF((COLUMN()-COLUMN($F$1))>$F1,\"\",INDEX(Лист1!$A$1:$A$86,ROUND(RAND()*85+1,0)))","v":""},{"$f":"IF((COLUMN()-COLUMN($F$1))>$F1,\"\",INDEX(Лист1!$A$1:$A$86,ROUND(RAND()*85+1,0)))","v":""},{"$f":"IF((COLUMN()-COLUMN($F$1))>$F1,\"\",INDEX(Лист1!$A$1:$A$86,ROUND(RAND()*85+1,0)))","v":""},{"$f":"IF((COLUMN()-COLUMN($F$1))>$F1,\"\",INDEX(Лист1!$A$1:$A$86,ROUND(RAND()*85+1,0)))","v":""},{"$f":"IF((COLUMN()-COLUMN($F$1))>$F1,\"\",INDEX(Лист1!$A$1:$A$86,ROUND(RAND()*85+1,0)))","v":""},{"$f":"IF((COLUMN()-COLUMN($F$1))>$F1,\"\",INDEX(Лист1!$A$1:$A$86,ROUND(RAND()*85+1,0)))","v":""},{"$f":"IF((COLUMN()-COLUMN($F$1))>$F1,\"\",INDEX(Лист1!$A$1:$A$86,ROUND(RAND()*85+1,0)))","v":""},{"$f":"IF((COLUMN()-COLUMN($F$1))>$F1,\"\",INDEX(Лист1!$A$1:$A$86,ROUND(RAND()*85+1,0)))","v":""},{"$f":"IF((COLUMN()-COLUMN($F$1))>$F1,\"\",INDEX(Лист1!$A$1:$A$86,ROUND(RAND()*85+1,0)))","v":""},{"$f":"IF((COLUMN()-COLUMN($F$1))>$F1,\"\",INDEX(Лист1!$A$1:$A$86,ROUND(RAND()*85+1,0)))","v":""},{"$f":"IF((COLUMN()-COLUMN($F$1))>$F1,\"\",INDEX(Лист1!$A$1:$A$86,ROUND(RAND()*85+1,0)))","v":""},{"$f":"IF((COLUMN()-COLUMN($F$1))>$F1,\"\",INDEX(Лист1!$A$1:$A$86,ROUND(RAND()*85+1,0)))","v":""},{"$f":"IF((COLUMN()-COLUMN($F$1))>$F1,\"\",INDEX(Лист1!$A$1:$A$86,ROUND(RAND()*85+1,0)))","v":""},{"$f":"IF((COLUMN()-COLUMN($F$1))>$F1,\"\",INDEX(Лист1!$A$1:$A$86,ROUND(RAND()*85+1,0)))","v":""}]
["Жы",{"$f":"LEN(A2)","v":2},{"$f":"$G2&$H2&$I2&$J2&$K2&$L2&$M2&$N2&$O2&$P2&$Q2&$R2&$S2&$T2&$U2&$V2&$W2&$X2&$Y2&$Z2&$AA2&$AB2&$AC2&$AD2&$AE2&$AF2&$AG2&$AH2&$AI2&$AJ2&$AK2&$AL2&$AM2&$AN2&$AO2&$AP2&$AR2&$AS2&$AT2","v":"бÆБЪЧъЦСвмУПОæрьубгъПЯтъцЪецъф"},null,null,{"$f":"ROUND(RAND()*29+1,0)","v":26},{"$f":"IF((COLUMN()-COLUMN($F$1))>$F2,\"\",INDEX(Лист1!$A$1:$A$86,ROUND(RAND()*85+1,0)))","v":"б"},{"$f":"IF((COLUMN()-COLUMN($F$1))>$F2,\"\",INDEX(Лист1!$A$1:$A$86,ROUND(RAND()*85+1,0)))","v":"Æ"},{"$f":"IF((COLUMN()-COLUMN($F$1))>$F2,\"\",INDEX(Лист1!$A$1:$A$86,ROUND(RAND()*85+1,0)))","v":"Б"},{"$f":"IF((COLUMN()-COLUMN($F$1))>$F2,\"\",INDEX(Лист1!$A$1:$A$86,ROUND(RAND()*85+1,0)))","v":"Ъ"},{"$f":"IF((COLUMN()-COLUMN($F$1))>$F2,\"\",INDEX(Лист1!$A$1:$A$86,ROUND(RAND()*85+1,0)))","v":"Чъ"},{"$f":"IF((COLUMN()-COLUMN($F$1))>$F2,\"\",INDEX(Лист1!$A$1:$A$86,ROUND(RAND()*85+1,0)))","v":"Ц"},{"$f":"IF((COLUMN()-COLUMN($F$1))>$F2,\"\",INDEX(Лист1!$A$1:$A$86,ROUND(RAND()*85+1,0)))","v":"С"},{"$f":"IF((COLUMN()-COLUMN($F$1))>$F2,\"\",INDEX(Лист1!$A$1:$A$86,ROUND(RAND()*85+1,0)))","v":"в"},{"$f":"IF((COLUMN()-COLUMN($F$1))>$F2,\"\",INDEX(Лист1!$A$1:$A$86,ROUND(RAND()*85+1,0)))","v":"м"},{"$f":"IF((COLUMN()-COLUMN($F$1))>$F2,\"\",INDEX(Лист1!$A$1:$A$86,ROUND(RAND()*85+1,0)))","v":"У"},{"$f":"IF((COLUMN()-COLUMN($F$1))>$F2,\"\",INDEX(Лист1!$A$1:$A$86,ROUND(RAND()*85+1,0)))","v":"П"},{"$f":"IF((COLUMN()-COLUMN($F$1))>$F2,\"\",INDEX(Лист1!$A$1:$A$86,ROUND(RAND()*85+1,0)))","v":"О"},{"$f":"IF((COLUMN()-COLUMN($F$1))>$F2,\"\",INDEX(Лист1!$A$1:$A$86,ROUND(RAND()*85+1,0)))","v":"æ"},{"$f":"IF((COLUMN()-COLUMN($F$1))>$F2,\"\",INDEX(Лист1!$A$1:$A$86,ROUND(RAND()*85+1,0)))","v":"р"},{"$f":"IF((COLUMN()-COLUMN($F$1))>$F2,\"\",INDEX(Лист1!$A$1:$A$86,ROUND(RAND()*85+1,0)))","v":"ь"},{"$f":"IF((COLUMN()-COLUMN($F$1))>$F2,\"\",INDEX(Лист1!$A$1:$A$86,ROUND(RAND()*85+1,0)))","v":"у"},{"$f":"IF((COLUMN()-COLUMN($F$1))>$F2,\"\",INDEX(Лист1!$A$1:$A$86,ROUND(RAND()*85+1,0)))","v":"б"},{"$f":"IF((COLUMN()-COLUMN($F$1))>$F2,\"\",INDEX(Лист1!$A$1:$A$86,ROUND(RAND()*85+1,0)))","v":"гъ"},{"$f":"IF((COLUMN()-COLUMN($F$1))>$F2,\"\",INDEX(Лист1!$A$1:$A$86,ROUND(RAND()*85+1,0)))","v":"П"},{"$f":"IF((COLUMN()-COLUMN($F$1))>$F2,\"\",INDEX(Лист1!$A$1:$A$86,ROUND(RAND()*85+1,0)))","v":"Я"},{"$f":"IF((COLUMN()-COLUMN($F$1))>$F2,\"\",INDEX(Лист1!$A$1:$A$86,ROUND(RAND()*85+1,0)))","v":"тъ"},{"$f":"IF((COLUMN()-COLUMN($F$1))>$F2,\"\",INDEX(Лист1!$A$1:$A$86,ROUND(RAND()*85+1,0)))","v":"ц"},{"$f":"IF((COLUMN()-COLUMN($F$1))>$F2,\"\",INDEX(Лист1!$A$1:$A$86,ROUND(RAND()*85+1,0)))","v":"Ъ"},{"$f":"IF((COLUMN()-COLUMN($F$1))>$F2,\"\",INDEX(Лист1!$A$1:$A$86,ROUND(RAND()*85+1,0)))","v":"е"},{"$f":"IF((COLUMN()-COLUMN($F$1))>$F2,\"\",INDEX(Лист1!$A$1:$A$86,ROUND(RAND()*85+1,0)))","v":"цъ"},{"$f":"IF((COLUMN()-COLUMN($F$1))>$F2,\"\",INDEX(Лист1!$A$1:$A$86,ROUND(RAND()*85+1,0)))","v":"ф"},{"$f":"IF((COLUMN()-COLUMN($F$1))>$F2,\"\",INDEX(Лист1!$A$1:$A$86,ROUND(RAND()*85+1,0)))","v":""},{"$f":"IF((COLUMN()-COLUMN($F$1))>$F2,\"\",INDEX(Лист1!$A$1:$A$86,ROUND(RAND()*85+1,0)))","v":""},{"$f":"IF((COLUMN()-COLUMN($F$1))>$F2,\"\",INDEX(Лист1!$A$1:$A$86,ROUND(RAND()*85+1,0)))","v":""},{"$f":"IF((COLUMN()-COLUMN($F$1))>$F2,\"\",INDEX(Лист1!$A$1:$A$86,ROUND(RAND()*85+1,0)))","v":""},{"$f":"IF((COLUMN()-COLUMN($F$1))>$F2,\"\",INDEX(Лист1!$A$1:$A$86,ROUND(RAND()*85+1,0)))","v":""},{"$f":"IF((COLUMN()-COLUMN($F$1))>$F2,\"\",INDEX(Лист1!$A$1:$A$86,ROUND(RAND()*85+1,0)))","v":""},{"$f":"IF((COLUMN()-COLUMN($F$1))>$F2,\"\",INDEX(Лист1!$A$1:$A$86,ROUND(RAND()*85+1,0)))","v":""},{"$f":"IF((COLUMN()-COLUMN($F$1))>$F2,\"\",INDEX(Лист1!$A$1:$A$86,ROUND(RAND()*85+1,0)))","v":""},{"$f":"IF((COLUMN()-COLUMN($F$1))>$F2,\"\",INDEX(Лист1!$A$1:$A$86,ROUND(RAND()*85+1,0)))","v":""},{"$f":"IF((COLUMN()-COLUMN($F$1))>$F2,\"\",INDEX(Лист1!$A$1:$A$86,ROUND(RAND()*85+1,0)))","v":""},{"$f":"IF((COLUMN()-COLUMN($F$1))>$F2,\"\",INDEX(Лист1!$A$1:$A$86,ROUND(RAND()*85+1,0)))","v":""},{"$f":"IF((COLUMN()-COLUMN($F$1))>$F2,\"\",INDEX(Лист1!$A$1:$A$86,ROUND(RAND()*85+1,0)))","v":""},{"$f":"IF((COLUMN()-COLUMN($F$1))>$F2,\"\",INDEX(Лист1!$A$1:$A$86,ROUND(RAND()*85+1,0)))","v":""},{"$f":"IF((COLUMN()-COLUMN($F$1))>$F2,\"\",INDEX(Лист1!$A$1:$A$86,ROUND(RAND()*85+1,0)))","v":""}]
["æЗдЮшпъШцъхъдзфКДшДжЭтъгъуЦÆАПБМ",32,"зсч",null,null,3,{"$f":"IF((COLUMN()-COLUMN($F$1))>$F3,\"\",INDEX(Лист1!$A$1:$A$86,ROUND(RAND()*85+1,0)))","v":"з"},{"$f":"IF((COLUMN()-COLUMN($F$1))>$F3,\"\",INDEX(Лист1!$A$1:$A$86,ROUND(RAND()*85+1,0)))","v":"с"},{"$f":"IF((COLUMN()-COLUMN($F$1))>$F3,\"\",INDEX(Лист1!$A$1:$A$86,ROUND(RAND()*85+1,0)))","v":"ч"},{"$f":"IF((COLUMN()-COLUMN($F$1))>$F3,\"\",INDEX(Лист1!$A$1:$A$86,ROUND(RAND()*85+1,0)))","v":""},{"$f":"IF((COLUMN()-COLUMN($F$1))>$F3,\"\",INDEX(Лист1!$A$1:$A$86,ROUND(RAND()*85+1,0)))","v":""},{"$f":"IF((COLUMN()-COLUMN($F$1))>$F3,\"\",INDEX(Лист1!$A$1:$A$86,ROUND(RAND()*85+1,0)))","v":""},{"$f":"IF((COLUMN()-COLUMN($F$1))>$F3,\"\",INDEX(Лист1!$A$1:$A$86,ROUND(RAND()*85+1,0)))","v":""},{"$f":"IF((COLUMN()-COLUMN($F$1))>$F3,\"\",INDEX(Лист1!$A$1:$A$86,ROUND(RAND()*85+1,0)))","v":""},{"$f":"IF((COLUMN()-COLUMN($F$1))>$F3,\"\",INDEX(Лист1!$A$1:$A$86,ROUND(RAND()*85+1,0)))","v":""},{"$f":"IF((COLUMN()-COLUMN($F$1))>$F3,\"\",INDEX(Лист1!$A$1:$A$86,ROUND(RAND()*85+1,0)))","v":""},{"$f":"IF((COLUMN()-COLUMN($F$1))>$F3,\"\",INDEX(Лист1!$A$1:$A$86,ROUND(RAND()*85+1,0)))","v":""},{"$f":"IF((COLUMN()-COLUMN($F$1))>$F3,\"\",INDEX(Лист1!$A$1:$A$86,ROUND(RAND()*85+1,0)))","v":""},{"$f":"IF((COLUMN()-COLUMN($F$1))>$F3,\"\",INDEX(Лист1!$A$1:$A$86,ROUND(RAND()*85+1,0)))","v":""},{"$f":"IF((COLUMN()-COLUMN($F$1))>$F3,\"\",INDEX(Лист1!$A$1:$A$86,ROUND(RAND()*85+1,0)))","v":""},{"$f":"IF((COLUMN()-COLUMN($F$1))>$F3,\"\",INDEX(Лист1!$A$1:$A$86,ROUND(RAND()*85+1,0)))","v":""},{"$f":"IF((COLUMN()-COLUMN($F$1))>$F3,\"\",INDEX(Лист1!$A$1:$A$86,ROUND(RAND()*85+1,0)))","v":""},{"$f":"IF((COLUMN()-COLUMN($F$1))>$F3,\"\",INDEX(Лист1!$A$1:$A$86,ROUND(RAND()*85+1,0)))","v":""},{"$f":"IF((COLUMN()-COLUMN($F$1))>$F3,\"\",INDEX(Лист1!$A$1:$A$86,ROUND(RAND()*85+1,0)))","v":""},{"$f":"IF((COLUMN()-COLUMN($F$1))>$F3,\"\",INDEX(Лист1!$A$1:$A$86,ROUND(RAND()*85+1,0)))","v":""},{"$f":"IF((COLUMN()-COLUMN($F$1))>$F3,\"\",INDEX(Лист1!$A$1:$A$86,ROUND(RAND()*85+1,0)))","v":""},{"$f":"IF((COLUMN()-COLUMN($F$1))>$F3,\"\",INDEX(Лист1!$A$1:$A$86,ROUND(RAND()*85+1,0)))","v":""},{"$f":"IF((COLUMN()-COLUMN($F$1))>$F3,\"\",INDEX(Лист1!$A$1:$A$86,ROUND(RAND()*85+1,0)))","v":""},{"$f":"IF((COLUMN()-COLUMN($F$1))>$F3,\"\",INDEX(Лист1!$A$1:$A$86,ROUND(RAND()*85+1,0)))","v":""},{"$f":"IF((COLUMN()-COLUMN($F$1))>$F3,\"\",INDEX(Лист1!$A$1:$A$86,ROUND(RAND()*85+1,0)))","v":""},{"$f":"IF((COLUMN()-COLUMN($F$1))>$F3,\"\",INDEX(Лист1!$A$1:$A$86,ROUND(RAND()*85+1,0)))","v":""},{"$f":"IF((COLUMN()-COLUMN($F$1))>$F3,\"\",INDEX(Лист1!$A$1:$A$86,ROUND(RAND()*85+1,0)))","v":""},{"$f":"IF((COLUMN()-COLUMN($F$1))>$F3,\"\",INDEX(Лист1!$A$1:$A$86,ROUND(RAND()*85+1,0)))","v":""},{"$f":"IF((COLUMN()-COLUMN($F$1))>$F3,\"\",INDEX(Лист1!$A$1:$A$86,ROUND(RAND()*85+1,0)))","v":""},{"$f":"IF((COLUMN()-COLUMN($F$1))>$F3,\"\",INDEX(Лист1!$A$1:$A$86,ROUND(RAND()*85+1,0)))","v":""},{"$f":"IF((COLUMN()-COLUMN($F$1))>$F3,\"\",INDEX(Лист1!$A$1:$A$86,ROUND(RAND()*85+1,0)))","v":""},{"$f":"IF((COLUMN()-COLUMN($F$1))>$F3,\"\",INDEX(Лист1!$A$1:$A$86,ROUND(RAND()*85+1,0)))","v":""},{"$f":"IF((COLUMN()-COLUMN($F$1))>$F3,\"\",INDEX(Лист1!$A$1:$A$86,ROUND(RAND()*85+1,0)))","v":""},{"$f":"IF((COLUMN()-COLUMN($F$1))>$F3,\"\",INDEX(Лист1!$A$1:$A$86,ROUND(RAND()*85+1,0)))","v":""},{"$f":"IF((COLUMN()-COLUMN($F$1))>$F3,\"\",INDEX(Лист1!$A$1:$A$86,ROUND(RAND()*85+1,0)))","v":""},{"$f":"IF((COLUMN()-COLUMN($F$1))>$F3,\"\",INDEX(Лист1!$A$1:$A$86,ROUND(RAND()*85+1,0)))","v":""},{"$f":"IF((COLUMN()-COLUMN($F$1))>$F3,\"\",INDEX(Лист1!$A$1:$A$86,ROUND(RAND()*85+1,0)))","v":""},{"$f":"IF((COLUMN()-COLUMN($F$1))>$F3,\"\",INDEX(Лист1!$A$1:$A$86,ROUND(RAND()*85+1,0)))","v":""},{"$f":"IF((COLUMN()-COLUMN($F$1))>$F3,\"\",INDEX(Лист1!$A$1:$A$86,ROUND(RAND()*85+1,0)))","v":""},{"$f":"IF((COLUMN()-COLUMN($F$1))>$F3,\"\",INDEX(Лист1!$A$1:$A$86,ROUND(RAND()*85+1,0)))","v":""},{"$f":"IF((COLUMN()-COLUMN($F$1))>$F3,\"\",INDEX(Лист1!$A$1:$A$86,ROUND(RAND()*85+1,0)))","v":""}]
["ЁЗХПъХъУъзьФьщкгъУхЫаЛЦГъ",25,"ч",null,null,1,{"$f":"IF((COLUMN()-COLUMN($F$1))>$F4,\"\",INDEX(Лист1!$A$1:$A$86,ROUND(RAND()*85+1,0)))","v":"ч"},{"$f":"IF((COLUMN()-COLUMN($F$1))>$F4,\"\",INDEX(Лист1!$A$1:$A$86,ROUND(RAND()*85+1,0)))","v":""},{"$f":"IF((COLUMN()-COLUMN($F$1))>$F4,\"\",INDEX(Лист1!$A$1:$A$86,ROUND(RAND()*85+1,0)))","v":""},{"$f":"IF((COLUMN()-COLUMN($F$1))>$F4,\"\",INDEX(Лист1!$A$1:$A$86,ROUND(RAND()*85+1,0)))","v":""},{"$f":"IF((COLUMN()-COLUMN($F$1))>$F4,\"\",INDEX(Лист1!$A$1:$A$86,ROUND(RAND()*85+1,0)))","v":""},{"$f":"IF((COLUMN()-COLUMN($F$1))>$F4,\"\",INDEX(Лист1!$A$1:$A$86,ROUND(RAND()*85+1,0)))","v":""},{"$f":"IF((COLUMN()-COLUMN($F$1))>$F4,\"\",INDEX(Лист1!$A$1:$A$86,ROUND(RAND()*85+1,0)))","v":""},{"$f":"IF((COLUMN()-COLUMN($F$1))>$F4,\"\",INDEX(Лист1!$A$1:$A$86,ROUND(RAND()*85+1,0)))","v":""},{"$f":"IF((COLUMN()-COLUMN($F$1))>$F4,\"\",INDEX(Лист1!$A$1:$A$86,ROUND(RAND()*85+1,0)))","v":""},{"$f":"IF((COLUMN()-COLUMN($F$1))>$F4,\"\",INDEX(Лист1!$A$1:$A$86,ROUND(RAND()*85+1,0)))","v":""},{"$f":"IF((COLUMN()-COLUMN($F$1))>$F4,\"\",INDEX(Лист1!$A$1:$A$86,ROUND(RAND()*85+1,0)))","v":""},{"$f":"IF((COLUMN()-COLUMN($F$1))>$F4,\"\",INDEX(Лист1!$A$1:$A$86,ROUND(RAND()*85+1,0)))","v":""},{"$f":"IF((COLUMN()-COLUMN($F$1))>$F4,\"\",INDEX(Лист1!$A$1:$A$86,ROUND(RAND()*85+1,0)))","v":""},{"$f":"IF((COLUMN()-COLUMN($F$1))>$F4,\"\",INDEX(Лист1!$A$1:$A$86,ROUND(RAND()*85+1,0)))","v":""},{"$f":"IF((COLUMN()-COLUMN($F$1))>$F4,\"\",INDEX(Лист1!$A$1:$A$86,ROUND(RAND()*85+1,0)))","v":""},{"$f":"IF((COLUMN()-COLUMN($F$1))>$F4,\"\",INDEX(Лист1!$A$1:$A$86,ROUND(RAND()*85+1,0)))","v":""},{"$f":"IF((COLUMN()-COLUMN($F$1))>$F4,\"\",INDEX(Лист1!$A$1:$A$86,ROUND(RAND()*85+1,0)))","v":""},{"$f":"IF((COLUMN()-COLUMN($F$1))>$F4,\"\",INDEX(Лист1!$A$1:$A$86,ROUND(RAND()*85+1,0)))","v":""},{"$f":"IF((COLUMN()-COLUMN($F$1))>$F4,\"\",INDEX(Лист1!$A$1:$A$86,ROUND(RAND()*85+1,0)))","v":""},{"$f":"IF((COLUMN()-COLUMN($F$1))>$F4,\"\",INDEX(Лист1!$A$1:$A$86,ROUND(RAND()*85+1,0)))","v":""},{"$f":"IF((COLUMN()-COLUMN($F$1))>$F4,\"\",INDEX(Лист1!$A$1:$A$86,ROUND(RAND()*85+1,0)))","v":""},{"$f":"IF((COLUMN()-COLUMN($F$1))>$F4,\"\",INDEX(Лист1!$A$1:$A$86,ROUND(RAND()*85+1,0)))","v":""},{"$f":"IF((COLUMN()-COLUMN($F$1))>$F4,\"\",INDEX(Лист1!$A$1:$A$86,ROUND(RAND()*85+1,0)))","v":""},{"$f":"IF((COLUMN()-COLUMN($F$1))>$F4,\"\",INDEX(Лист1!$A$1:$A$86,ROUND(RAND()*85+1,0)))","v":""},{"$f":"IF((COLUMN()-COLUMN($F$1))>$F4,\"\",INDEX(Лист1!$A$1:$A$86,ROUND(RAND()*85+1,0)))","v":""},{"$f":"IF((COLUMN()-COLUMN($F$1))>$F4,\"\",INDEX(Лист1!$A$1:$A$86,ROUND(RAND()*85+1,0)))","v":""},{"$f":"IF((COLUMN()-COLUMN($F$1))>$F4,\"\",INDEX(Лист1!$A$1:$A$86,ROUND(RAND()*85+1,0)))","v":""},{"$f":"IF((COLUMN()-COLUMN($F$1))>$F4,\"\",INDEX(Лист1!$A$1:$A$86,ROUND(RAND()*85+1,0)))","v":""},{"$f":"IF((COLUMN()-COLUMN($F$1))>$F4,\"\",INDEX(Лист1!$A$1:$A$86,ROUND(RAND()*85+1,0)))","v":""},{"$f":"IF((COLUMN()-COLUMN($F$1))>$F4,\"\",INDEX(Лист1!$A$1:$A$86,ROUND(RAND()*85+1,0)))","v":""},{"$f":"IF((COLUMN()-COLUMN($F$1))>$F4,\"\",INDEX(Лист1!$A$1:$A$86,ROUND(RAND()*85+1,0)))","v":""},{"$f":"IF((COLUMN()-COLUMN($F$1))>$F4,\"\",INDEX(Лист1!$A$1:$A$86,ROUND(RAND()*85+1,0)))","v":""},{"$f":"IF((COLUMN()-COLUMN($F$1))>$F4,\"\",INDEX(Лист1!$A$1:$A$86,ROUND(RAND()*85+1,0)))","v":""},{"$f":"IF((COLUMN()-COLUMN($F$1))>$F4,\"\",INDEX(Лист1!$A$1:$A$86,ROUND(RAND()*85+1,0)))","v":""},{"$f":"IF((COLUMN()-COLUMN($F$1))>$F4,\"\",INDEX(Лист1!$A$1:$A$86,ROUND(RAND()*85+1,0)))","v":""},{"$f":"IF((COLUMN()-COLUMN($F$1))>$F4,\"\",INDEX(Лист1!$A$1:$A$86,ROUND(RAND()*85+1,0)))","v":""},{"$f":"IF((COLUMN()-COLUMN($F$1))>$F4,\"\",INDEX(Лист1!$A$1:$A$86,ROUND(RAND()*85+1,0)))","v":""},{"$f":"IF((COLUMN()-COLUMN($F$1))>$F4,\"\",INDEX(Лист1!$A$1:$A$86,ROUND(RAND()*85+1,0)))","v":""},{"$f":"IF((COLUMN()-COLUMN($F$1))>$F4,\"\",INDEX(Лист1!$A$1:$A$86,ROUND(RAND()*85+1,0)))","v":""},{"$f":"IF((COLUMN()-COLUMN($F$1))>$F4,\"\",INDEX(Лист1!$A$1:$A$86,ROUND(RAND()*85+1,0)))","v":""}]
["пъипДзКцГъп",11,"мхъЪЩьЕтъХъГЧъГЮчъДжйДЫТъёЧЁюбæпъКчЦъД",null,null,29,{"$f":"IF((COLUMN()-COLUMN($F$1))>$F5,\"\",INDEX(Лист1!$A$1:$A$86,ROUND(RAND()*85+1,0)))","v":"м"},{"$f":"IF((COLUMN()-COLUMN($F$1))>$F5,\"\",INDEX(Лист1!$A$1:$A$86,ROUND(RAND()*85+1,0)))","v":"хъ"},{"$f":"IF((COLUMN()-COLUMN($F$1))>$F5,\"\",INDEX(Лист1!$A$1:$A$86,ROUND(RAND()*85+1,0)))","v":"Ъ"},{"$f":"IF((COLUMN()-COLUMN($F$1))>$F5,\"\",INDEX(Лист1!$A$1:$A$86,ROUND(RAND()*85+1,0)))","v":"Щ"},{"$f":"IF((COLUMN()-COLUMN($F$1))>$F5,\"\",INDEX(Лист1!$A$1:$A$86,ROUND(RAND()*85+1,0)))","v":"ь"},{"$f":"IF((COLUMN()-COLUMN($F$1))>$F5,\"\",INDEX(Лист1!$A$1:$A$86,ROUND(RAND()*85+1,0)))","v":"Е"},{"$f":"IF((COLUMN()-COLUMN($F$1))>$F5,\"\",INDEX(Лист1!$A$1:$A$86,ROUND(RAND()*85+1,0)))","v":"тъ"},{"$f":"IF((COLUMN()-COLUMN($F$1))>$F5,\"\",INDEX(Лист1!$A$1:$A$86,ROUND(RAND()*85+1,0)))","v":"Хъ"},{"$f":"IF((COLUMN()-COLUMN($F$1))>$F5,\"\",INDEX(Лист1!$A$1:$A$86,ROUND(RAND()*85+1,0)))","v":"Г"},{"$f":"IF((COLUMN()-COLUMN($F$1))>$F5,\"\",INDEX(Лист1!$A$1:$A$86,ROUND(RAND()*85+1,0)))","v":"Чъ"},{"$f":"IF((COLUMN()-COLUMN($F$1))>$F5,\"\",INDEX(Лист1!$A$1:$A$86,ROUND(RAND()*85+1,0)))","v":"Г"},{"$f":"IF((COLUMN()-COLUMN($F$1))>$F5,\"\",INDEX(Лист1!$A$1:$A$86,ROUND(RAND()*85+1,0)))","v":"Ю"},{"$f":"IF((COLUMN()-COLUMN($F$1))>$F5,\"\",INDEX(Лист1!$A$1:$A$86,ROUND(RAND()*85+1,0)))","v":"чъ"},{"$f":"IF((COLUMN()-COLUMN($F$1))>$F5,\"\",INDEX(Лист1!$A$1:$A$86,ROUND(RAND()*85+1,0)))","v":"Дж"},{"$f":"IF((COLUMN()-COLUMN($F$1))>$F5,\"\",INDEX(Лист1!$A$1:$A$86,ROUND(RAND()*85+1,0)))","v":"й"},{"$f":"IF((COLUMN()-COLUMN($F$1))>$F5,\"\",INDEX(Лист1!$A$1:$A$86,ROUND(RAND()*85+1,0)))","v":"Д"},{"$f":"IF((COLUMN()-COLUMN($F$1))>$F5,\"\",INDEX(Лист1!$A$1:$A$86,ROUND(RAND()*85+1,0)))","v":"Ы"},{"$f":"IF((COLUMN()-COLUMN($F$1))>$F5,\"\",INDEX(Лист1!$A$1:$A$86,ROUND(RAND()*85+1,0)))","v":"Тъ"},{"$f":"IF((COLUMN()-COLUMN($F$1))>$F5,\"\",INDEX(Лист1!$A$1:$A$86,ROUND(RAND()*85+1,0)))","v":"ё"},{"$f":"IF((COLUMN()-COLUMN($F$1))>$F5,\"\",INDEX(Лист1!$A$1:$A$86,ROUND(RAND()*85+1,0)))","v":"Ч"},{"$f":"IF((COLUMN()-COLUMN($F$1))>$F5,\"\",INDEX(Лист1!$A$1:$A$86,ROUND(RAND()*85+1,0)))","v":"Ё"},{"$f":"IF((COLUMN()-COLUMN($F$1))>$F5,\"\",INDEX(Лист1!$A$1:$A$86,ROUND(RAND()*85+1,0)))","v":"ю"},{"$f":"IF((COLUMN()-COLUMN($F$1))>$F5,\"\",INDEX(Лист1!$A$1:$A$86,ROUND(RAND()*85+1,0)))","v":"б"},{"$f":"IF((COLUMN()-COLUMN($F$1))>$F5,\"\",INDEX(Лист1!$A$1:$A$86,ROUND(RAND()*85+1,0)))","v":"æ"},{"$f":"IF((COLUMN()-COLUMN($F$1))>$F5,\"\",INDEX(Лист1!$A$1:$A$86,ROUND(RAND()*85+1,0)))","v":"пъ"},{"$f":"IF((COLUMN()-COLUMN($F$1))>$F5,\"\",INDEX(Лист1!$A$1:$A$86,ROUND(RAND()*85+1,0)))","v":"К"},{"$f":"IF((COLUMN()-COLUMN($F$1))>$F5,\"\",INDEX(Лист1!$A$1:$A$86,ROUND(RAND()*85+1,0)))","v":"ч"},{"$f":"IF((COLUMN()-COLUMN($F$1))>$F5,\"\",INDEX(Лист1!$A$1:$A$86,ROUND(RAND()*85+1,0)))","v":"Цъ"},{"$f":"IF((COLUMN()-COLUMN($F$1))>$F5,\"\",INDEX(Лист1!$A$1:$A$86,ROUND(RAND()*85+1,0)))","v":"Д"},{"$f":"IF((COLUMN()-COLUMN($F$1))>$F5,\"\",INDEX(Лист1!$A$1:$A$86,ROUND(RAND()*85+1,0)))","v":""},{"$f":"IF((COLUMN()-COLUMN($F$1))>$F5,\"\",INDEX(Лист1!$A$1:$A$86,ROUND(RAND()*85+1,0)))","v":""},{"$f":"IF((COLUMN()-COLUMN($F$1))>$F5,\"\",INDEX(Лист1!$A$1:$A$86,ROUND(RAND()*85+1,0)))","v":""},{"$f":"IF((COLUMN()-COLUMN($F$1))>$F5,\"\",INDEX(Лист1!$A$1:$A$86,ROUND(RAND()*85+1,0)))","v":""},{"$f":"IF((COLUMN()-COLUMN($F$1))>$F5,\"\",INDEX(Лист1!$A$1:$A$86,ROUND(RAND()*85+1,0)))","v":""},{"$f":"IF((COLUMN()-COLUMN($F$1))>$F5,\"\",INDEX(Лист1!$A$1:$A$86,ROUND(RAND()*85+1,0)))","v":""},{"$f":"IF((COLUMN()-COLUMN($F$1))>$F5,\"\",INDEX(Лист1!$A$1:$A$86,ROUND(RAND()*85+1,0)))","v":""},{"$f":"IF((COLUMN()-COLUMN($F$1))>$F5,\"\",INDEX(Лист1!$A$1:$A$86,ROUND(RAND()*85+1,0)))","v":""},{"$f":"IF((COLUMN()-COLUMN($F$1))>$F5,\"\",INDEX(Лист1!$A$1:$A$86,ROUND(RAND()*85+1,0)))","v":""},{"$f":"IF((COLUMN()-COLUMN($F$1))>$F5,\"\",INDEX(Лист1!$A$1:$A$86,ROUND(RAND()*85+1,0)))","v":""},{"$f":"IF((COLUMN()-COLUMN($F$1))>$F5,\"\",INDEX(Лист1!$A$1:$A$86,ROUND(RAND()*85+1,0)))","v":""}]
["ИЁДжЪюЮКъКкъЗГъÆЮТъШЪНУЕР",25,"юсЗДжёЫэЗнЕБПъэеФÆ",null,null,16,{"$f":"IF((COLUMN()-COLUMN($F$1))>$F6,\"\",INDEX(Лист1!$A$1:$A$86,ROUND(RAND()*85+1,0)))","v":"ю"},{"$f":"IF((COLUMN()-COLUMN($F$1))>$F6,\"\",INDEX(Лист1!$A$1:$A$86,ROUND(RAND()*85+1,0)))","v":"с"},{"$f":"IF((COLUMN()-COLUMN($F$1))>$F6,\"\",INDEX(Лист1!$A$1:$A$86,ROUND(RAND()*85+1,0)))","v":"З"},{"$f":"IF((COLUMN()-COLUMN($F$1))>$F6,\"\",INDEX(Лист1!$A$1:$A$86,ROUND(RAND()*85+1,0)))","v":"Дж"},{"$f":"IF((COLUMN()-COLUMN($F$1))>$F6,\"\",INDEX(Лист1!$A$1:$A$86,ROUND(RAND()*85+1,0)))","v":"ё"},{"$f":"IF((COLUMN()-COLUMN($F$1))>$F6,\"\",INDEX(Лист1!$A$1:$A$86,ROUND(RAND()*85+1,0)))","v":"Ы"},{"$f":"IF((COLUMN()-COLUMN($F$1))>$F6,\"\",INDEX(Лист1!$A$1:$A$86,ROUND(RAND()*85+1,0)))","v":"э"},{"$f":"IF((COLUMN()-COLUMN($F$1))>$F6,\"\",INDEX(Лист1!$A$1:$A$86,ROUND(RAND()*85+1,0)))","v":"З"},{"$f":"IF((COLUMN()-COLUMN($F$1))>$F6,\"\",INDEX(Лист1!$A$1:$A$86,ROUND(RAND()*85+1,0)))","v":"н"},{"$f":"IF((COLUMN()-COLUMN($F$1))>$F6,\"\",INDEX(Лист1!$A$1:$A$86,ROUND(RAND()*85+1,0)))","v":"Е"},{"$f":"IF((COLUMN()-COLUMN($F$1))>$F6,\"\",INDEX(Лист1!$A$1:$A$86,ROUND(RAND()*85+1,0)))","v":"Б"},{"$f":"IF((COLUMN()-COLUMN($F$1))>$F6,\"\",INDEX(Лист1!$A$1:$A$86,ROUND(RAND()*85+1,0)))","v":"Пъ"},{"$f":"IF((COLUMN()-COLUMN($F$1))>$F6,\"\",INDEX(Лист1!$A$1:$A$86,ROUND(RAND()*85+1,0)))","v":"э"},{"$f":"IF((COLUMN()-COLUMN($F$1))>$F6,\"\",INDEX(Лист1!$A$1:$A$86,ROUND(RAND()*85+1,0)))","v":"е"},{"$f":"IF((COLUMN()-COLUMN($F$1))>$F6,\"\",INDEX(Лист1!$A$1:$A$86,ROUND(RAND()*85+1,0)))","v":"Ф"},{"$f":"IF((COLUMN()-COLUMN($F$1))>$F6,\"\",INDEX(Лист1!$A$1:$A$86,ROUND(RAND()*85+1,0)))","v":"Æ"},{"$f":"IF((COLUMN()-COLUMN($F$1))>$F6,\"\",INDEX(Лист1!$A$1:$A$86,ROUND(RAND()*85+1,0)))","v":""},{"$f":"IF((COLUMN()-COLUMN($F$1))>$F6,\"\",INDEX(Лист1!$A$1:$A$86,ROUND(RAND()*85+1,0)))","v":""},{"$f":"IF((COLUMN()-COLUMN($F$1))>$F6,\"\",INDEX(Лист1!$A$1:$A$86,ROUND(RAND()*85+1,0)))","v":""},{"$f":"IF((COLUMN()-COLUMN($F$1))>$F6,\"\",INDEX(Лист1!$A$1:$A$86,ROUND(RAND()*85+1,0)))","v":""},{"$f":"IF((COLUMN()-COLUMN($F$1))>$F6,\"\",INDEX(Лист1!$A$1:$A$86,ROUND(RAND()*85+1,0)))","v":""},{"$f":"IF((COLUMN()-COLUMN($F$1))>$F6,\"\",INDEX(Лист1!$A$1:$A$86,ROUND(RAND()*85+1,0)))","v":""},{"$f":"IF((COLUMN()-COLUMN($F$1))>$F6,\"\",INDEX(Лист1!$A$1:$A$86,ROUND(RAND()*85+1,0)))","v":""},{"$f":"IF((COLUMN()-COLUMN($F$1))>$F6,\"\",INDEX(Лист1!$A$1:$A$86,ROUND(RAND()*85+1,0)))","v":""},{"$f":"IF((COLUMN()-COLUMN($F$1))>$F6,\"\",INDEX(Лист1!$A$1:$A$86,ROUND(RAND()*85+1,0)))","v":""},{"$f":"IF((COLUMN()-COLUMN($F$1))>$F6,\"\",INDEX(Лист1!$A$1:$A$86,ROUND(RAND()*85+1,0)))","v":""},{"$f":"IF((COLUMN()-COLUMN($F$1))>$F6,\"\",INDEX(Лист1!$A$1:$A$86,ROUND(RAND()*85+1,0)))","v":""},{"$f":"IF((COLUMN()-COLUMN($F$1))>$F6,\"\",INDEX(Лист1!$A$1:$A$86,ROUND(RAND()*85+1,0)))","v":""},{"$f":"IF((COLUMN()-COLUMN($F$1))>$F6,\"\",INDEX(Лист1!$A$1:$A$86,ROUND(RAND()*85+1,0)))","v":""},{"$f":"IF((COLUMN()-COLUMN($F$1))>$F6,\"\",INDEX(Лист1!$A$1:$A$86,ROUND(RAND()*85+1,0)))","v":""},{"$f":"IF((COLUMN()-COLUMN($F$1))>$F6,\"\",INDEX(Лист1!$A$1:$A$86,ROUND(RAND()*85+1,0)))","v":""},{"$f":"IF((COLUMN()-COLUMN($F$1))>$F6,\"\",INDEX(Лист1!$A$1:$A$86,ROUND(RAND()*85+1,0)))","v":""},{"$f":"IF((COLUMN()-COLUMN($F$1))>$F6,\"\",INDEX(Лист1!$A$1:$A$86,ROUND(RAND()*85+1,0)))","v":""},{"$f":"IF((COLUMN()-COLUMN($F$1))>$F6,\"\",INDEX(Лист1!$A$1:$A$86,ROUND(RAND()*85+1,0)))","v":""},{"$f":"IF((COLUMN()-COLUMN($F$1))>$F6,\"\",INDEX(Лист1!$A$1:$A$86,ROUND(RAND()*85+1,0)))","v":""},{"$f":"IF((COLUMN()-COLUMN($F$1))>$F6,\"\",INDEX(Лист1!$A$1:$A$86,ROUND(RAND()*85+1,0)))","v":""},{"$f":"IF((COLUMN()-COLUMN($F$1))>$F6,\"\",INDEX(Лист1!$A$1:$A$86,ROUND(RAND()*85+1,0)))","v":""},{"$f":"IF((COLUMN()-COLUMN($F$1))>$F6,\"\",INDEX(Лист1!$A$1:$A$86,ROUND(RAND()*85+1,0)))","v":""},{"$f":"IF((COLUMN()-COLUMN($F$1))>$F6,\"\",INDEX(Лист1!$A$1:$A$86,ROUND(RAND()*85+1,0)))","v":""},{"$f":"IF((COLUMN()-COLUMN($F$1))>$F6,\"\",INDEX(Лист1!$A$1:$A$86,ROUND(RAND()*85+1,0)))","v":""}]
{"$rows_left_out":45}
{"sheet":"Лист3","index":2,"n_rows":168,"n_cols":1,"rows_kept":168,"cut":false,"hidden":false,"merged":[]}
["АдеЛКъЛюэвХъЫГТъ"]
["аДжÆеджЪсГ"]
["аЯчЮНЦйстъ"]
["ÆКъзФпфчДыНагНПьИяхЫЮГБрГОуРй"]
["æЗдЮшпъШцъхъдзфКДшДжЭтъгъуЦÆАПБМ"]
["æтШтъСЦъæКъьДжИУКкпкъЫХъЁПъатъæЭпняХъв"]
{"$rows_left_out":162}