{"text_format":"1","workbook":"xlsx","n_sheets":8,"sheets":["м","ОСН","плавание (2)","отжимание (2)","Стрельба (2)","плавание","отжимание","Стрельба"],"not_rendered":{"charts":0,"images":0,"macros":1,"external_links":1,"defined_names":7,"comments":0,"pivot_tables":0},"unopened":[],"bounds":{"document_bytes":16777216,"sheet_cells":100000,"rows_first":2000,"rows_last":500,"rows_between":2000,"halvings":0,"cell_chars":16384,"cell_head_chars":4096},"cells_cut":0,"cells_raw":0,"read":"whole","date_system":"1900"}

{"sheet":"м","index":0,"n_rows":36,"n_cols":19,"rows_kept":36,"cut":false,"hidden":false,"merged":[[1,0,1,1],[2,15,3,15],[2,11,3,11],[2,12,2,14],[2,5,3,5],[2,0,3,0],[2,1,3,1],[2,2,3,2],[2,8,2,10],[2,3,3,3],[2,4,3,4],[2,6,3,6]]}
[]
[]
["Номер","Имя ",null,null,null,null,"номер","команда","вид 1",null,null,"должно быть","вид 2",null,null,"должно быть","многоборье"]
[null,null,null,null,null,null,null,"школа","рез-т","очки","место",null,"рез-т","очки","место",null,"сумма"]
[null,null,null,null,null,null,null,null,null,null,null,"место",null,null,null,"место"]
[1,"Иван","2001-10-13",{"$f":"DATEDIF(C6,TODAY(),\"y\")","v":15},{"$f":"LOOKUP(DATEDIF(C6,TODAY(),\"y\"),{6;7;8;9;10;11;12;13;14;15;16;17;18;19;20;21;22;23;24;25;26;27;28;29;30;31;32;33;34;35;36;37;38;39;40;41;42;43;44;45;46;47;48;49;50;51;52;53;54;55;56;57;58;59;60;61;62;63;64;65;66;67;68;69;70},{\"1\";\"1\";\"1\";\"2\";\"2\";\"3\";\"3\";\"4\";\"4\";\"4\";\"5\";\"5\";\"6\";\"6\";\"6\";\"6\";\"6\";\"6\";\"6\";\"6\";\"6\";\"6\";\"6\";\"6\";\"7\";\"7\";\"7\";\"7\";\"7\";\"7\";\"7\";\"7\";\"7\";\"7\";\"8\";\"8\";\"8\";\"8\";\"8\";\"8\";\"8\";\"8\";\"8\";\"8\";\"9\";\"9\";\"9\";\"9\";\"9\";\"9\";\"9\";\"9\";\"9\";\"9\";\"10\";\"10\";\"10\";\"10\";\"10\";\"10\";\"10\";\"10\";\"10\";\"10\";\"11\"})","v":"4"},"муж","00-00-0000001","№2","00:00:30.400",{"$f":"IF(AND(I6=0),0,IFERROR(IFERROR(MATCH(I6,ОСН!$D$1:$D$100,-1),MATCH(\"0:\"&I6,ОСН!$D$1:$D$100,-1)),\"\"))","v":100},{"$f":"IF(ISNUMBER(SEARCH(\"(лично)\",$H$6:$H$35)),\"\",SUM(N(FREQUENCY((J6<J$6:J$35)*ISERROR(SEARCH(\"(лично)\",$H$6:$H$35))*J$6:J$35,J$6:J$35)>0)))","v":1},{"$f":"IFERROR(_xlfn.RANK.EQ(I6,$I$6:$I$36,1),\"\")","v":1},210,{"$f":"IF(AND(M6=0),0,IFERROR(MATCH(M6,ОСН!$A$1:$A$100,1),\"\"))","v":40},{"$f":"IF(ISNUMBER(SEARCH(\"(лично)\",$H$6:$H$36)),\"\",SUM(N(FREQUENCY((M6<M$6:M$36)*ISERROR(SEARCH(\"(лично)\",$H$6:$H$36))*M$6:M$36,M$6:M$36)>0)))","v":1},{"$f":"IFERROR(_xlfn.RANK.EQ(M6,$M$6:$M$36,0),\"\")","v":1},{"$f":"SUM(J6,N6)","v":140},null,{"$f":"I6/24/60/60","v":"00:00:00"}]
[2,"Александр","2001-10-13",15,{"$f":"LOOKUP(DATEDIF(C7,TODAY(),\"y\"),{6;7;8;9;10;11;12;13;14;15;16;17;18;19;20;21;22;23;24;25;26;27;28;29;30;31;32;33;34;35;36;37;38;39;40;41;42;43;44;45;46;47;48;49;50;51;52;53;54;55;56;57;58;59;60;61;62;63;64;65;66;67;68;69;70},{\"1\";\"1\";\"1\";\"2\";\"2\";\"3\";\"3\";\"4\";\"4\";\"4\";\"5\";\"5\";\"6\";\"6\";\"6\";\"6\";\"6\";\"6\";\"6\";\"6\";\"6\";\"6\";\"6\";\"6\";\"7\";\"7\";\"7\";\"7\";\"7\";\"7\";\"7\";\"7\";\"7\";\"7\";\"8\";\"8\";\"8\";\"8\";\"8\";\"8\";\"8\";\"8\";\"8\";\"8\";\"9\";\"9\";\"9\";\"9\";\"9\";\"9\";\"9\";\"9\";\"9\";\"9\";\"10\";\"10\";\"10\";\"10\";\"10\";\"10\";\"10\";\"10\";\"10\";\"10\";\"11\"})","v":"4"},"муж","00-00-0000002","№3","00:00:30.900",{"$f":"IF(AND(I7=0),0,IFERROR(IFERROR(MATCH(I7,ОСН!$D$1:$D$100,-1),MATCH(\"0:\"&I7,ОСН!$D$1:$D$100,-1)),\"\"))","v":100},1,{"$f":"IFERROR(_xlfn.RANK.EQ(I7,$I$6:$I$36,1),\"\")","v":2},210,{"$f":"IF(AND(M7=0),0,IFERROR(MATCH(M7,ОСН!$A$1:$A$100,1),\"\"))","v":40},1,1,140,null,{"$f":"I7/24/60/60","v":"00:00:00"}]
[3,"Алексей","2001-10-13",15,{"$f":"LOOKUP(DATEDIF(C8,TODAY(),\"y\"),{6;7;8;9;10;11;12;13;14;15;16;17;18;19;20;21;22;23;24;25;26;27;28;29;30;31;32;33;34;35;36;37;38;39;40;41;42;43;44;45;46;47;48;49;50;51;52;53;54;55;56;57;58;59;60;61;62;63;64;65;66;67;68;69;70},{\"1\";\"1\";\"1\";\"2\";\"2\";\"3\";\"3\";\"4\";\"4\";\"4\";\"5\";\"5\";\"6\";\"6\";\"6\";\"6\";\"6\";\"6\";\"6\";\"6\";\"6\";\"6\";\"6\";\"6\";\"7\";\"7\";\"7\";\"7\";\"7\";\"7\";\"7\";\"7\";\"7\";\"7\";\"8\";\"8\";\"8\";\"8\";\"8\";\"8\";\"8\";\"8\";\"8\";\"8\";\"9\";\"9\";\"9\";\"9\";\"9\";\"9\";\"9\";\"9\";\"9\";\"9\";\"10\";\"10\";\"10\";\"10\";\"10\";\"10\";\"10\";\"10\";\"10\";\"10\";\"11\"})","v":"4"},"муж","00-00-0000003","№4","00:00:31.700",{"$f":"IF(AND(I8=0),0,IFERROR(IFERROR(MATCH(I8,ОСН!$D$1:$D$100,-1),MATCH(\"0:\"&I8,ОСН!$D$1:$D$100,-1)),\"\"))","v":100},1,3,200,{"$f":"IF(AND(M8=0),0,IFERROR(MATCH(M8,ОСН!$A$1:$A$100,1),\"\"))","v":36},2,3,136,null,"00:00:00"]
[4,"Андрей","2001-10-13",15,{"$f":"LOOKUP(DATEDIF(C9,TODAY(),\"y\"),{6;7;8;9;10;11;12;13;14;15;16;17;18;19;20;21;22;23;24;25;26;27;28;29;30;31;32;33;34;35;36;37;38;39;40;41;42;43;44;45;46;47;48;49;50;51;52;53;54;55;56;57;58;59;60;61;62;63;64;65;66;67;68;69;70},{\"1\";\"1\";\"1\";\"2\";\"2\";\"3\";\"3\";\"4\";\"4\";\"4\";\"5\";\"5\";\"6\";\"6\";\"6\";\"6\";\"6\";\"6\";\"6\";\"6\";\"6\";\"6\";\"6\";\"6\";\"7\";\"7\";\"7\";\"7\";\"7\";\"7\";\"7\";\"7\";\"7\";\"7\";\"8\";\"8\";\"8\";\"8\";\"8\";\"8\";\"8\";\"8\";\"8\";\"8\";\"9\";\"9\";\"9\";\"9\";\"9\";\"9\";\"9\";\"9\";\"9\";\"9\";\"10\";\"10\";\"10\";\"10\";\"10\";\"10\";\"10\";\"10\";\"10\";\"10\";\"11\"})","v":"4"},"муж","00-00-0000004","№1","00:00:31.720",{"$f":"IF(AND(I9=0),0,IFERROR(IFERROR(MATCH(I9,ОСН!$D$1:$D$100,-1),MATCH(\"0:\"&I9,ОСН!$D$1:$D$100,-1)),\"\"))","v":100},1,4,198,{"$f":"IF(AND(M9=0),0,IFERROR(MATCH(M9,ОСН!$A$1:$A$100,1),\"\"))","v":36},3,4,136,null,"00:00:00"]
[5,"Иван","2001-10-13",15,{"$f":"LOOKUP(DATEDIF(C10,TODAY(),\"y\"),{6;7;8;9;10;11;12;13;14;15;16;17;18;19;20;21;22;23;24;25;26;27;28;29;30;31;32;33;34;35;36;37;38;39;40;41;42;43;44;45;46;47;48;49;50;51;52;53;54;55;56;57;58;59;60;61;62;63;64;65;66;67;68;69;70},{\"1\";\"1\";\"1\";\"2\";\"2\";\"3\";\"3\";\"4\";\"4\";\"4\";\"5\";\"5\";\"6\";\"6\";\"6\";\"6\";\"6\";\"6\";\"6\";\"6\";\"6\";\"6\";\"6\";\"6\";\"7\";\"7\";\"7\";\"7\";\"7\";\"7\";\"7\";\"7\";\"7\";\"7\";\"8\";\"8\";\"8\";\"8\";\"8\";\"8\";\"8\";\"8\";\"8\";\"8\";\"9\";\"9\";\"9\";\"9\";\"9\";\"9\";\"9\";\"9\";\"9\";\"9\";\"10\";\"10\";\"10\";\"10\";\"10\";\"10\";\"10\";\"10\";\"10\";\"10\";\"11\"})","v":"4"},"муж","00-00-0000005","№5","00:00:32.400",{"$f":"IF(AND(I10=0),0,IFERROR(IFERROR(MATCH(I10,ОСН!$D$1:$D$100,-1),MATCH(\"0:\"&I10,ОСН!$D$1:$D$100,-1)),\"\"))","v":100},1,5,198,{"$f":"IF(AND(M10=0),0,IFERROR(MATCH(M10,ОСН!$A$1:$A$100,1),\"\"))","v":36},3,4,136,null,"00:00:00"]
[6,"Дмитрий","2001-10-13",15,{"$f":"LOOKUP(DATEDIF(C11,TODAY(),\"y\"),{6;7;8;9;10;11;12;13;14;15;16;17;18;19;20;21;22;23;24;25;26;27;28;29;30;31;32;33;34;35;36;37;38;39;40;41;42;43;44;45;46;47;48;49;50;51;52;53;54;55;56;57;58;59;60;61;62;63;64;65;66;67;68;69;70},{\"1\";\"1\";\"1\";\"2\";\"2\";\"3\";\"3\";\"4\";\"4\";\"4\";\"5\";\"5\";\"6\";\"6\";\"6\";\"6\";\"6\";\"6\";\"6\";\"6\";\"6\";\"6\";\"6\";\"6\";\"7\";\"7\";\"7\";\"7\";\"7\";\"7\";\"7\";\"7\";\"7\";\"7\";\"8\";\"8\";\"8\";\"8\";\"8\";\"8\";\"8\";\"8\";\"8\";\"8\";\"9\";\"9\";\"9\";\"9\";\"9\";\"9\";\"9\";\"9\";\"9\";\"9\";\"10\";\"10\";\"10\";\"10\";\"10\";\"10\";\"10\";\"10\";\"10\";\"10\";\"11\"})","v":"4"},"муж","00-00-0000006","№6","00:00:32.400",{"$f":"IF(AND(I11=0),0,IFERROR(IFERROR(MATCH(I11,ОСН!$D$1:$D$100,-1),MATCH(\"0:\"&I11,ОСН!$D$1:$D$100,-1)),\"\"))","v":100},1,5,196,{"$f":"IF(AND(M11=0),0,IFERROR(MATCH(M11,ОСН!$A$1:$A$100,1),\"\"))","v":35},4,6,135,null,"00:00:00"]
[7,"Степан","2001-10-13",15,{"$f":"LOOKUP(DATEDIF(C12,TODAY(),\"y\"),{6;7;8;9;10;11;12;13;14;15;16;17;18;19;20;21;22;23;24;25;26;27;28;29;30;31;32;33;34;35;36;37;38;39;40;41;42;43;44;45;46;47;48;49;50;51;52;53;54;55;56;57;58;59;60;61;62;63;64;65;66;67;68;69;70},{\"1\";\"1\";\"1\";\"2\";\"2\";\"3\";\"3\";\"4\";\"4\";\"4\";\"5\";\"5\";\"6\";\"6\";\"6\";\"6\";\"6\";\"6\";\"6\";\"6\";\"6\";\"6\";\"6\";\"6\";\"7\";\"7\";\"7\";\"7\";\"7\";\"7\";\"7\";\"7\";\"7\";\"7\";\"8\";\"8\";\"8\";\"8\";\"8\";\"8\";\"8\";\"8\";\"8\";\"8\";\"9\";\"9\";\"9\";\"9\";\"9\";\"9\";\"9\";\"9\";\"9\";\"9\";\"10\";\"10\";\"10\";\"10\";\"10\";\"10\";\"10\";\"10\";\"10\";\"10\";\"11\"})","v":"4"},"муж","00-00-0000007","№8","00:00:32.400",{"$f":"IF(AND(I12=0),0,IFERROR(IFERROR(MATCH(I12,ОСН!$D$1:$D$100,-1),MATCH(\"0:\"&I12,ОСН!$D$1:$D$100,-1)),\"\"))","v":100},1,5,194,{"$f":"IF(AND(M12=0),0,IFERROR(MATCH(M12,ОСН!$A$1:$A$100,1),\"\"))","v":34},5,7,134,null,"00:00:00"]
[8,"Максим","2001-10-13",15,{"$f":"LOOKUP(DATEDIF(C13,TODAY(),\"y\"),{6;7;8;9;10;11;12;13;14;15;16;17;18;19;20;21;22;23;24;25;26;27;28;29;30;31;32;33;34;35;36;37;38;39;40;41;42;43;44;45;46;47;48;49;50;51;52;53;54;55;56;57;58;59;60;61;62;63;64;65;66;67;68;69;70},{\"1\";\"1\";\"1\";\"2\";\"2\";\"3\";\"3\";\"4\";\"4\";\"4\";\"5\";\"5\";\"6\";\"6\";\"6\";\"6\";\"6\";\"6\";\"6\";\"6\";\"6\";\"6\";\"6\";\"6\";\"7\";\"7\";\"7\";\"7\";\"7\";\"7\";\"7\";\"7\";\"7\";\"7\";\"8\";\"8\";\"8\";\"8\";\"8\";\"8\";\"8\";\"8\";\"8\";\"8\";\"9\";\"9\";\"9\";\"9\";\"9\";\"9\";\"9\";\"9\";\"9\";\"9\";\"10\";\"10\";\"10\";\"10\";\"10\";\"10\";\"10\";\"10\";\"10\";\"10\";\"11\"})","v":"4"},"муж","00-00-0000008","№7","00:00:33.200",{"$f":"IF(AND(I13=0),0,IFERROR(IFERROR(MATCH(I13,ОСН!$D$1:$D$100,-1),MATCH(\"0:\"&I13,ОСН!$D$1:$D$100,-1)),\"\"))","v":100},1,8,193,{"$f":"IF(AND(M13=0),0,IFERROR(MATCH(M13,ОСН!$A$1:$A$100,1),\"\"))","v":34},6,8,134,null,"00:00:00"]
[9,"Андрей","2001-10-13",15,{"$f":"LOOKUP(DATEDIF(C14,TODAY(),\"y\"),{6;7;8;9;10;11;12;13;14;15;16;17;18;19;20;21;22;23;24;25;26;27;28;29;30;31;32;33;34;35;36;37;38;39;40;41;42;43;44;45;46;47;48;49;50;51;52;53;54;55;56;57;58;59;60;61;62;63;64;65;66;67;68;69;70},{\"1\";\"1\";\"1\";\"2\";\"2\";\"3\";\"3\";\"4\";\"4\";\"4\";\"5\";\"5\";\"6\";\"6\";\"6\";\"6\";\"6\";\"6\";\"6\";\"6\";\"6\";\"6\";\"6\";\"6\";\"7\";\"7\";\"7\";\"7\";\"7\";\"7\";\"7\";\"7\";\"7\";\"7\";\"8\";\"8\";\"8\";\"8\";\"8\";\"8\";\"8\";\"8\";\"8\";\"8\";\"9\";\"9\";\"9\";\"9\";\"9\";\"9\";\"9\";\"9\";\"9\";\"9\";\"10\";\"10\";\"10\";\"10\";\"10\";\"10\";\"10\";\"10\";\"10\";\"10\";\"11\"})","v":"4"},"муж","00-00-0000009","№9","00:00:33.200",{"$f":"IF(AND(I14=0),0,IFERROR(IFERROR(MATCH(I14,ОСН!$D$1:$D$100,-1),MATCH(\"0:\"&I14,ОСН!$D$1:$D$100,-1)),\"\"))","v":100},1,8,192,{"$f":"IF(AND(M14=0),0,IFERROR(MATCH(M14,ОСН!$A$1:$A$100,1),\"\"))","v":34},7,9,134,null,"00:00:00"]
[10,"Валерий","2001-10-13",15,{"$f":"LOOKUP(DATEDIF(C15,TODAY(),\"y\"),{6;7;8;9;10;11;12;13;14;15;16;17;18;19;20;21;22;23;24;25;26;27;28;29;30;31;32;33;34;35;36;37;38;39;40;41;42;43;44;45;46;47;48;49;50;51;52;53;54;55;56;57;58;59;60;61;62;63;64;65;66;67;68;69;70},{\"1\";\"1\";\"1\";\"2\";\"2\";\"3\";\"3\";\"4\";\"4\";\"4\";\"5\";\"5\";\"6\";\"6\";\"6\";\"6\";\"6\";\"6\";\"6\";\"6\";\"6\";\"6\";\"6\";\"6\";\"7\";\"7\";\"7\";\"7\";\"7\";\"7\";\"7\";\"7\";\"7\";\"7\";\"8\";\"8\";\"8\";\"8\";\"8\";\"8\";\"8\";\"8\";\"8\";\"8\";\"9\";\"9\";\"9\";\"9\";\"9\";\"9\";\"9\";\"9\";\"9\";\"9\";\"10\";\"10\";\"10\";\"10\";\"10\";\"10\";\"10\";\"10\";\"10\";\"10\";\"11\"})","v":"4"},"муж","00-00-0000010","№10","00:00:33.200",{"$f":"IF(AND(I15=0),0,IFERROR(IFERROR(MATCH(I15,ОСН!$D$1:$D$100,-1),MATCH(\"0:\"&I15,ОСН!$D$1:$D$100,-1)),\"\"))","v":100},1,8,191,{"$f":"IF(AND(M15=0),0,IFERROR(MATCH(M15,ОСН!$A$1:$A$100,1),\"\"))","v":33},8,10,133,null,"00:00:00"]
[11,"Дмитрий","2001-10-13",15,{"$f":"LOOKUP(DATEDIF(C16,TODAY(),\"y\"),{6;7;8;9;10;11;12;13;14;15;16;17;18;19;20;21;22;23;24;25;26;27;28;29;30;31;32;33;34;35;36;37;38;39;40;41;42;43;44;45;46;47;48;49;50;51;52;53;54;55;56;57;58;59;60;61;62;63;64;65;66;67;68;69;70},{\"1\";\"1\";\"1\";\"2\";\"2\";\"3\";\"3\";\"4\";\"4\";\"4\";\"5\";\"5\";\"6\";\"6\";\"6\";\"6\";\"6\";\"6\";\"6\";\"6\";\"6\";\"6\";\"6\";\"6\";\"7\";\"7\";\"7\";\"7\";\"7\";\"7\";\"7\";\"7\";\"7\";\"7\";\"8\";\"8\";\"8\";\"8\";\"8\";\"8\";\"8\";\"8\";\"8\";\"8\";\"9\";\"9\";\"9\";\"9\";\"9\";\"9\";\"9\";\"9\";\"9\";\"9\";\"10\";\"10\";\"10\";\"10\";\"10\";\"10\";\"10\";\"10\";\"10\";\"10\";\"11\"})","v":"4"},"муж","00-00-0000012","№12","00:00:36.400",{"$f":"IF(AND(I16=0),0,IFERROR(IFERROR(MATCH(I16,ОСН!$D$1:$D$100,-1),MATCH(\"0:\"&I16,ОСН!$D$1:$D$100,-1)),\"\"))","v":100},1,12,190,{"$f":"IF(AND(M16=0),0,IFERROR(MATCH(M16,ОСН!$A$1:$A$100,1),\"\"))","v":33},9,11,133,null,"00:00:00"]
[12,"Владимир","2001-10-13",15,{"$f":"LOOKUP(DATEDIF(C17,TODAY(),\"y\"),{6;7;8;9;10;11;12;13;14;15;16;17;18;19;20;21;22;23;24;25;26;27;28;29;30;31;32;33;34;35;36;37;38;39;40;41;42;43;44;45;46;47;48;49;50;51;52;53;54;55;56;57;58;59;60;61;62;63;64;65;66;67;68;69;70},{\"1\";\"1\";\"1\";\"2\";\"2\";\"3\";\"3\";\"4\";\"4\";\"4\";\"5\";\"5\";\"6\";\"6\";\"6\";\"6\";\"6\";\"6\";\"6\";\"6\";\"6\";\"6\";\"6\";\"6\";\"7\";\"7\";\"7\";\"7\";\"7\";\"7\";\"7\";\"7\";\"7\";\"7\";\"8\";\"8\";\"8\";\"8\";\"8\";\"8\";\"8\";\"8\";\"8\";\"8\";\"9\";\"9\";\"9\";\"9\";\"9\";\"9\";\"9\";\"9\";\"9\";\"9\";\"10\";\"10\";\"10\";\"10\";\"10\";\"10\";\"10\";\"10\";\"10\";\"10\";\"11\"})","v":"4"},"муж","00-00-0000011","№11","00:00:33.700",{"$f":"IF(AND(I17=0),0,IFERROR(IFERROR(MATCH(I17,ОСН!$D$1:$D$100,-1),MATCH(\"0:\"&I17,ОСН!$D$1:$D$100,-1)),\"\"))","v":100},1,11,190,{"$f":"IF(AND(M17=0),0,IFERROR(MATCH(M17,ОСН!$A$1:$A$100,1),\"\"))","v":33},9,11,133,null,"00:00:00"]
[13,"Константин","2001-10-13",15,{"$f":"LOOKUP(DATEDIF(C18,TODAY(),\"y\"),{6;7;8;9;10;11;12;13;14;15;16;17;18;19;20;21;22;23;24;25;26;27;28;29;30;31;32;33;34;35;36;37;38;39;40;41;42;43;44;45;46;47;48;49;50;51;52;53;54;55;56;57;58;59;60;61;62;63;64;65;66;67;68;69;70},{\"1\";\"1\";\"1\";\"2\";\"2\";\"3\";\"3\";\"4\";\"4\";\"4\";\"5\";\"5\";\"6\";\"6\";\"6\";\"6\";\"6\";\"6\";\"6\";\"6\";\"6\";\"6\";\"6\";\"6\";\"7\";\"7\";\"7\";\"7\";\"7\";\"7\";\"7\";\"7\";\"7\";\"7\";\"8\";\"8\";\"8\";\"8\";\"8\";\"8\";\"8\";\"8\";\"8\";\"8\";\"9\";\"9\";\"9\";\"9\";\"9\";\"9\";\"9\";\"9\";\"9\";\"9\";\"10\";\"10\";\"10\";\"10\";\"10\";\"10\";\"10\";\"10\";\"10\";\"10\";\"11\"})","v":"4"},"муж","00-00-0000014","№14","00:00:38.300",{"$f":"IF(AND(I18=0),0,IFERROR(IFERROR(MATCH(I18,ОСН!$D$1:$D$100,-1),MATCH(\"0:\"&I18,ОСН!$D$1:$D$100,-1)),\"\"))","v":100},1,14,189,{"$f":"IF(AND(M18=0),0,IFERROR(MATCH(M18,ОСН!$A$1:$A$100,1),\"\"))","v":33},10,13,133,null,"00:00:00"]
[14,"Руслан","2001-10-13",15,{"$f":"LOOKUP(DATEDIF(C19,TODAY(),\"y\"),{6;7;8;9;10;11;12;13;14;15;16;17;18;19;20;21;22;23;24;25;26;27;28;29;30;31;32;33;34;35;36;37;38;39;40;41;42;43;44;45;46;47;48;49;50;51;52;53;54;55;56;57;58;59;60;61;62;63;64;65;66;67;68;69;70},{\"1\";\"1\";\"1\";\"2\";\"2\";\"3\";\"3\";\"4\";\"4\";\"4\";\"5\";\"5\";\"6\";\"6\";\"6\";\"6\";\"6\";\"6\";\"6\";\"6\";\"6\";\"6\";\"6\";\"6\";\"7\";\"7\";\"7\";\"7\";\"7\";\"7\";\"7\";\"7\";\"7\";\"7\";\"8\";\"8\";\"8\";\"8\";\"8\";\"8\";\"8\";\"8\";\"8\";\"8\";\"9\";\"9\";\"9\";\"9\";\"9\";\"9\";\"9\";\"9\";\"9\";\"9\";\"10\";\"10\";\"10\";\"10\";\"10\";\"10\";\"10\";\"10\";\"10\";\"10\";\"11\"})","v":"4"},"муж","00-00-0000013","№13","00:00:37.800",{"$f":"IF(AND(I19=0),0,IFERROR(IFERROR(MATCH(I19,ОСН!$D$1:$D$100,-1),MATCH(\"0:\"&I19,ОСН!$D$1:$D$100,-1)),\"\"))","v":100},1,13,189,{"$f":"IF(AND(M19=0),0,IFERROR(MATCH(M19,ОСН!$A$1:$A$100,1),\"\"))","v":33},10,13,133,null,"00:00:00"]
[15,"Антон","2001-10-13",15,{"$f":"LOOKUP(DATEDIF(C20,TODAY(),\"y\"),{6;7;8;9;10;11;12;13;14;15;16;17;18;19;20;21;22;23;24;25;26;27;28;29;30;31;32;33;34;35;36;37;38;39;40;41;42;43;44;45;46;47;48;49;50;51;52;53;54;55;56;57;58;59;60;61;62;63;64;65;66;67;68;69;70},{\"1\";\"1\";\"1\";\"2\";\"2\";\"3\";\"3\";\"4\";\"4\";\"4\";\"5\";\"5\";\"6\";\"6\";\"6\";\"6\";\"6\";\"6\";\"6\";\"6\";\"6\";\"6\";\"6\";\"6\";\"7\";\"7\";\"7\";\"7\";\"7\";\"7\";\"7\";\"7\";\"7\";\"7\";\"8\";\"8\";\"8\";\"8\";\"8\";\"8\";\"8\";\"8\";\"8\";\"8\";\"9\";\"9\";\"9\";\"9\";\"9\";\"9\";\"9\";\"9\";\"9\";\"9\";\"10\";\"10\";\"10\";\"10\";\"10\";\"10\";\"10\";\"10\";\"10\";\"10\";\"11\"})","v":"4"},"муж","00-00-0000015","№15","00:00:39.200",{"$f":"IF(AND(I20=0),0,IFERROR(IFERROR(MATCH(I20,ОСН!$D$1:$D$100,-1),MATCH(\"0:\"&I20,ОСН!$D$1:$D$100,-1)),\"\"))","v":100},1,15,184,{"$f":"IF(AND(M20=0),0,IFERROR(MATCH(M20,ОСН!$A$1:$A$100,1),\"\"))","v":31},11,15,131,null,"00:00:00"]
{"$rows_left_out":17}
{"sheet":"ОСН","index":1,"n_rows":100,"n_cols":7,"rows_kept":100,"cut":false,"hidden":false,"merged":[]}
[70,1,-10,"2.00,0",3,30,1]
[76,2,-9,"1.57,0",6,29.1,"-"]
[81,3,"-","1.54,0",9,28.2,"-"]
[86,4,-8,"1.52,0",12,27.4,2]
[90,5,"-","1.50,0",15,27,"-"]
[94,6,-7,"1.48,0",18,26.2,"-"]
[98,7,"-","1.46,0",20,25.4,3]
[102,8,-6,"1.44,0",22,25,"-"]
[106,9,"-","1.42,0",24,24.3,"-"]
[110,10,-5,"1.40,0",26,24,4]
[114,"-","-","1.38,0",28,23.3,"-"]
[118,11,-4,"1.36,0",30,23,"-"]
[122,"-","-","1.34,0",32,22.35,5]
[126,12,-3,"1.32,0",34,22.1,"-"]
[130,"-","-","1.30,0",35,21.45,"-"]
[134,13,-2,"1.28,0",36,21.2,6]
[138,"-","-","1.26,0",37,21,"-"]
[142,14,-1,"1.24,0",38,20.399999999999999,"-"]
[146,"-","-","1.22,0",39,20.2,7]
[150,15,0,"1.20,0",40,20,"-"]
{"$rows_left_out":81}
{"sheet":"плавание (2)","index":2,"n_rows":102,"n_cols":2,"rows_kept":102,"cut":false,"hidden":true,"merged":[[0,1,1,1],[0,3,1,3]]}
["плавание","Очки"]
["25 м"]
[60.1,1]
[60.05,2]
[1.02,3]
[1,4]
[58,5]
[57,6]
[56,7]
[55,8]
[54,9]
[53,10]
[52,11]
[51,12]
[50,13]
[49,14]
[48,15]
[47,16]
[46,17]
[45,18]
{"$rows_left_out":83}
{"sheet":"отжимание (2)","index":3,"n_rows":102,"n_cols":19,"rows_kept":102,"cut":false,"hidden":true,"merged":[[0,1,1,1],[0,3,1,3]]}
["Стрельба ","Очки"]
["ВП\n5в\n"]
["-",1,null,null,null,null,null,null,null,null,null,null,null,null,null,null,null,null,1]
["-",2,null,null,null,null,null,null,null,null,null,null,null,null,null,null,null,null,2]
[1,3,null,null,null,null,null,null,null,null,null,null,null,null,null,null,null,null,3]
["-",4]
["-",5]
[2,6]
["-",7]
["-",8]
[3,9]
["-",10]
["-",11]
[4,12]
["-",13]
["-",14]
[5,15]
["-",16]
["-",17]
[6,18]
{"$rows_left_out":83}
{"sheet":"Стрельба (2)","index":4,"n_rows":102,"n_cols":19,"rows_kept":102,"cut":false,"hidden":true,"merged":[[0,3,1,3],[0,1,1,1]]}
["Стрельба ","Очки"]
["ВП\n5в\n"]
[1,1,null,null,null,null,null,null,null,null,null,null,null,null,null,null,null,null,1]
[2,2,null,null,null,null,null,null,null,null,null,null,null,null,null,null,null,null,2]
[3,3,null,null,null,null,null,null,null,null,null,null,null,null,null,null,null,null,3]
[4,4]
[5,5]
[6,6]
[7,7]
[8,8]
[9,9]
[10,10]
["-",11]
[11,12]
["-",13]
[12,14]
["-",15]
[13,16]
["-",17]
[14,18]
{"$rows_left_out":83}
{"sheet":"плавание","index":5,"n_rows":102,"n_cols":2,"rows_kept":102,"cut":false,"hidden":true,"merged":[[0,1,1,1],[0,3,1,3]]}
["плавание","Очки"]
["25 м"]
[60.1,1]
[60.05,2]
[1.02,3]
[1,4]
[58,5]
[57,6]
[56,7]
[55,8]
[54,9]
[53,10]
[52,11]
[51,12]
[50,13]
[49,14]
[48,15]
[47,16]
[46,17]
[45,18]
{"$rows_left_out":83}
{"sheet":"отжимание","index":6,"n_rows":102,"n_cols":19,"rows_kept":102,"cut":false,"hidden":true,"merged":[[0,1,1,1],[0,3,1,3]]}
["Стрельба ","Очки"]
["ВП\n5в\n"]
["-",1,null,null,null,null,null,null,null,null,null,null,null,null,null,null,null,null,1]
["-",2,null,null,null,null,null,null,null,null,null,null,null,null,null,null,null,null,2]
[1,3,null,null,null,null,null,null,null,null,null,null,null,null,null,null,null,null,3]
["-",4]
["-",5]
[2,6]
["-",7]
["-",8]
[3,9]
["-",10]
["-",11]
[4,12]
["-",13]
["-",14]
[5,15]
["-",16]
["-",17]
[6,18]
{"$rows_left_out":83}
{"sheet":"Стрельба","index":7,"n_rows":102,"n_cols":19,"rows_kept":102,"cut":false,"hidden":true,"merged":[[0,3,1,3],[0,1,1,1]]}
["Стрельба ","Очки"]
["ВП\n5в\n"]
[1,1,null,null,null,null,null,null,null,null,null,null,null,null,null,null,null,null,1]
[2,2,null,null,null,null,null,null,null,null,null,null,null,null,null,null,null,null,2]
[3,3,null,null,null,null,null,null,null,null,null,null,null,null,null,null,null,null,3]
[4,4]
[5,5]
[6,6]
[7,7]
[8,8]
[9,9]
[10,10]
["-",11]
[11,12]
["-",13]
[12,14]
["-",15]
[13,16]
["-",17]
[14,18]
{"$rows_left_out":82}