{"text_format":"1","workbook":"xlsx","n_sheets":8,"sheets":["м","ОСН","плавание (2)","отжимание (2)","Стрельба (2)","плавание","отжимание","Стрельба"],"not_rendered":{"charts":0,"images":0,"macros":1,"external_links":1,"defined_names":7,"comments":0,"pivot_tables":0},"unopened":[],"bounds":{"document_bytes":16777216,"sheet_cells":100000,"rows_first":2000,"rows_last":500,"rows_between":2000,"halvings":0,"cell_chars":16384,"cell_head_chars":4096},"cells_cut":0,"cells_raw":0,"read":"whole","date_system":"1900"}

{"sheet":"м","index":0,"n_rows":36,"n_cols":15,"rows_kept":36,"cut":false,"hidden":false,"merged":[[1,0,1,1],[2,11,2,13],[2,5,3,5],[2,0,3,0],[2,1,3,1],[2,2,3,2],[2,8,2,10],[2,3,3,3],[2,4,3,4],[2,6,3,6]]}
[]
[]
["Номер","Имя ",null,null,null,null,"номер","команда","плавание",null,null,"бег",null,null,"многоборье"]
[null,null,null,null,null,null,null,"школа","рез-т","очки","место","рез-т","очки","место","сумма"]
[]
[1,"Иван",null,null,null,null,null,"№2",null,{"$f":"IF(AND(I6=0),0,IFERROR(IFERROR(MATCH(I6,ОСН!$B$1:$B$100,-1),MATCH(\"0:\"&I6,ОСН!$B$1:$B$100,-1)),\"\"))","v":0},{"$f":"IF(ISNUMBER(SEARCH(\"лично\",H6)),\"\",IFERROR(MATCH(I6,SMALL(IF(ISERR(SEARCH(\"лично\",H$6:H$36)),I$6:I$36),ROW(I$6:I$36)-5),),\"\"))","v":1},null,{"$f":"IF(AND(L6=0),0,IFERROR(MATCH(L6,ОСН!$C$1:$C$100,-1),\"\"))","v":0},{"$f":"IF(ISNUMBER(SEARCH(\"лично\",H6)),\"\",IFERROR(MATCH(L6,SMALL(IF(ISERR(SEARCH(\"лично\",H$6:H$36)),L$6:L$36),ROW(L$6:L$36)-5),),\"\"))","v":1},{"$f":"SUM(J6,M6)","v":0}]
[2,"Александр",null,null,null,null,null,"№3",null,{"$f":"IF(AND(I7=0),0,IFERROR(IFERROR(MATCH(I7,ОСН!$B$1:$B$100,-1),MATCH(\"0:\"&I7,ОСН!$B$1:$B$100,-1)),\"\"))","v":0},{"$f":"IF(ISNUMBER(SEARCH(\"лично\",H7)),\"\",IFERROR(MATCH(I7,SMALL(IF(ISERR(SEARCH(\"лично\",H$6:H$36)),I$6:I$36),ROW(I$6:I$36)-5),),\"\"))","v":1},null,{"$f":"IF(AND(L7=0),0,IFERROR(MATCH(L7,ОСН!$C$1:$C$100,-1),\"\"))","v":0},{"$f":"IF(ISNUMBER(SEARCH(\"лично\",H7)),\"\",IFERROR(MATCH(L7,SMALL(IF(ISERR(SEARCH(\"лично\",H$6:H$36)),L$6:L$36),ROW(L$6:L$36)-5),),\"\"))","v":1},0]
[3,"Алексей",null,null,null,null,null,"№4",null,{"$f":"IF(AND(I8=0),0,IFERROR(IFERROR(MATCH(I8,ОСН!$B$1:$B$100,-1),MATCH(\"0:\"&I8,ОСН!$B$1:$B$100,-1)),\"\"))","v":0},{"$f":"IF(ISNUMBER(SEARCH(\"лично\",H8)),\"\",IFERROR(MATCH(I8,SMALL(IF(ISERR(SEARCH(\"лично\",H$6:H$36)),I$6:I$36),ROW(I$6:I$36)-5),),\"\"))","v":1},null,{"$f":"IF(AND(L8=0),0,IFERROR(MATCH(L8,ОСН!$C$1:$C$100,-1),\"\"))","v":0},{"$f":"IF(ISNUMBER(SEARCH(\"лично\",H8)),\"\",IFERROR(MATCH(L8,SMALL(IF(ISERR(SEARCH(\"лично\",H$6:H$36)),L$6:L$36),ROW(L$6:L$36)-5),),\"\"))","v":1},0]
[4,"Андрей",null,null,null,null,null,"№1",null,{"$f":"IF(AND(I9=0),0,IFERROR(IFERROR(MATCH(I9,ОСН!$B$1:$B$100,-1),MATCH(\"0:\"&I9,ОСН!$B$1:$B$100,-1)),\"\"))","v":0},{"$f":"IF(ISNUMBER(SEARCH(\"лично\",H9)),\"\",IFERROR(MATCH(I9,SMALL(IF(ISERR(SEARCH(\"лично\",H$6:H$36)),I$6:I$36),ROW(I$6:I$36)-5),),\"\"))","v":1},null,{"$f":"IF(AND(L9=0),0,IFERROR(MATCH(L9,ОСН!$C$1:$C$100,-1),\"\"))","v":0},{"$f":"IF(ISNUMBER(SEARCH(\"лично\",H9)),\"\",IFERROR(MATCH(L9,SMALL(IF(ISERR(SEARCH(\"лично\",H$6:H$36)),L$6:L$36),ROW(L$6:L$36)-5),),\"\"))","v":1},0]
[5,"Иван",null,null,null,null,null,"№5",null,{"$f":"IF(AND(I10=0),0,IFERROR(IFERROR(MATCH(I10,ОСН!$B$1:$B$100,-1),MATCH(\"0:\"&I10,ОСН!$B$1:$B$100,-1)),\"\"))","v":0},{"$f":"IF(ISNUMBER(SEARCH(\"лично\",H10)),\"\",IFERROR(MATCH(I10,SMALL(IF(ISERR(SEARCH(\"лично\",H$6:H$36)),I$6:I$36),ROW(I$6:I$36)-5),),\"\"))","v":1},null,{"$f":"IF(AND(L10=0),0,IFERROR(MATCH(L10,ОСН!$C$1:$C$100,-1),\"\"))","v":0},{"$f":"IF(ISNUMBER(SEARCH(\"лично\",H10)),\"\",IFERROR(MATCH(L10,SMALL(IF(ISERR(SEARCH(\"лично\",H$6:H$36)),L$6:L$36),ROW(L$6:L$36)-5),),\"\"))","v":1},0]
[6,"Дмитрий",null,null,null,null,null,"№6",null,{"$f":"IF(AND(I11=0),0,IFERROR(IFERROR(MATCH(I11,ОСН!$B$1:$B$100,-1),MATCH(\"0:\"&I11,ОСН!$B$1:$B$100,-1)),\"\"))","v":0},{"$f":"IF(ISNUMBER(SEARCH(\"лично\",H11)),\"\",IFERROR(MATCH(I11,SMALL(IF(ISERR(SEARCH(\"лично\",H$6:H$36)),I$6:I$36),ROW(I$6:I$36)-5),),\"\"))","v":1},null,{"$f":"IF(AND(L11=0),0,IFERROR(MATCH(L11,ОСН!$C$1:$C$100,-1),\"\"))","v":0},{"$f":"IF(ISNUMBER(SEARCH(\"лично\",H11)),\"\",IFERROR(MATCH(L11,SMALL(IF(ISERR(SEARCH(\"лично\",H$6:H$36)),L$6:L$36),ROW(L$6:L$36)-5),),\"\"))","v":1},0]
[7,"Степан",null,null,null,null,null,"№8",null,{"$f":"IF(AND(I12=0),0,IFERROR(IFERROR(MATCH(I12,ОСН!$B$1:$B$100,-1),MATCH(\"0:\"&I12,ОСН!$B$1:$B$100,-1)),\"\"))","v":0},{"$f":"IF(ISNUMBER(SEARCH(\"лично\",H12)),\"\",IFERROR(MATCH(I12,SMALL(IF(ISERR(SEARCH(\"лично\",H$6:H$36)),I$6:I$36),ROW(I$6:I$36)-5),),\"\"))","v":1},null,{"$f":"IF(AND(L12=0),0,IFERROR(MATCH(L12,ОСН!$C$1:$C$100,-1),\"\"))","v":0},{"$f":"IF(ISNUMBER(SEARCH(\"лично\",H12)),\"\",IFERROR(MATCH(L12,SMALL(IF(ISERR(SEARCH(\"лично\",H$6:H$36)),L$6:L$36),ROW(L$6:L$36)-5),),\"\"))","v":1},0]
[8,"Максим",null,null,null,null,null,"№7",null,{"$f":"IF(AND(I13=0),0,IFERROR(IFERROR(MATCH(I13,ОСН!$B$1:$B$100,-1),MATCH(\"0:\"&I13,ОСН!$B$1:$B$100,-1)),\"\"))","v":0},{"$f":"IF(ISNUMBER(SEARCH(\"лично\",H13)),\"\",IFERROR(MATCH(I13,SMALL(IF(ISERR(SEARCH(\"лично\",H$6:H$36)),I$6:I$36),ROW(I$6:I$36)-5),),\"\"))","v":1},null,{"$f":"IF(AND(L13=0),0,IFERROR(MATCH(L13,ОСН!$C$1:$C$100,-1),\"\"))","v":0},{"$f":"IF(ISNUMBER(SEARCH(\"лично\",H13)),\"\",IFERROR(MATCH(L13,SMALL(IF(ISERR(SEARCH(\"лично\",H$6:H$36)),L$6:L$36),ROW(L$6:L$36)-5),),\"\"))","v":1},0]
[9,"Андрей",null,null,null,null,null,"№9",null,{"$f":"IF(AND(I14=0),0,IFERROR(IFERROR(MATCH(I14,ОСН!$B$1:$B$100,-1),MATCH(\"0:\"&I14,ОСН!$B$1:$B$100,-1)),\"\"))","v":0},{"$f":"IF(ISNUMBER(SEARCH(\"лично\",H14)),\"\",IFERROR(MATCH(I14,SMALL(IF(ISERR(SEARCH(\"лично\",H$6:H$36)),I$6:I$36),ROW(I$6:I$36)-5),),\"\"))","v":1},null,{"$f":"IF(AND(L14=0),0,IFERROR(MATCH(L14,ОСН!$C$1:$C$100,-1),\"\"))","v":0},{"$f":"IF(ISNUMBER(SEARCH(\"лично\",H14)),\"\",IFERROR(MATCH(L14,SMALL(IF(ISERR(SEARCH(\"лично\",H$6:H$36)),L$6:L$36),ROW(L$6:L$36)-5),),\"\"))","v":1},0]
[10,"Валерий",null,null,null,null,null,"№10",null,{"$f":"IF(AND(I15=0),0,IFERROR(IFERROR(MATCH(I15,ОСН!$B$1:$B$100,-1),MATCH(\"0:\"&I15,ОСН!$B$1:$B$100,-1)),\"\"))","v":0},{"$f":"IF(ISNUMBER(SEARCH(\"лично\",H15)),\"\",IFERROR(MATCH(I15,SMALL(IF(ISERR(SEARCH(\"лично\",H$6:H$36)),I$6:I$36),ROW(I$6:I$36)-5),),\"\"))","v":1},null,{"$f":"IF(AND(L15=0),0,IFERROR(MATCH(L15,ОСН!$C$1:$C$100,-1),\"\"))","v":0},{"$f":"IF(ISNUMBER(SEARCH(\"лично\",H15)),\"\",IFERROR(MATCH(L15,SMALL(IF(ISERR(SEARCH(\"лично\",H$6:H$36)),L$6:L$36),ROW(L$6:L$36)-5),),\"\"))","v":1},0]
[11,"Дмитрий",null,null,null,null,null,"№12",null,{"$f":"IF(AND(I16=0),0,IFERROR(IFERROR(MATCH(I16,ОСН!$B$1:$B$100,-1),MATCH(\"0:\"&I16,ОСН!$B$1:$B$100,-1)),\"\"))","v":0},{"$f":"IF(ISNUMBER(SEARCH(\"лично\",H16)),\"\",IFERROR(MATCH(I16,SMALL(IF(ISERR(SEARCH(\"лично\",H$6:H$36)),I$6:I$36),ROW(I$6:I$36)-5),),\"\"))","v":1},null,{"$f":"IF(AND(L16=0),0,IFERROR(MATCH(L16,ОСН!$C$1:$C$100,-1),\"\"))","v":0},{"$f":"IF(ISNUMBER(SEARCH(\"лично\",H16)),\"\",IFERROR(MATCH(L16,SMALL(IF(ISERR(SEARCH(\"лично\",H$6:H$36)),L$6:L$36),ROW(L$6:L$36)-5),),\"\"))","v":1},0]
[12,"Владимир",null,null,null,null,null,"№11",null,{"$f":"IF(AND(I17=0),0,IFERROR(IFERROR(MATCH(I17,ОСН!$B$1:$B$100,-1),MATCH(\"0:\"&I17,ОСН!$B$1:$B$100,-1)),\"\"))","v":0},{"$f":"IF(ISNUMBER(SEARCH(\"лично\",H17)),\"\",IFERROR(MATCH(I17,SMALL(IF(ISERR(SEARCH(\"лично\",H$6:H$36)),I$6:I$36),ROW(I$6:I$36)-5),),\"\"))","v":1},null,{"$f":"IF(AND(L17=0),0,IFERROR(MATCH(L17,ОСН!$C$1:$C$100,-1),\"\"))","v":0},{"$f":"IF(ISNUMBER(SEARCH(\"лично\",H17)),\"\",IFERROR(MATCH(L17,SMALL(IF(ISERR(SEARCH(\"лично\",H$6:H$36)),L$6:L$36),ROW(L$6:L$36)-5),),\"\"))","v":1},0]
[13,"Константин",null,null,null,null,null,"№14",null,{"$f":"IF(AND(I18=0),0,IFERROR(IFERROR(MATCH(I18,ОСН!$B$1:$B$100,-1),MATCH(\"0:\"&I18,ОСН!$B$1:$B$100,-1)),\"\"))","v":0},{"$f":"IF(ISNUMBER(SEARCH(\"лично\",H18)),\"\",IFERROR(MATCH(I18,SMALL(IF(ISERR(SEARCH(\"лично\",H$6:H$36)),I$6:I$36),ROW(I$6:I$36)-5),),\"\"))","v":1},null,{"$f":"IF(AND(L18=0),0,IFERROR(MATCH(L18,ОСН!$C$1:$C$100,-1),\"\"))","v":0},{"$f":"IF(ISNUMBER(SEARCH(\"лично\",H18)),\"\",IFERROR(MATCH(L18,SMALL(IF(ISERR(SEARCH(\"лично\",H$6:H$36)),L$6:L$36),ROW(L$6:L$36)-5),),\"\"))","v":1},0]
[14,"Руслан",null,null,null,null,null,"№13",null,{"$f":"IF(AND(I19=0),0,IFERROR(IFERROR(MATCH(I19,ОСН!$B$1:$B$100,-1),MATCH(\"0:\"&I19,ОСН!$B$1:$B$100,-1)),\"\"))","v":0},{"$f":"IF(ISNUMBER(SEARCH(\"лично\",H19)),\"\",IFERROR(MATCH(I19,SMALL(IF(ISERR(SEARCH(\"лично\",H$6:H$36)),I$6:I$36),ROW(I$6:I$36)-5),),\"\"))","v":1},null,{"$f":"IF(AND(L19=0),0,IFERROR(MATCH(L19,ОСН!$C$1:$C$100,-1),\"\"))","v":0},{"$f":"IF(ISNUMBER(SEARCH(\"лично\",H19)),\"\",IFERROR(MATCH(L19,SMALL(IF(ISERR(SEARCH(\"лично\",H$6:H$36)),L$6:L$36),ROW(L$6:L$36)-5),),\"\"))","v":1},0]
[15,"Антон",null,null,null,null,null,"№15",null,{"$f":"IF(AND(I20=0),0,IFERROR(IFERROR(MATCH(I20,ОСН!$B$1:$B$100,-1),MATCH(\"0:\"&I20,ОСН!$B$1:$B$100,-1)),\"\"))","v":0},{"$f":"IF(ISNUMBER(SEARCH(\"лично\",H20)),\"\",IFERROR(MATCH(I20,SMALL(IF(ISERR(SEARCH(\"лично\",H$6:H$36)),I$6:I$36),ROW(I$6:I$36)-5),),\"\"))","v":1},null,{"$f":"IF(AND(L20=0),0,IFERROR(MATCH(L20,ОСН!$C$1:$C$100,-1),\"\"))","v":0},{"$f":"IF(ISNUMBER(SEARCH(\"лично\",H20)),\"\",IFERROR(MATCH(L20,SMALL(IF(ISERR(SEARCH(\"лично\",H$6:H$36)),L$6:L$36),ROW(L$6:L$36)-5),),\"\"))","v":1},0]
[16,"Игорь",null,null,null,null,null,"№16",null,{"$f":"IF(AND(I21=0),0,IFERROR(IFERROR(MATCH(I21,ОСН!$B$1:$B$100,-1),MATCH(\"0:\"&I21,ОСН!$B$1:$B$100,-1)),\"\"))","v":0},{"$f":"IF(ISNUMBER(SEARCH(\"лично\",H21)),\"\",IFERROR(MATCH(I21,SMALL(IF(ISERR(SEARCH(\"лично\",H$6:H$36)),I$6:I$36),ROW(I$6:I$36)-5),),\"\"))","v":1},null,{"$f":"IF(AND(L21=0),0,IFERROR(MATCH(L21,ОСН!$C$1:$C$100,-1),\"\"))","v":0},{"$f":"IF(ISNUMBER(SEARCH(\"лично\",H21)),\"\",IFERROR(MATCH(L21,SMALL(IF(ISERR(SEARCH(\"лично\",H$6:H$36)),L$6:L$36),ROW(L$6:L$36)-5),),\"\"))","v":1},0]
[17,"Тимофей",null,null,null,null,null,"№17",null,{"$f":"IF(AND(I22=0),0,IFERROR(IFERROR(MATCH(I22,ОСН!$B$1:$B$100,-1),MATCH(\"0:\"&I22,ОСН!$B$1:$B$100,-1)),\"\"))","v":0},{"$f":"IF(ISNUMBER(SEARCH(\"лично\",H22)),\"\",IFERROR(MATCH(I22,SMALL(IF(ISERR(SEARCH(\"лично\",H$6:H$36)),I$6:I$36),ROW(I$6:I$36)-5),),\"\"))","v":1},null,{"$f":"IF(AND(L22=0),0,IFERROR(MATCH(L22,ОСН!$C$1:$C$100,-1),\"\"))","v":0},{"$f":"IF(ISNUMBER(SEARCH(\"лично\",H22)),\"\",IFERROR(MATCH(L22,SMALL(IF(ISERR(SEARCH(\"лично\",H$6:H$36)),L$6:L$36),ROW(L$6:L$36)-5),),\"\"))","v":1},0]
[18,"Рома",null,null,null,null,null,"№4",null,{"$f":"IF(AND(I23=0),0,IFERROR(IFERROR(MATCH(I23,ОСН!$B$1:$B$100,-1),MATCH(\"0:\"&I23,ОСН!$B$1:$B$100,-1)),\"\"))","v":0},{"$f":"IF(ISNUMBER(SEARCH(\"лично\",H23)),\"\",IFERROR(MATCH(I23,SMALL(IF(ISERR(SEARCH(\"лично\",H$6:H$36)),I$6:I$36),ROW(I$6:I$36)-5),),\"\"))","v":1},null,{"$f":"IF(AND(L23=0),0,IFERROR(MATCH(L23,ОСН!$C$1:$C$100,-1),\"\"))","v":0},{"$f":"IF(ISNUMBER(SEARCH(\"лично\",H23)),\"\",IFERROR(MATCH(L23,SMALL(IF(ISERR(SEARCH(\"лично\",H$6:H$36)),L$6:L$36),ROW(L$6:L$36)-5),),\"\"))","v":1},0]
[19,"Коля",null,null,null,null,null,"№2",null,{"$f":"IF(AND(I24=0),0,IFERROR(IFERROR(MATCH(I24,ОСН!$B$1:$B$100,-1),MATCH(\"0:\"&I24,ОСН!$B$1:$B$100,-1)),\"\"))","v":0},{"$f":"IF(ISNUMBER(SEARCH(\"лично\",H24)),\"\",IFERROR(MATCH(I24,SMALL(IF(ISERR(SEARCH(\"лично\",H$6:H$36)),I$6:I$36),ROW(I$6:I$36)-5),),\"\"))","v":1},null,{"$f":"IF(AND(L24=0),0,IFERROR(MATCH(L24,ОСН!$C$1:$C$100,-1),\"\"))","v":0},{"$f":"IF(ISNUMBER(SEARCH(\"лично\",H24)),\"\",IFERROR(MATCH(L24,SMALL(IF(ISERR(SEARCH(\"лично\",H$6:H$36)),L$6:L$36),ROW(L$6:L$36)-5),),\"\"))","v":1},0]
[20,"Федя",null,null,null,null,null,"№3",null,{"$f":"IF(AND(I25=0),0,IFERROR(IFERROR(MATCH(I25,ОСН!$B$1:$B$100,-1),MATCH(\"0:\"&I25,ОСН!$B$1:$B$100,-1)),\"\"))","v":0},{"$f":"IF(ISNUMBER(SEARCH(\"лично\",H25)),\"\",IFERROR(MATCH(I25,SMALL(IF(ISERR(SEARCH(\"лично\",H$6:H$36)),I$6:I$36),ROW(I$6:I$36)-5),),\"\"))","v":1},null,{"$f":"IF(AND(L25=0),0,IFERROR(MATCH(L25,ОСН!$C$1:$C$100,-1),\"\"))","v":0},{"$f":"IF(ISNUMBER(SEARCH(\"лично\",H25)),\"\",IFERROR(MATCH(L25,SMALL(IF(ISERR(SEARCH(\"лично\",H$6:H$36)),L$6:L$36),ROW(L$6:L$36)-5),),\"\"))","v":1},0]
[21,"Виталий",null,null,null,null,null,"№18",null,{"$f":"IF(AND(I26=0),0,IFERROR(IFERROR(MATCH(I26,ОСН!$B$1:$B$100,-1),MATCH(\"0:\"&I26,ОСН!$B$1:$B$100,-1)),\"\"))","v":0},{"$f":"IF(ISNUMBER(SEARCH(\"лично\",H26)),\"\",IFERROR(MATCH(I26,SMALL(IF(ISERR(SEARCH(\"лично\",H$6:H$36)),I$6:I$36),ROW(I$6:I$36)-5),),\"\"))","v":1},null,{"$f":"IF(AND(L26=0),0,IFERROR(MATCH(L26,ОСН!$C$1:$C$100,-1),\"\"))","v":0},{"$f":"IF(ISNUMBER(SEARCH(\"лично\",H26)),\"\",IFERROR(MATCH(L26,SMALL(IF(ISERR(SEARCH(\"лично\",H$6:H$36)),L$6:L$36),ROW(L$6:L$36)-5),),\"\"))","v":1},0]
[22,"Мирон",null,null,null,null,null,"№6",null,{"$f":"IF(AND(I27=0),0,IFERROR(IFERROR(MATCH(I27,ОСН!$B$1:$B$100,-1),MATCH(\"0:\"&I27,ОСН!$B$1:$B$100,-1)),\"\"))","v":0},{"$f":"IF(ISNUMBER(SEARCH(\"лично\",H27)),\"\",IFERROR(MATCH(I27,SMALL(IF(ISERR(SEARCH(\"лично\",H$6:H$36)),I$6:I$36),ROW(I$6:I$36)-5),),\"\"))","v":1},null,{"$f":"IF(AND(L27=0),0,IFERROR(MATCH(L27,ОСН!$C$1:$C$100,-1),\"\"))","v":0},{"$f":"IF(ISNUMBER(SEARCH(\"лично\",H27)),\"\",IFERROR(MATCH(L27,SMALL(IF(ISERR(SEARCH(\"лично\",H$6:H$36)),L$6:L$36),ROW(L$6:L$36)-5),),\"\"))","v":1},0]
[23,"Тихон",null,null,null,null,null,"№5",null,{"$f":"IF(AND(I28=0),0,IFERROR(IFERROR(MATCH(I28,ОСН!$B$1:$B$100,-1),MATCH(\"0:\"&I28,ОСН!$B$1:$B$100,-1)),\"\"))","v":0},{"$f":"IF(ISNUMBER(SEARCH(\"лично\",H28)),\"\",IFERROR(MATCH(I28,SMALL(IF(ISERR(SEARCH(\"лично\",H$6:H$36)),I$6:I$36),ROW(I$6:I$36)-5),),\"\"))","v":1},null,{"$f":"IF(AND(L28=0),0,IFERROR(MATCH(L28,ОСН!$C$1:$C$100,-1),\"\"))","v":0},{"$f":"IF(ISNUMBER(SEARCH(\"лично\",H28)),\"\",IFERROR(MATCH(L28,SMALL(IF(ISERR(SEARCH(\"лично\",H$6:H$36)),L$6:L$36),ROW(L$6:L$36)-5),),\"\"))","v":1},0]
[24,"Глеб",null,null,null,null,null,"№1",null,{"$f":"IF(AND(I29=0),0,IFERROR(IFERROR(MATCH(I29,ОСН!$B$1:$B$100,-1),MATCH(\"0:\"&I29,ОСН!$B$1:$B$100,-1)),\"\"))","v":0},{"$f":"IF(ISNUMBER(SEARCH(\"лично\",H29)),\"\",IFERROR(MATCH(I29,SMALL(IF(ISERR(SEARCH(\"лично\",H$6:H$36)),I$6:I$36),ROW(I$6:I$36)-5),),\"\"))","v":1},null,{"$f":"IF(AND(L29=0),0,IFERROR(MATCH(L29,ОСН!$C$1:$C$100,-1),\"\"))","v":0},{"$f":"IF(ISNUMBER(SEARCH(\"лично\",H29)),\"\",IFERROR(MATCH(L29,SMALL(IF(ISERR(SEARCH(\"лично\",H$6:H$36)),L$6:L$36),ROW(L$6:L$36)-5),),\"\"))","v":1},0]
[25,"Саид",null,null,null,null,null,"№8",null,{"$f":"IF(AND(I30=0),0,IFERROR(IFERROR(MATCH(I30,ОСН!$B$1:$B$100,-1),MATCH(\"0:\"&I30,ОСН!$B$1:$B$100,-1)),\"\"))","v":0},{"$f":"IF(ISNUMBER(SEARCH(\"лично\",H30)),\"\",IFERROR(MATCH(I30,SMALL(IF(ISERR(SEARCH(\"лично\",H$6:H$36)),I$6:I$36),ROW(I$6:I$36)-5),),\"\"))","v":1},null,{"$f":"IF(AND(L30=0),0,IFERROR(MATCH(L30,ОСН!$C$1:$C$100,-1),\"\"))","v":0},{"$f":"IF(ISNUMBER(SEARCH(\"лично\",H30)),\"\",IFERROR(MATCH(L30,SMALL(IF(ISERR(SEARCH(\"лично\",H$6:H$36)),L$6:L$36),ROW(L$6:L$36)-5),),\"\"))","v":1},0]
{"$rows_left_out":7}
{"sheet":"ОСН","index":1,"n_rows":107,"n_cols":10,"rows_kept":107,"cut":false,"hidden":false,"merged":[[100,1,103,1],[100,3,103,3],[100,5,103,5]]}
["1.45,0","1:45.00",30,"30.00,00",14.5,14.5,null,{"$f":"IF(A1>0,IF(ISERR(SEARCH(\".\",A1)),A1/24/60/60,(LEFTB(A1)*60+SUBSTITUTE(A1,LEFTB(A1)&\".\",\"\"))/24/60/60),\"\")","v":"00:01:45"},{"$f":"IF(C1>0,IF(ISERR(SEARCH(\".\",C1)),C1/24/60/60,(LEFTB(C1)*60+SUBSTITUTE(C1,LEFTB(C1)&\".\",\"\"))/24/60/60),\"\")","v":"00:00:30"},{"$f":"IF(E1>0,IF(ISERR(SEARCH(\".\",E1)),E1/24/60/60,(LEFTB(E1)*60+SUBSTITUTE(E1,LEFTB(E1)&\".\",\"\"))/24/60/60),\"\")","v":"00:00:14.500"}]
["1.41,0","1:41.00",29.1,"29.10,00",14,14,null,{"$f":"IF(A2>0,IF(ISERR(SEARCH(\".\",A2)),A2/24/60/60,(LEFTB(A2)*60+SUBSTITUTE(A2,LEFTB(A2)&\".\",\"\"))/24/60/60),\"\")","v":"00:01:41"},{"$f":"IF(C2>0,IF(ISERR(SEARCH(\".\",C2)),C2/24/60/60,(LEFTB(C2)*60+SUBSTITUTE(C2,LEFTB(C2)&\".\",\"\"))/24/60/60),\"\")","v":"00:00:29.100"},{"$f":"IF(E2>0,IF(ISERR(SEARCH(\".\",E2)),E2/24/60/60,(LEFTB(E2)*60+SUBSTITUTE(E2,LEFTB(E2)&\".\",\"\"))/24/60/60),\"\")","v":"00:00:14"}]
["1.38,0",null,28.2,null,13.6,null,null,"00:01:38","00:00:28.200","00:00:13.600"]
["1.35,0",null,27.4,null,13.3,null,null,"00:01:35","00:00:27.400","00:00:13.300"]
["1.32,0",null,27,null,13,null,null,"00:01:32","00:00:27","00:00:13"]
["1.29,0",null,26.2,null,12.8,null,null,"00:01:29","00:00:26.200","00:00:12.800"]
["1.26,0",null,25.4,null,12.6,null,null,"00:01:26","00:00:25.400","00:00:12.600"]
["1.24,0",null,25,null,12.4,null,null,"00:01:24","00:00:25","00:00:12.400"]
["1.22,0",null,24.3,null,12.2,null,null,"00:01:22","00:00:24.300","00:00:12.200"]
["1.20,0",null,24,null,12,null,null,"00:01:20","00:00:24","00:00:12"]
["1.18,0",null,23.3,null,11.8,null,null,"00:01:18","00:00:23.300","00:00:11.800"]
["1.16,0",null,23,null,11.6,null,null,"00:01:16","00:00:23","00:00:11.600"]
["1.14,0",null,22.35,null,11.5,null,null,"00:01:14","00:00:22.350","00:00:11.500"]
["1.12,0",null,22.1,null,11.4,null,null,"00:01:12","00:00:22.100","00:00:11.400"]
["1.10,0",null,21.45,null,11.3,null,null,"00:01:10","00:00:21.450","00:00:11.300"]
["1.08,0",null,21.2,null,11.2,null,null,"00:01:08","00:00:21.200","00:00:11.200"]
["1.06,0",null,21,null,11.1,null,null,"00:01:06","00:00:21","00:00:11.100"]
["1.04,0","1:04.00",20.399999999999999,null,11,null,null,"00:01:04","00:00:20.400","00:00:11"]
["1.02,0","1:02.00",20.2,null,10.9,null,null,"00:01:02","00:00:20.200","00:00:10.900"]
["1.00,0","1:00.00",20,null,10.8,null,null,"00:01:00","00:00:20","00:00:10.800"]
[59,"59.00",19.399999999999999,null,10.7,null,null,"00:00:59","00:00:19.400","00:00:10.700"]
[58,"58.00",19.2,null,10.6,null,null,"00:00:58","00:00:19.200","00:00:10.600"]
[57,"57.00",19,null,10.5,null,null,"00:00:57","00:00:19","00:00:10.500"]
[56,"56.00",18.399999999999999,null,10.4,null,null,"00:00:56","00:00:18.400","00:00:10.400"]
[55,"55.00",18.2,null,10.3,null,null,"00:00:55","00:00:18.200","00:00:10.300"]
[54,"54.00",18,null,10.199999999999999,null,null,"00:00:54","00:00:18","00:00:10.200"]
[53,"53.00",17.45,null,10.1,10.1,null,"00:00:53","00:00:17.450","00:00:10.100"]
[52,"52.00",17.3,null,10,10,null,"00:00:52","00:00:17.300","00:00:10"]
[51,"51.00",17.149999999999999,null,9.9,9.9,null,"00:00:51","00:00:17.150","00:00:09.900"]
[50,"50.00",17,null,9.8000000000000007,9.8000000000000007,null,"00:00:50","00:00:17","00:00:09.800"]
{"$rows_left_out":78}
{"sheet":"плавание (2)","index":2,"n_rows":102,"n_cols":2,"rows_kept":102,"cut":false,"hidden":true,"merged":[[0,1,1,1],[0,3,1,3]]}
["плавание","Очки"]
["25 м"]
[60.1,1]
[60.05,2]
[1.02,3]
[1,4]
[58,5]
[57,6]
[56,7]
[55,8]
[54,9]
[53,10]
[52,11]
[51,12]
[50,13]
[49,14]
[48,15]
[47,16]
[46,17]
[45,18]
[44.2,19]
[43.4,20]
[42.6,21]
[41.8,22]
[41,23]
[40.4,24]
[39.799999999999997,25]
[39.200000000000003,26]
[38.6,27]
[38,28]
{"$rows_left_out":73}
{"sheet":"отжимание (2)","index":3,"n_rows":102,"n_cols":19,"rows_kept":102,"cut":false,"hidden":true,"merged":[[0,1,1,1],[0,3,1,3]]}
["Стрельба ","Очки"]
["ВП\n5в\n"]
["-",1,null,null,null,null,null,null,null,null,null,null,null,null,null,null,null,null,1]
["-",2,null,null,null,null,null,null,null,null,null,null,null,null,null,null,null,null,2]
[1,3,null,null,null,null,null,null,null,null,null,null,null,null,null,null,null,null,3]
["-",4]
["-",5]
[2,6]
["-",7]
["-",8]
[3,9]
["-",10]
["-",11]
[4,12]
["-",13]
["-",14]
[5,15]
["-",16]
["-",17]
[6,18]
["-",19]
["-",20]
[7,21]
["-",22]
["-",23]
[8,24]
["-",25]
["-",26]
[9,27]
["-",28]
{"$rows_left_out":73}
{"sheet":"Стрельба (2)","index":4,"n_rows":102,"n_cols":19,"rows_kept":102,"cut":false,"hidden":true,"merged":[[0,3,1,3],[0,1,1,1]]}
["Стрельба ","Очки"]
["ВП\n5в\n"]
[1,1,null,null,null,null,null,null,null,null,null,null,null,null,null,null,null,null,1]
[2,2,null,null,null,null,null,null,null,null,null,null,null,null,null,null,null,null,2]
[3,3,null,null,null,null,null,null,null,null,null,null,null,null,null,null,null,null,3]
[4,4]
[5,5]
[6,6]
[7,7]
[8,8]
[9,9]
[10,10]
["-",11]
[11,12]
["-",13]
[12,14]
["-",15]
[13,16]
["-",17]
[14,18]
["-",19]
[15,20]
["-",21]
[16,22]
["-",23]
[17,24]
["-",25]
[18,26]
["-",27]
[19,28]
{"$rows_left_out":73}
{"sheet":"плавание","index":5,"n_rows":102,"n_cols":2,"rows_kept":102,"cut":false,"hidden":true,"merged":[[0,1,1,1],[0,3,1,3]]}
["плавание","Очки"]
["25 м"]
[60.1,1]
[60.05,2]
[1.02,3]
[1,4]
[58,5]
[57,6]
[56,7]
[55,8]
[54,9]
[53,10]
[52,11]
[51,12]
[50,13]
[49,14]
[48,15]
[47,16]
[46,17]
[45,18]
[44.2,19]
[43.4,20]
[42.6,21]
[41.8,22]
[41,23]
[40.4,24]
[39.799999999999997,25]
[39.200000000000003,26]
[38.6,27]
[38,28]
{"$rows_left_out":73}
{"sheet":"отжимание","index":6,"n_rows":102,"n_cols":19,"rows_kept":102,"cut":false,"hidden":true,"merged":[[0,1,1,1],[0,3,1,3]]}
["Стрельба ","Очки"]
["ВП\n5в\n"]
["-",1,null,null,null,null,null,null,null,null,null,null,null,null,null,null,null,null,1]
["-",2,null,null,null,null,null,null,null,null,null,null,null,null,null,null,null,null,2]
[1,3,null,null,null,null,null,null,null,null,null,null,null,null,null,null,null,null,3]
["-",4]
["-",5]
[2,6]
["-",7]
["-",8]
[3,9]
["-",10]
["-",11]
[4,12]
["-",13]
["-",14]
[5,15]
["-",16]
["-",17]
[6,18]
["-",19]
["-",20]
[7,21]
["-",22]
["-",23]
[8,24]
["-",25]
["-",26]
[9,27]
["-",28]
{"$rows_left_out":73}
{"sheet":"Стрельба","index":7,"n_rows":102,"n_cols":19,"rows_kept":102,"cut":false,"hidden":true,"merged":[[0,3,1,3],[0,1,1,1]]}
["Стрельба ","Очки"]
["ВП\n5в\n"]
[1,1,null,null,null,null,null,null,null,null,null,null,null,null,null,null,null,null,1]
[2,2,null,null,null,null,null,null,null,null,null,null,null,null,null,null,null,null,2]
[3,3,null,null,null,null,null,null,null,null,null,null,null,null,null,null,null,null,3]
[4,4]
[5,5]
[6,6]
[7,7]
[8,8]
[9,9]
[10,10]
["-",11]
[11,12]
["-",13]
[12,14]
["-",15]
[13,16]
["-",17]
[14,18]
["-",19]
[15,20]
["-",21]
[16,22]
["-",23]
[17,24]
["-",25]
[18,26]
["-",27]
[19,28]
{"$rows_left_out":72}