{"text_format":"1","workbook":"xlsx","n_sheets":3,"sheets":["base","итого","Лист5"],"not_rendered":{"charts":0,"images":0,"macros":1,"external_links":0,"defined_names":17,"comments":0,"pivot_tables":0},"unopened":[],"bounds":{"document_bytes":16777216,"sheet_cells":100000,"rows_first":2000,"rows_last":500,"rows_between":2000,"halvings":0,"cell_chars":16384,"cell_head_chars":4096},"cells_cut":0,"cells_raw":0,"read":"whole","date_system":"1900"}

{"sheet":"base","index":0,"n_rows":156,"n_cols":27,"rows_kept":156,"cut":false,"hidden":true,"merged":[]}
["Location","DC","Division","Distribyutor","Location Type","Brand","Sort","Pack","Size","тара","коэф-нт, гл","Срок годности","Оценка критичности продукта ","Тара","SAP-\ncode","Brand","Sort","Pack","Outer Pack","Size","SCU","Код","Завод - изготовитель"]
["Ivanovo DC","EAST",null,"Клиент + Город","distributor","BagBier","Angl El","Bottle",0.33,"Bottle0,4720",9.4E-2,180,"не критично",20,56948,"BagBier","BagBier","Bottle",20,0.47,{"$f":"CONCATENATE(P2,Q2,R2,S2,T2)","v":"BagBierBagBierBottle200,47"},{"$f":"O2","v":56948},"Ivanovo DC",null,"IRKUTSK",null,{"$f":"R2&T2&S2","v":"Bottle0,4720"}]
["Klin DC","WEST",null,null,"LC","Beck's","Arriva","Can",0.35499999999999998,"PET1,46",8.4000000000000005E-2,270,"КРИТИЧНО",24,47693,"BagBier","BagBier","PET",6,1.4,"BagBierBagBierPET61,4",47693,"Klin DC",null,"KHABAROVSK",null,"PET1,46"]
["Omsk DC",null,null,null,null,"Boddington's","BagBier","PET",0.44,"PET2,36",0.13800000000000001,365,null,"6*4",47694,"BagBier","BagBier","PET",6,2.2999999999999998,"BagBierBagBierPET62,3",47694,"Kursk DC",null,"IRKUTSK",null,"PET2,36"]
["Volzhsky DC",null,null,null,null,"Brahma","Bavarskoe","Keg",0.47,"Bottle0,3324",7.9200000000000007E-2,540,null,6,47212,"BagBier","Golden","PET",6,1.4,"BagBierGoldenPET61,4",47212,"Novocheboksarsk DC",null,"KHABAROVSK",null,"PET1,46"]
["Saransk DC",null,null,null,null,"Bud","Blonde",null,0.5,"Can0,56*4",0.12,null,null,4,47696,"BagBier","Golden","PET",6,2.2999999999999998,"BagBierGoldenPET62,3",47696,"Omsk DC",null,"KHABAROVSK",null,"PET2,36"]
[null,null,null,null,null,"Chernigovskoe","Blue Non Alc",null,0.75,"Bottle0,520",0.1,null,null,2,38074,"Beck's","Blue Non Alc","Bottle",24,0.33,"Beck'sBlue Non AlcBottle240,33",38074,"Perm DC",null,"KHABAROVSK",null,"Bottle0,3324"]
[null,null,null,null,null,"Corona","Brahma",null,0.95,"Bottle0,56",0.03,null,null,12,6199,"Boddington's","Pub Ale","Can","6*4",0.5,"Boddington'sPub AleCan6*40,5",6199,"Volzhsky DC",null,"KHABAROVSK",null,"Can0,56*4"]
[null,null,null,null,null,"Dao","Brune",null,1,"Bottle0,7512",0.09,null,null,null,48823,"Brahma","Brahma","Bottle",20,0.5,"BrahmaBrahmaBottle200,5",48823,"Saransk DC",null,"IRKUTSK",null,"Bottle0,520"]
[null,null,null,null,null,"Franziskaner","Bud",null,1.4,"Can0,56",0.03,null,null,null,31478,"Bud","Bud","Bottle",24,0.33,"BudBudBottle240,33",31478,"Angarsk DC",null,"KHABAROVSK",null,"Bottle0,3324"]
[null,null,null,null,null,"Hoegaarden","Classicheskoe",null,1.5,"Can0,524",0.12,null,null,null,49292,"Bud","Bud","Bottle",20,0.5,"BudBudBottle200,5",49292,null,null,"KHABAROVSK",null,"Bottle0,520"]
[null,null,null,null,null,"Klinskoe","Dao",null,1.9,"Can0,54",0.02,null,null,null,49553,"Bud","Bud","Bottle",6,0.5,"BudBudBottle60,5",49553,null,null,"KHABAROVSK",null,"Bottle0,56"]
[null,null,null,null,null,"Leffe","Dobroe",null,2.2999999999999998,"Can0,756",4.4999999999999998E-2,null,null,null,47354,"Bud","Bud","Bottle",12,0.75,"BudBudBottle120,75",47354,null,null,"KRASNOYARSK",null,"Bottle0,7512"]
[null,null,null,null,null,"Lowenbrau","Dunkel",null,2.5,"PET0,9512",0.114,null,null,null,31687,"Bud","Bud","Can",6,0.5,"BudBudCan60,5",31687,null,null,"IRKUTSK",null,"Can0,56"]
[null,null,null,null,null,"Pikur","Extra",null,null,"PET1,96",0.114,null,null,null,58640,"Bud","Bud","Can","6*4",0.5,"BudBudCan6*40,5",58640,null,null,"KHABAROVSK",null,"Can0,56*4"]
[null,null,null,null,null,"Rifei","Golden",null,null,"Bottle0,35524",8.5199999999999998E-2,null,null,null,56030,"Bud","Bud","Can",24,0.5,"BudBudCan240,5",56030,null,null,"IRKUTSK",null,"Can0,524"]
[null,null,null,null,null,"Sib.Korona","Hell",null,null,"Can0,336*4",7.9200000000000007E-2,null,null,null,47161,"Bud","Bud","Can",4,0.5,"BudBudCan40,5",47161,null,null,"IRKUTSK",null,"Can0,54"]
[null,null,null,null,null,"Spaten","Khmelnoe",null,null,"Bottle0,54",0.02,null,null,null,45461,"Bud","Bud","Can",6,0.75,"BudBudCan60,75",45461,null,null,"IRKUTSK",null,"Can0,756"]
[null,null,null,null,null,"Staropramen","Krepkoe",null,null,"Can16",0.06,null,null,null,48879,"Bud","Non Alc","Bottle",24,0.33,"BudNon AlcBottle240,33",48879,null,null,"KRASNOYARSK",null,"Bottle0,3324"]
[null,null,null,null,null,"Stella Artois","Lime",null,null,"PET112",0.12,null,null,null,44309,"Bud","Non Alc","Can",6,0.5,"BudNon AlcCan60,5",44309,null,null,"KRASNOYARSK",null,"Can0,56"]
[null,null,null,null,null,"T","Mix Apple",null,null,"PET12",0.02,null,null,null,59141,"Bud","Non Alc","Can",24,0.5,"BudNon AlcCan240,5",59141,null,null,"KRASNOYARSK",null,"Can0,524"]
[null,null,null,null,null,"Tinkoff","Mix Lem",null,null,"PET1,56",0.09,null,null,null,49788,"Chernigovskoe","Svetloe","Bottle",20,0.47,"ChernigovskoeSvetloeBottle200,47",49788,null,null,"KRASNOYARSK",null,"Bottle0,4720"]
[null,null,null,null,null,"Tolstiak","Mun Dark",null,null,"PET2,56",0.15,null,null,null,50458,"Chernigovskoe","Svetloe","PET",12,0.95,"ChernigovskoeSvetloePET120,95",50458,null,null,"KRASNOYARSK",null,"PET0,9512"]
[null,null,null,null,null,"Volzhanin","Non Alc",null,null,"Can0,520",0.1,null,null,null,58593,"Chernigovskoe","Svetloe","PET",6,1.4,"ChernigovskoeSvetloePET61,4",58593,null,null,null,null,"PET1,46"]
[null,null,null,null,null,"Zhigulevskoe","Original",null,null,"Bottle0,756",4.4999999999999998E-2,null,null,null,49818,"Chernigovskoe","Svetloe","PET",6,1.9,"ChernigovskoeSvetloePET61,9",49818,null,null,null,null,"PET1,96"]
[null,null,null,null,null,"Zolotaya Angara","Pub Ale",null,null,"Bottle0,4420",8.7999999999999995E-2,null,null,null,44667,"Corona","Extra","Bottle",24,0.35499999999999998,"CoronaExtraBottle240,355",44667,null,null,null,null,"Bottle0,35524"]
[null,null,null,null,null,null,"Rzganoe El",null,null,null,null,null,null,null,44977,"Dao","Dao","Bottle",20,0.5,"DaoDaoBottle200,5",44977,null,null,null,null,"Bottle0,520"]
[null,null,null,null,null,null,"Staropramen",null,null,null,null,null,null,null,44499,"Franziskaner","Weissbier","Bottle",20,0.5,"FranziskanerWeissbierBottle200,5",44499,null,null,null,null,"Bottle0,520"]
[null,null,null,null,null,null,"Stella Artois",null,null,null,null,null,null,null,47305,"Franziskaner","Weissbier","Can",24,0.5,"FranziskanerWeissbierCan240,5",47305,null,null,null,null,"Can0,524"]
[null,null,null,null,null,null,"Stout",null,null,null,null,null,null,null,45435,"Hoegaarden","Non Alc","Can","6*4",0.33,"HoegaardenNon AlcCan6*40,33",45435,null,null,null,null,"Can0,336*4"]
[null,null,null,null,null,null,"Svetloe",null,null,null,null,null,null,null,45570,"Hoegaarden","White","Bottle",20,0.5,"HoegaardenWhiteBottle200,5",45570,null,null,null,null,"Bottle0,520"]
[null,null,null,null,null,null,"Svetloe El",null,null,null,null,null,null,null,15876,"Hoegaarden","White","Bottle",4,0.5,"HoegaardenWhiteBottle40,5",15876,null,null,null,null,"Bottle0,54"]
[null,null,null,null,null,null,"T",null,null,null,null,null,null,null,47351,"Hoegaarden","White","Bottle",12,0.75,"HoegaardenWhiteBottle120,75",47351,null,null,null,null,"Bottle0,7512"]
[null,null,null,null,null,null,"T 9",null,null,null,null,null,null,null,44816,"Hoegaarden","White","Can",6,0.5,{"$f":"CONCATENATE(P34,Q34,R34,S34,T34)","v":"HoegaardenWhiteCan60,5"},{"$f":"O34","v":44816},null,null,null,null,{"$f":"R34&T34&S34","v":"Can0,56"}]
[null,null,null,null,null,null,"Three Hops",null,null,null,null,null,null,null,58657,"Hoegaarden","White","Can","6*4",0.5,"HoegaardenWhiteCan6*40,5",58657,null,null,null,null,"Can0,56*4"]
[null,null,null,null,null,null,"Ultra",null,null,null,null,null,null,null,47204,"Hoegaarden","White","Can",24,0.5,"HoegaardenWhiteCan240,5",47204,null,null,null,null,"Can0,524"]
[null,null,null,null,null,null,"Uralskoe",null,null,null,null,null,null,null,47146,"Hoegaarden","White","Can",4,0.5,"HoegaardenWhiteCan40,5",47146,null,null,null,null,"Can0,54"]
[null,null,null,null,null,null,"Weissbier",null,null,null,null,null,null,null,18831,"Klinskoe","Arriva","Bottle",20,0.5,"KlinskoeArrivaBottle200,5",18831,null,null,null,null,"Bottle0,520"]
[null,null,null,null,null,null,"Wheat Ale",null,null,null,null,null,null,null,44777,"Klinskoe","Arriva","Can",6,0.5,"KlinskoeArrivaCan60,5",44777,null,null,null,null,"Can0,56"]
[null,null,null,null,null,null,"White",null,null,null,null,null,null,null,45808,"Klinskoe","Mix Apple","Bottle",20,0.5,"KlinskoeMix AppleBottle200,5",45808,null,null,null,null,"Bottle0,520"]
{"$rows_left_out":117}
{"sheet":"итого","index":1,"n_rows":707,"n_cols":4,"rows_kept":707,"cut":false,"hidden":false,"merged":[]}
[47689,"пиво1",null,"2016-01-01"]
[47689,"пиво2",null,"2016-01-02"]
[47689,"пиво3",null,"2016-01-03"]
[47689,"пиво4",null,"2016-01-04"]
[47689,"пиво5",null,"2016-01-05"]
[55744,"пиво6",null,"2016-01-06"]
[55744,"пиво7",null,"2016-01-07"]
[55744,"пиво8",null,"2016-01-08"]
[55744,"пиво9",null,"2016-01-09"]
[55744,"пиво10",null,"2016-01-10"]
["36890\\48318","пиво11",null,"2016-01-11"]
["36890\\48318","пиво12",null,"2016-01-12"]
["36890\\48318","пиво13",null,"2016-01-13"]
["36890\\48318","пиво14",null,"2016-01-14"]
["36890\\48318","пиво15",null,"2016-01-15"]
[55342,"пиво16",null,"2016-01-16"]
[55342,"пиво17",null,"2016-01-17"]
[55342,"пиво18",null,"2016-01-18"]
[55342,"пиво19",null,"2016-01-19"]
[55342,"пиво20",null,"2016-01-20"]
["35720\\47691","пиво21",null,"2016-01-21"]
["35720\\47691","пиво22",null,"2016-01-22"]
["35720\\47691","пиво23",null,"2016-01-23"]
["35720\\47691","пиво24",null,"2016-01-24"]
["35720\\47691","пиво25",null,"2016-01-25"]
["35721\\55745","пиво26",null,"2016-01-26"]
["35721\\55745","пиво27",null,"2016-01-27"]
["35721\\55745","пиво28",null,"2016-01-28"]
["35721\\55745","пиво29",null,"2016-01-29"]
["35721\\55745","пиво30",null,"2016-01-30"]
["36255\\47239","пиво31",null,"2016-01-31"]
["36255\\47239","пиво32",null,"2016-02-01"]
["36255\\47239","пиво33",null,"2016-02-02"]
["36255\\47239","пиво34",null,"2016-02-03"]
["36255\\47239","пиво35",null,"2016-02-04"]
["36256\\47240","пиво36",null,"2016-02-05"]
["36256\\47240","пиво37",null,"2016-02-06"]
["36256\\47240","пиво38",null,"2016-02-07"]
["36256\\47240","пиво39",null,"2016-02-08"]
["36256\\47240","пиво40",null,"2016-02-09"]
{"$rows_left_out":668}
{"sheet":"Лист5","index":2,"n_rows":710,"n_cols":9,"rows_kept":710,"cut":false,"hidden":false,"merged":[]}
["1431\\56948","BagBier","BagBier","Bottle",20,0.47,365,null,{"$f":"IFERROR(INDEX(итого!$D$1:$D$707,SMALL(IF(Лист5!$A1=итого!$A$1:$A$707,ROW(итого!$D$1:$D$707)),COUNTIF($A$1:A1,A1))),\"\")","v":"2017-04-15"}]
["1431\\56948","BagBier","BagBier","Bottle",20,0.47,365,null,{"$f":"IFERROR(INDEX(итого!$D$1:$D$707,SMALL(IF(Лист5!$A2=итого!$A$1:$A$707,ROW(итого!$D$1:$D$707)),COUNTIF($A$1:A2,A2))),\"\")","v":"2017-04-16"}]
["1431\\56948","BagBier","BagBier","Bottle",20,0.47,365,null,{"$f":"IFERROR(INDEX(итого!$D$1:$D$707,SMALL(IF(Лист5!$A3=итого!$A$1:$A$707,ROW(итого!$D$1:$D$707)),COUNTIF($A$1:A3,A3))),\"\")","v":""}]
["1431\\56948","BagBier","BagBier","Bottle",20,0.47,365,null,{"$f":"IFERROR(INDEX(итого!$D$1:$D$707,SMALL(IF(Лист5!$A4=итого!$A$1:$A$707,ROW(итого!$D$1:$D$707)),COUNTIF($A$1:A4,A4))),\"\")","v":""}]
["1431\\56948","BagBier","BagBier","Bottle",20,0.47,365,null,{"$f":"IFERROR(INDEX(итого!$D$1:$D$707,SMALL(IF(Лист5!$A5=итого!$A$1:$A$707,ROW(итого!$D$1:$D$707)),COUNTIF($A$1:A5,A5))),\"\")","v":""}]
["35724\\47693","BagBier","BagBier","PET",6,1.4,180,null,{"$f":"IFERROR(INDEX(итого!$D$1:$D$707,SMALL(IF(Лист5!$A6=итого!$A$1:$A$707,ROW(итого!$D$1:$D$707)),COUNTIF($A$1:A6,A6))),\"\")","v":"2017-04-17"}]
["35724\\47693","BagBier","BagBier","PET",6,1.4,180,null,{"$f":"IFERROR(INDEX(итого!$D$1:$D$707,SMALL(IF(Лист5!$A7=итого!$A$1:$A$707,ROW(итого!$D$1:$D$707)),COUNTIF($A$1:A7,A7))),\"\")","v":"2017-04-18"}]
["35724\\47693","BagBier","BagBier","PET",6,1.4,180,null,{"$f":"IFERROR(INDEX(итого!$D$1:$D$707,SMALL(IF(Лист5!$A8=итого!$A$1:$A$707,ROW(итого!$D$1:$D$707)),COUNTIF($A$1:A8,A8))),\"\")","v":"2017-04-19"}]
["35724\\47693","BagBier","BagBier","PET",6,1.4,180,null,{"$f":"IFERROR(INDEX(итого!$D$1:$D$707,SMALL(IF(Лист5!$A9=итого!$A$1:$A$707,ROW(итого!$D$1:$D$707)),COUNTIF($A$1:A9,A9))),\"\")","v":"2017-04-20"}]
["35724\\47693","BagBier","BagBier","PET",6,1.4,180,null,{"$f":"IFERROR(INDEX(итого!$D$1:$D$707,SMALL(IF(Лист5!$A10=итого!$A$1:$A$707,ROW(итого!$D$1:$D$707)),COUNTIF($A$1:A10,A10))),\"\")","v":"2017-04-21"}]
["35726\\47694","BagBier","BagBier","PET",6,2.2999999999999998,180,null,{"$f":"IFERROR(INDEX(итого!$D$1:$D$707,SMALL(IF(Лист5!$A11=итого!$A$1:$A$707,ROW(итого!$D$1:$D$707)),COUNTIF($A$1:A11,A11))),\"\")","v":"2017-04-22"}]
["35726\\47694","BagBier","BagBier","PET",6,2.2999999999999998,180,null,{"$f":"IFERROR(INDEX(итого!$D$1:$D$707,SMALL(IF(Лист5!$A12=итого!$A$1:$A$707,ROW(итого!$D$1:$D$707)),COUNTIF($A$1:A12,A12))),\"\")","v":"2017-04-23"}]
["35726\\47694","BagBier","BagBier","PET",6,2.2999999999999998,180,null,{"$f":"IFERROR(INDEX(итого!$D$1:$D$707,SMALL(IF(Лист5!$A13=итого!$A$1:$A$707,ROW(итого!$D$1:$D$707)),COUNTIF($A$1:A13,A13))),\"\")","v":"2017-04-24"}]
["35726\\47694","BagBier","BagBier","PET",6,2.2999999999999998,180,null,{"$f":"IFERROR(INDEX(итого!$D$1:$D$707,SMALL(IF(Лист5!$A14=итого!$A$1:$A$707,ROW(итого!$D$1:$D$707)),COUNTIF($A$1:A14,A14))),\"\")","v":"2017-04-25"}]
["35726\\47694","BagBier","BagBier","PET",6,2.2999999999999998,180,null,{"$f":"IFERROR(INDEX(итого!$D$1:$D$707,SMALL(IF(Лист5!$A15=итого!$A$1:$A$707,ROW(итого!$D$1:$D$707)),COUNTIF($A$1:A15,A15))),\"\")","v":"2017-04-26"}]
["35719\\47212","BagBier","Golden","PET",6,1.4,180,null,{"$f":"IFERROR(INDEX(итого!$D$1:$D$707,SMALL(IF(Лист5!$A16=итого!$A$1:$A$707,ROW(итого!$D$1:$D$707)),COUNTIF($A$1:A16,A16))),\"\")","v":"2017-04-27"}]
["35719\\47212","BagBier","Golden","PET",6,1.4,180,null,{"$f":"IFERROR(INDEX(итого!$D$1:$D$707,SMALL(IF(Лист5!$A17=итого!$A$1:$A$707,ROW(итого!$D$1:$D$707)),COUNTIF($A$1:A17,A17))),\"\")","v":"2017-04-28"}]
["35719\\47212","BagBier","Golden","PET",6,1.4,180,null,{"$f":"IFERROR(INDEX(итого!$D$1:$D$707,SMALL(IF(Лист5!$A18=итого!$A$1:$A$707,ROW(итого!$D$1:$D$707)),COUNTIF($A$1:A18,A18))),\"\")","v":"2017-04-29"}]
["35719\\47212","BagBier","Golden","PET",6,1.4,180,null,{"$f":"IFERROR(INDEX(итого!$D$1:$D$707,SMALL(IF(Лист5!$A19=итого!$A$1:$A$707,ROW(итого!$D$1:$D$707)),COUNTIF($A$1:A19,A19))),\"\")","v":"2017-04-30"}]
["35719\\47212","BagBier","Golden","PET",6,1.4,180,null,{"$f":"IFERROR(INDEX(итого!$D$1:$D$707,SMALL(IF(Лист5!$A20=итого!$A$1:$A$707,ROW(итого!$D$1:$D$707)),COUNTIF($A$1:A20,A20))),\"\")","v":"2017-05-01"}]
["35880\\47696","BagBier","Golden","PET",6,2.2999999999999998,180,null,{"$f":"IFERROR(INDEX(итого!$D$1:$D$707,SMALL(IF(Лист5!$A21=итого!$A$1:$A$707,ROW(итого!$D$1:$D$707)),COUNTIF($A$1:A21,A21))),\"\")","v":"2017-05-02"}]
["35880\\47696","BagBier","Golden","PET",6,2.2999999999999998,180,null,{"$f":"IFERROR(INDEX(итого!$D$1:$D$707,SMALL(IF(Лист5!$A22=итого!$A$1:$A$707,ROW(итого!$D$1:$D$707)),COUNTIF($A$1:A22,A22))),\"\")","v":"2017-05-03"}]
["35880\\47696","BagBier","Golden","PET",6,2.2999999999999998,180,null,{"$f":"IFERROR(INDEX(итого!$D$1:$D$707,SMALL(IF(Лист5!$A23=итого!$A$1:$A$707,ROW(итого!$D$1:$D$707)),COUNTIF($A$1:A23,A23))),\"\")","v":"2017-05-04"}]
["35880\\47696","BagBier","Golden","PET",6,2.2999999999999998,180,null,{"$f":"IFERROR(INDEX(итого!$D$1:$D$707,SMALL(IF(Лист5!$A24=итого!$A$1:$A$707,ROW(итого!$D$1:$D$707)),COUNTIF($A$1:A24,A24))),\"\")","v":"2017-05-05"}]
["35880\\47696","BagBier","Golden","PET",6,2.2999999999999998,180,null,{"$f":"IFERROR(INDEX(итого!$D$1:$D$707,SMALL(IF(Лист5!$A25=итого!$A$1:$A$707,ROW(итого!$D$1:$D$707)),COUNTIF($A$1:A25,A25))),\"\")","v":"2017-05-06"}]
[38074,"Beck's","Blue Non Alc","Bottle",24,0.33,365,null,{"$f":"IFERROR(INDEX(итого!$D$1:$D$707,SMALL(IF(Лист5!$A26=итого!$A$1:$A$707,ROW(итого!$D$1:$D$707)),COUNTIF($A$1:A26,A26))),\"\")","v":"2017-05-07"}]
[38074,"Beck's","Blue Non Alc","Bottle",24,0.33,365,null,{"$f":"IFERROR(INDEX(итого!$D$1:$D$707,SMALL(IF(Лист5!$A27=итого!$A$1:$A$707,ROW(итого!$D$1:$D$707)),COUNTIF($A$1:A27,A27))),\"\")","v":"2017-05-08"}]
[38074,"Beck's","Blue Non Alc","Bottle",24,0.33,365,null,{"$f":"IFERROR(INDEX(итого!$D$1:$D$707,SMALL(IF(Лист5!$A28=итого!$A$1:$A$707,ROW(итого!$D$1:$D$707)),COUNTIF($A$1:A28,A28))),\"\")","v":"2017-05-09"}]
[38074,"Beck's","Blue Non Alc","Bottle",24,0.33,365,null,{"$f":"IFERROR(INDEX(итого!$D$1:$D$707,SMALL(IF(Лист5!$A29=итого!$A$1:$A$707,ROW(итого!$D$1:$D$707)),COUNTIF($A$1:A29,A29))),\"\")","v":"2017-05-10"}]
[38074,"Beck's","Blue Non Alc","Bottle",24,0.33,365,null,{"$f":"IFERROR(INDEX(итого!$D$1:$D$707,SMALL(IF(Лист5!$A30=итого!$A$1:$A$707,ROW(итого!$D$1:$D$707)),COUNTIF($A$1:A30,A30))),\"\")","v":"2017-05-11"}]
[6199,"Boddington's","Pub Ale","Can","6*4",0.5,365,null,{"$f":"IFERROR(INDEX(итого!$D$1:$D$707,SMALL(IF(Лист5!$A31=итого!$A$1:$A$707,ROW(итого!$D$1:$D$707)),COUNTIF($A$1:A31,A31))),\"\")","v":"2017-05-12"}]
[6199,"Boddington's","Pub Ale","Can","6*4",0.5,365,null,{"$f":"IFERROR(INDEX(итого!$D$1:$D$707,SMALL(IF(Лист5!$A32=итого!$A$1:$A$707,ROW(итого!$D$1:$D$707)),COUNTIF($A$1:A32,A32))),\"\")","v":"2017-05-13"}]
[6199,"Boddington's","Pub Ale","Can","6*4",0.5,365,null,{"$f":"IFERROR(INDEX(итого!$D$1:$D$707,SMALL(IF(Лист5!$A33=итого!$A$1:$A$707,ROW(итого!$D$1:$D$707)),COUNTIF($A$1:A33,A33))),\"\")","v":"2017-05-14"}]
[6199,"Boddington's","Pub Ale","Can","6*4",0.5,365,null,{"$f":"IFERROR(INDEX(итого!$D$1:$D$707,SMALL(IF(Лист5!$A34=итого!$A$1:$A$707,ROW(итого!$D$1:$D$707)),COUNTIF($A$1:A34,A34))),\"\")","v":"2017-05-15"}]
[6199,"Boddington's","Pub Ale","Can","6*4",0.5,365,null,{"$f":"IFERROR(INDEX(итого!$D$1:$D$707,SMALL(IF(Лист5!$A35=итого!$A$1:$A$707,ROW(итого!$D$1:$D$707)),COUNTIF($A$1:A35,A35))),\"\")","v":"2017-05-16"}]
["7888\\48823","Brahma","Brahma","Bottle",20,0.5,365,null,{"$f":"IFERROR(INDEX(итого!$D$1:$D$707,SMALL(IF(Лист5!$A36=итого!$A$1:$A$707,ROW(итого!$D$1:$D$707)),COUNTIF($A$1:A36,A36))),\"\")","v":"2017-05-17"}]
["7888\\48823","Brahma","Brahma","Bottle",20,0.5,365,null,{"$f":"IFERROR(INDEX(итого!$D$1:$D$707,SMALL(IF(Лист5!$A37=итого!$A$1:$A$707,ROW(итого!$D$1:$D$707)),COUNTIF($A$1:A37,A37))),\"\")","v":"2017-05-18"}]
["7888\\48823","Brahma","Brahma","Bottle",20,0.5,365,null,{"$f":"IFERROR(INDEX(итого!$D$1:$D$707,SMALL(IF(Лист5!$A38=итого!$A$1:$A$707,ROW(итого!$D$1:$D$707)),COUNTIF($A$1:A38,A38))),\"\")","v":"2017-05-19"}]
["7888\\48823","Brahma","Brahma","Bottle",20,0.5,365,null,{"$f":"IFERROR(INDEX(итого!$D$1:$D$707,SMALL(IF(Лист5!$A39=итого!$A$1:$A$707,ROW(итого!$D$1:$D$707)),COUNTIF($A$1:A39,A39))),\"\")","v":"2017-05-20"}]
["7888\\48823","Brahma","Brahma","Bottle",20,0.5,365,null,{"$f":"IFERROR(INDEX(итого!$D$1:$D$707,SMALL(IF(Лист5!$A40=итого!$A$1:$A$707,ROW(итого!$D$1:$D$707)),COUNTIF($A$1:A40,A40))),\"\")","v":"2017-05-21"}]
{"$rows_left_out":670}