{"text_format":"1","workbook":"xlsx","n_sheets":3,"sheets":["Лист1","Бланк Заявки","Список ЮрЛиц"],"not_rendered":{"charts":0,"images":0,"macros":1,"external_links":0,"defined_names":5,"comments":0,"pivot_tables":0},"unopened":[],"bounds":{"document_bytes":16777216,"sheet_cells":100000,"rows_first":2000,"rows_last":500,"rows_between":2000,"halvings":0,"cell_chars":16384,"cell_head_chars":4096},"cells_cut":0,"cells_raw":0,"read":"whole","date_system":"1900"}

{"sheet":"Лист1","index":0,"n_rows":39,"n_cols":4,"rows_kept":39,"cut":false,"hidden":true,"merged":[]}
["Структура XLS файла с исходными данными для формирования ЗКР по талантливой молодежи"]
[]
["Наименование поля","Описание","Тип","Длина"]
["№ п.п","Порядковый нр записи в файле","NUMBER",4]
["Код региона","Код субъекта Российской Федерации по классификатору МФ РФ","STRING",2]
["Регион","Наименование субъекта Российской Федерации","STRING *","<= 160"]
["Мнемокод","10 первых символов Ф.И.О.","STRING",10]
["Ф.И.О","Фамилия Имя Отчество (полностью)","STRING","r_sh 160"]
["Дата рождения","Дата рождения в формате ДД.ММ.ГГГГ","DATE *","= 10"]
["ИНН","Идентификационный номер налогоплательщика","STRING ***",{"$f":" 12","v":12}]
["Пол","0 - мужской, 1 - женский","NUMBER","= 1"]
["Адрес   ","Индекс, Область/Край, Район, Населенный пункт, улица, дом, корпус, квартира.","STRING","<= 160"]
["Счет","Расчетный счет (номер счета сберегательной книжки) или Расчетный счет банка и через \"/\" номер банковской карты получателя","STRING **","<50"]
["Отделение банка","Наименование Отделения банковского учреждения (Сберегательного Банка России)","STRING","<=160"]
["БИК","БИК банковского учреждения","STRING","= 9"]
["КорСчет","Корреспондентский счет банковского учреждения","STRING *","= 20"]
["№ приказа","Номер приказа","STRING","<=15"]
["Дата приказа","Дата приказа в формате ДД.ММ.ГГГГ","DATE","=10"]
["№ п/п раздела приказа","Порядковый номер раздела приказа","STRING","<=3"]
["№ п/п строки в разделе приказа","Порядковый номер строки в разделе приказа","STRING","<=5"]
["Сумма выплаты","Сумма выплаты в рублях","NUMBER","<=11"]
["Полное наименование банка","Наименование  банковского учреждения (Сберегательного Банка России).( Наим по БИК + наим отделения + Адрес по БИК)","STRING*","<=200"]
["Примечание:"]
["*  отмечены необязательные для заполнения поля"]
["**  если длина расчетного счета превышает 20 рз.следующие за 20 рз отделяются знаком \"/\""]
["*** если ИНН нет поле пустое"]
["**** если отделение имеет автономный БИК поле не заполняется"]
["Порядок формирования имени файла"]
["рз 1-3 "]
["Pob - победители"]
["Prz -  призеры"]
["рз 4-6"]
["последние 3рз №Приказа (дополняются ведущими нулями, если кол цифр меньше 3)"]
["рз 7-8"]
["порядковый нр файла  с начала года (дополняются ведущими нулями, если кол цифр меньше 2)"]
[]
["Пример:"]
["Pob60101.xls"]
["Prz60121.xls"]

{"sheet":"Бланк Заявки","index":1,"n_rows":20,"n_cols":6,"rows_kept":20,"cut":false,"hidden":false,"merged":[[9,1,10,6],[11,1,12,3],[11,5,11,6],[12,5,12,6],[18,0,18,2],[1,1,1,4],[13,0,13,1],[14,0,14,1],[13,2,14,6],[15,1,15,6],[3,5,3,6],[4,5,4,6],[5,5,5,6],[6,1,6,6],[3,0,5,1],[16,0,16,6],[17,0,17,2],[17,3,17,6],[7,1,7,6],[8,1,8,6]]}
[]
["Бренд","бренд 1"]
[]
["Заявка на поездку водителю - курьеру",null,null,null,null,"Альт. доставка:"]
[null,null,null,null,null,"(стоимость на аутсорсе)"]
[null,null,null,null,null,{"$f":"VLOOKUP(B2,'Список ЮрЛиц'!$A$2:$E$78,4)","v":101}]
["Дата выполнения    ","__.__.17"]
["Название организации (юридическое)",{"$f":"VLOOKUP(B2,'Список ЮрЛиц'!$A$2:$C$78,3)","v":"Юрлицо 1"}]
["Время работы: ",{"$f":"VLOOKUP(B2,'Список ЮрЛиц'!$A$2:$E$78,5)","v":"С 09:00 до 18:00"}]
["Адрес:    "]
["(точный адрес организации, как добраться)"]
["Задание: ",null,null,null,"Вес (кг)","Объем:"]
["(что и сколько везём)",null,null,null,"__","__х__х__см"]
["Документы для выполнения задания: "]
[]
["Контактное лицо, телефон: "]
["Комментарии: "]
["По вопросам обращаться:",null,null,"Контактный телефон:"]
["Схема проезда"]
["Сюда вставляется картинка"]

{"sheet":"Список ЮрЛиц","index":2,"n_rows":174,"n_cols":7,"rows_kept":174,"cut":false,"hidden":false,"merged":[]}
["Бренд",null,"ЮрЛицо (по счету)","стоимость альт доставки","время работы","Адрес","схема проезда"]
["бренд 1",null,"Юрлицо 1",101,"С 09:00 до 18:00",null,"C:\\Temp\\MyPicture.jpg"]
["бренд 2",null,"Юрлицо 2",102,"С 09:00 до 18:00"]
["бренд 3",null,"Юрлицо 3",103,"С 09:00 до 18:00"]
["бренд 4",null,"Юрлицо 4",104,"С 09:00 до 18:00"]
["бренд 5",null,"Юрлицо 5",105,"С 09:00 до 18:00"]
["бренд 6",null,"Юрлицо 6",106,"С 09:00 до 18:00"]
["бренд 7",null,"Юрлицо 7",107,"С 09:00 до 18:00"]
["бренд 8",null,"Юрлицо 8",108,"С 09:00 до 18:00"]
["бренд 9",null,"Юрлицо 9",109,"С 09:00 до 18:00"]
["бренд 10",null,"Юрлицо 10",110,"С 09:00 до 18:00"]
[null,null,null,null,"С 09:00 до 18:00"]
[null,null,null,null,"С 09:00 до 18:00"]
[null,null,null,null,"С 09:00 до 18:00"]
[null,null,null,null,"С 09:00 до 18:00"]
[null,null,null,null,"С 09:00 до 18:00"]
[null,null,null,null,"С 09:00 до 18:00"]
[null,null,null,null,"С 09:00 до 18:00"]
[null,null,null,null,"С 09:00 до 18:00"]
[null,null,null,null,"С 09:00 до 18:00"]
[null,null,null,null,"С 09:00 до 18:00"]
[null,null,null,null,"С 09:00 до 18:00"]
[null,null,null,null,"С 09:00 до 18:00"]
[null,null,null,null,"С 09:00 до 18:00"]
[null,null,null,null,"С 09:00 до 18:00"]
[null,null,null,null,"С 09:00 до 18:00"]
[null,null,null,null,"С 09:00 до 18:00"]
[null,null,null,null,"С 09:00 до 18:00"]
[null,null,null,null,"С 09:00 до 18:00"]
[null,null,null,null,"С 09:00 до 18:00"]
[null,null,null,null,"С 09:00 до 18:00"]
[null,null,null,null,"С 09:00 до 18:00"]
[null,null,null,null,"С 09:00 до 18:00"]
[null,null,null,null,"С 09:00 до 18:00"]
[null,null,null,null,"С 09:00 до 18:00"]
[null,null,null,null,"С 09:00 до 18:00"]
[null,null,null,null,"С 09:00 до 18:00"]
[null,null,null,null,"С 09:00 до 18:00"]
[null,null,null,null,"С 09:00 до 18:00"]
[null,null,null,null,"С 09:00 до 18:00"]
[null,null,null,null,"С 09:00 до 18:00"]
[null,null,null,null,"С 09:00 до 18:00"]
[null,null,null,null,"С 09:00 до 18:00"]
[null,null,null,null,"С 09:00 до 18:00"]
[null,null,null,null,"С 09:00 до 18:00"]
[null,null,null,null,"С 09:00 до 18:00"]
[null,null,null,null,"С 09:00 до 18:00"]
[null,null,null,null,"С 09:00 до 18:00"]
[null,null,null,null,"С 09:00 до 18:00"]
[null,null,null,null,"С 09:00 до 18:00"]
[null,null,null,null,"С 09:00 до 18:00"]
[null,null,null,null,"С 09:00 до 18:00"]
[null,null,null,null,"С 09:00 до 18:00"]
[null,null,null,null,"С 09:00 до 18:00"]
[null,null,null,null,"С 09:00 до 18:00"]
[null,null,null,null,"С 09:00 до 18:00"]
[null,null,null,null,"С 09:00 до 18:00"]
[null,null,null,null,"С 09:00 до 18:00"]
[null,null,null,null,"С 09:00 до 18:00"]
[null,null,null,null,"С 09:00 до 18:00"]
[null,null,null,null,"С 09:00 до 18:00"]
[null,null,null,null,"С 09:00 до 18:00"]
[null,null,null,null,"С 09:00 до 18:00"]
[null,null,null,null,"С 09:00 до 18:00"]
[null,null,null,null,"С 09:00 до 18:00"]
[null,null,null,null,"С 09:00 до 18:00"]
[null,null,null,null,"С 09:00 до 18:00"]
[null,null,null,null,"С 09:00 до 18:00"]
[null,null,null,null,"С 09:00 до 18:00"]
[null,null,null,null,"С 09:00 до 18:00"]
[null,null,null,null,"С 09:00 до 18:00"]
[null,null,null,null,"С 09:00 до 18:00"]
[null,null,null,null,"С 09:00 до 18:00"]
[null,null,null,null,"С 09:00 до 18:00"]
[null,null,null,null,"С 09:00 до 18:00"]
[null,null,null,null,"С 09:00 до 18:00"]
[null,null,null,null,"С 09:00 до 18:00"]
[null,null,null,null,"С 09:00 до 18:00"]
[null,null,null,null,"С 09:00 до 18:00"]
[null,null,null,null,"С 09:00 до 18:00"]
[null,null,null,null,"С 09:00 до 18:00"]
[null,null,null,null,"С 09:00 до 18:00"]
[null,null,null,null,"С 09:00 до 18:00"]
[null,null,null,null,"С 09:00 до 18:00"]
[null,null,null,null,"С 09:00 до 18:00"]
[null,null,null,null,"С 09:00 до 18:00"]
[null,null,null,null,"С 09:00 до 18:00"]
[null,null,null,null,"С 09:00 до 18:00"]
[null,null,null,null,"С 09:00 до 18:00"]
[null,null,null,null,"С 09:00 до 18:00"]
[null,null,null,null,"С 09:00 до 18:00"]
[null,null,null,null,"С 09:00 до 18:00"]
[null,null,null,null,"С 09:00 до 18:00"]
[null,null,null,null,"С 09:00 до 18:00"]
[null,null,null,null,"С 09:00 до 18:00"]
[null,null,null,null,"С 09:00 до 18:00"]
[null,null,null,null,"С 09:00 до 18:00"]
[null,null,null,null,"С 09:00 до 18:00"]
[null,null,null,null,"С 09:00 до 18:00"]
[null,null,null,null,"С 09:00 до 18:00"]
[null,null,null,null,"С 09:00 до 18:00"]
[null,null,null,null,"С 09:00 до 18:00"]
[null,null,null,null,"С 09:00 до 18:00"]
[null,null,null,null,"С 09:00 до 18:00"]
[null,null,null,null,"С 09:00 до 18:00"]
[null,null,null,null,"С 09:00 до 18:00"]
[null,null,null,null,"С 09:00 до 18:00"]
[null,null,null,null,"С 09:00 до 18:00"]
[null,null,null,null,"С 09:00 до 18:00"]
[null,null,null,null,"С 09:00 до 18:00"]
[null,null,null,null,"С 09:00 до 18:00"]
[null,null,null,null,"С 09:00 до 18:00"]
[null,null,null,null,"С 09:00 до 18:00"]
[null,null,null,null,"С 09:00 до 18:00"]
[null,null,null,null,"С 09:00 до 18:00"]
[null,null,null,null,"С 09:00 до 18:00"]
[null,null,null,null,"С 09:00 до 18:00"]
[null,null,null,null,"С 09:00 до 18:00"]
[null,null,null,null,"С 09:00 до 18:00"]
[null,null,null,null,"С 09:00 до 18:00"]
[null,null,null,null,"С 09:00 до 18:00"]
[null,null,null,null,"С 09:00 до 18:00"]
[null,null,null,null,"С 09:00 до 18:00"]
[null,null,null,null,"С 09:00 до 18:00"]
[null,null,null,null,"С 09:00 до 18:00"]
[null,null,null,null,"С 09:00 до 18:00"]
[null,null,null,null,"С 09:00 до 18:00"]
[null,null,null,null,"С 09:00 до 18:00"]
[null,null,null,null,"С 09:00 до 18:00"]
[null,null,null,null,"С 09:00 до 18:00"]
[null,null,null,null,"С 09:00 до 18:00"]
[null,null,null,null,"С 09:00 до 18:00"]
[null,null,null,null,"С 09:00 до 18:00"]
[null,null,null,null,"С 09:00 до 18:00"]
[null,null,null,null,"С 09:00 до 18:00"]
[null,null,null,null,"С 09:00 до 18:00"]
[null,null,null,null,"С 09:00 до 18:00"]
[null,null,null,null,"С 09:00 до 18:00"]
[null,null,null,null,"С 09:00 до 18:00"]
[null,null,null,null,"С 09:00 до 18:00"]
[null,null,null,null,"С 09:00 до 18:00"]
[null,null,null,null,"С 09:00 до 18:00"]
[null,null,null,null,"С 09:00 до 18:00"]
[null,null,null,null,"С 09:00 до 18:00"]
[null,null,null,null,"С 09:00 до 18:00"]
[null,null,null,null,"С 09:00 до 18:00"]
[null,null,null,null,"С 09:00 до 18:00"]
[null,null,null,null,"С 09:00 до 18:00"]
[null,null,null,null,"С 09:00 до 18:00"]
[null,null,null,null,"С 09:00 до 18:00"]
[null,null,null,null,"С 09:00 до 18:00"]
[null,null,null,null,"С 09:00 до 18:00"]
[null,null,null,null,"С 09:00 до 18:00"]
[null,null,null,null,"С 09:00 до 18:00"]
[null,null,null,null,"С 09:00 до 18:00"]
[null,null,null,null,"С 09:00 до 18:00"]
[null,null,null,null,"С 09:00 до 18:00"]
[null,null,null,null,"С 09:00 до 18:00"]
[null,null,null,null,"С 09:00 до 18:00"]
[null,null,null,null,"С 09:00 до 18:00"]
[null,null,null,null,"С 09:00 до 18:00"]
[null,null,null,null,"С 09:00 до 18:00"]
[null,null,null,null,"С 09:00 до 18:00"]
[null,null,null,null,"С 09:00 до 18:00"]
[null,null,null,null,"С 09:00 до 18:00"]
[null,null,null,null,"С 09:00 до 18:00"]
[null,null,null,null,"С 09:00 до 18:00"]
[null,null,null,null,"С 09:00 до 18:00"]
[null,null,null,null,"С 09:00 до 18:00"]
[null,null,null,null,"С 09:00 до 18:00"]
[null,null,null,null,"С 09:00 до 18:00"]
[null,null,null,null,"С 09:00 до 18:00"]
[null,null,null,null,"С 09:00 до 18:00"]
[null,null,null,null,"С 09:00 до 18:00"]