{"text_format":"1","workbook":"xlsx","n_sheets":4,"sheets":["Прософт","ПрософтПодписанты","ПодписантыДанные","Параметры договора"],"not_rendered":{"charts":0,"images":0,"macros":1,"external_links":0,"defined_names":13,"comments":0,"pivot_tables":0},"unopened":[],"bounds":{"document_bytes":16777216,"sheet_cells":100000,"rows_first":2000,"rows_last":500,"rows_between":2000,"halvings":0,"cell_chars":16384,"cell_head_chars":4096},"cells_cut":0,"cells_raw":0,"read":"whole","date_system":"1900"}

{"sheet":"Прософт","index":0,"n_rows":3,"n_cols":1,"rows_kept":3,"cut":false,"hidden":true,"merged":[]}
["Предприятие"]
["ООО «1»"]
["ООО «2»"]

{"sheet":"ПрософтПодписанты","index":1,"n_rows":6,"n_cols":1,"rows_kept":6,"cut":false,"hidden":true,"merged":[]}
["Подписанты"]
["Иванов"]
["Петров"]
["Сидоров"]
["Данилов"]
["Морозов"]

{"sheet":"ПодписантыДанные","index":2,"n_rows":32,"n_cols":5,"rows_kept":32,"cut":false,"hidden":false,"merged":[]}
["Подписант","Предприятие","Действие с","Действие до","Должность"]
["Иванов","ООО «1»","2009-01-11","2009-12-31","Директор Департамента ООО «1» (по доверенности № 9 от 11.01.2009 г.)"]
["Иванов","ООО «1»","2010-01-11","2010-12-31","Директор Департамента ООО «1» (по доверенности № 9 от 11.01.2010 г.)"]
["Иванов","ООО «1»","2011-01-11","2011-12-31","Директор Департамента ООО «1» (по доверенности № 9 от 11.01.2011 г.)"]
["Петров","ООО «1»","2011-01-11","2011-12-31","Начальник Департамента ООО «1» (по доверенности № 11 от 11.01.2011 г.)"]
["Иванов","ООО «1»","2012-01-10","2012-12-31","Директор Департамента ООО «1» (по доверенности № 9 от 10.01.2012 г.)"]
["Петров","ООО «1»","2012-01-10","2012-12-31","Начальник Департамента ООО «1» (по доверенности № 11 от 10.01.2012 г.)"]
["Иванов","ООО «1»","2013-01-09","2013-07-31","Директор Департамента ООО «1» (по доверенности № 9 от 09.01.2013 г.)"]
["Петров","ООО «1»","2013-01-09","2013-07-31","Начальник Департамента ООО «1» (по доверенности № 11 от 09.01.2013 г.)"]
["Иванов","ООО «1»","2013-08-01","2013-12-31","Директор Департамента ООО «1» (по доверенности № 9 от 01.08.2013 г.)"]
["Петров","ООО «1»","2013-08-01","2013-12-01","Начальник Департамента ООО «1» (по доверенности № 11 от 01.08.2013 г.)"]
["Сидоров","ООО «1»","2013-01-09","2013-12-31","Менеджер проекта ООО «1» (по доверенности № 43 от 09.01.2013 г.)"]
["Петров","ООО «1»","2013-12-02","2014-12-31","Начальник Департамента ООО «1» (по доверенности № 11 от 02.12.2013 г.)"]
["Иванов","ООО «1»","2014-01-09","2014-12-31","Директор Департамента ООО «1» (по доверенности № 9 от 09.01.2014 г.)"]
["Сидоров","ООО «1»","2014-01-09","2014-12-31","Менеджер ООО «1» (по доверенности № 43 от 09.01.2014 г.)"]
["Морозов","ООО «1»","2014-10-01","2014-12-31","Менеджер ООО «1» (по доверенности № 125 от 01.10.2014 г.)"]
["Иванов","ООО «1»","2015-01-12","2015-12-31","Директор Департамента ООО «1» (по доверенности № 9 от 12.01.2015 г.)"]
["Петров","ООО «1»","2015-01-12","2015-12-31","Начальник Департамента ООО «1» (по доверенности № 11 от 12.01.2015 г.)"]
["Сидоров","ООО «1»","2015-01-12","2015-12-31","Представитель ООО «1» (по доверенности № 43 от 12.01.2015 г.)"]
["Иванов","ООО «1»","2016-01-11","2016-12-31","Директор Департамента ООО «1» (по доверенности № 9 от 11.01.2016 г.)"]
["Петров","ООО «1»","2016-01-11","2016-12-31","Начальник Департамента ООО «1» (по доверенности № 11 от 11.01.2016 г.)"]
["Сидоров","ООО «1»","2016-01-11","2016-12-31","Представитель ООО «1» (по доверенности № 43 от 11.01.2016 г.)"]
["Иванов","ООО «2»","2016-01-11","2016-12-31","Представитель ООО «2» (по доверенности № 27 от 11.01.2016 г.)"]
["Петров","ООО «2»","2016-01-11","2016-12-31","Представитель ООО «2» (по доверенности № 28 от 11.01.2016 г.)"]
["Сидоров","ООО «2»","2016-01-11","2016-12-31","Представитель ООО «2» (по доверенности № 30 от 11.01.2016 г.)"]
["Иванов","ООО «1»","2017-01-09","2017-12-31","Директор Департамента ООО «1» (по доверенности № 9 от 09.01.2017 г.)"]
["Петров","ООО «1»","2017-01-09","2017-12-31","Начальник Департамента ООО «1» (по доверенности № 11 от 09.01.2017 г.)"]
["Сидоров","ООО «1»","2017-01-09","2017-12-31","Менеджер Департамента ООО «1» (по доверенности № 43 от 09.01.2017 г.)"]
["Иванов","ООО «2»","2017-01-09","2017-12-31","Представитель ООО «2» (по доверенности № 27 от 09.01.2017 г.)"]
["Петров","ООО «2»","2017-01-09","2017-12-31","Представитель ООО «2» (по доверенности № 28 от 09.01.2017 г.)"]
["Сидоров","ООО «2»","2017-01-09","2017-12-31","Представитель ООО «2» (по доверенности № 30 от 09.01.2017 г.)"]
["Данилов","ООО «1»","2017-04-25","2017-05-15","Менеджер Департамента ООО «1» (по доверенности № 110 от 25.04.2017 г.)"]

{"sheet":"Параметры договора","index":3,"n_rows":25,"n_cols":3,"rows_kept":25,"cut":false,"hidden":false,"merged":[]}
["Дата подписания","2013-05-12"]
["Наименование","ООО «1»"]
["Имя подписанта","Петров"]
["Должность подписанта",{"$f":"LOOKUP(2,1/((ПодписантыДанные!$D$2:$D$32>=ДоговорДата)*(ПодписантыДанные!$C$2:$C$32<=ДоговорДата)*(ПодрядчикНаименование=ПодписантыДанные!$B$2:$B$32)*(ПодписантыДанные!$A$2:$A$32=ПодрядчикИмяПодписанта)),ПодписантыДанные!$E$2:$E$32)","v":"Начальник Департамента ООО «1» (по доверенности № 11 от 09.01.2013 г.)"}]
[null,{"$f":"INDEX(ПодписантыДанные!$E$2:$E$32,MATCH(1,1/(ПодписантыДанные!$D$2:$D$32>=ДоговорДата)*(ПодписантыДанные!$C$2:$C$32<=ДоговорДата)*(ПодрядчикНаименование=ПодписантыДанные!$B$2:$B$32)*(ПодписантыДанные!$A$2:$A$32=ПодрядчикИмяПодписанта),0))","v":"Начальник Департамента ООО «1» (по доверенности № 11 от 09.01.2013 г.)"}]
[]
[null,"СУММЕСЛИМН(ПодписантыДолжность;ПодписантыФамилия;ПодрядчикИмяПодписанта;ПодписантыПредприятие;ПодрядчикНаименование;ППодписантыС;\"<=\"&ДоговорДата;ПодписантыДо;\">=\"&ДоговорДата)",{"$f":"SUMIFS(ПодписантыДолжность,ПодписантыФамилия,ПодрядчикИмяПодписанта,ПодписантыПредприятие,ПодрядчикНаименование,ПодписантыС,\"<=\"&ДоговорДата,ПодписантыДо,\">=\"&ДоговорДата)","v":0}]
[]
[null,"счётЕСЛИМН(ПодписантыФамилия;ПодрядчикИмяПодписанта;ПодписантыПредприятие;ПодрядчикНаименование;ПодписантыС;\"<=\"&ДоговорДата;ПодписантыДо;\">=\"&ДоговорДата)",{"$f":"COUNTIFS(ПодписантыФамилия,ПодрядчикИмяПодписанта,ПодписантыПредприятие,ПодрядчикНаименование,ПодписантыС,\"<=\"&ДоговорДата,ПодписантыДо,\">=\"&ДоговорДата)","v":1}]
[]
[null,"ЕСЛИ(ПодписантыС<=ДоговорДата;ЕСЛИ(ПодписантыДо>=ДоговорДата;ИНДЕКС(ПодписантыДанные;ПОИСКПОЗ(ПодрядчикИмяПодписанта&ПодрядчикНаименование;ПодписантыФамилия&ПодписантыПредприятие;0);5);\"ошибка в дате до\");\"ошибка в дате с\")",{"$f":"IF(ПодписантыС<=ДоговорДата,IF(ПодписантыДо>=ДоговорДата,INDEX(ПодписантыДанные,MATCH(ПодрядчикИмяПодписанта&ПодрядчикНаименование,ПодписантыФамилия&ПодписантыПредприятие,0),5),\"ошибка в дате до\"),\"ошибка в дате с\")","v":"ошибка в дате с"}]
[]
[null,{"$f":"MATCH(ПодрядчикИмяПодписанта&ПодрядчикНаименование,ПодписантыФамилия&ПодписантыПредприятие,0)","v":5}]
[null,{"$f":"INDEX(ПодписантыДанные,MATCH(ПодрядчикИмяПодписанта&ПодрядчикНаименование,ПодписантыФамилия&ПодписантыПредприятие,0),5)","v":"Начальник Департамента ООО «1» (по доверенности № 11 от 11.01.2011 г.)"}]
[]
[]
[null,{"$f":"MATCH(ПодрядчикИмяПодписанта&ПодрядчикНаименование,ПодписантыФамилия&ПодписантыПредприятие,0)","v":5}]
[]
[]
[]
[]
[]
[]
[]
[null,{"$f":"MATCH(ДоговорДата,ПодписантыДанные!$D$2:$D$32,1)","v":6}]