{"text_format":"1","workbook":"xlsx","n_sheets":6,"sheets":["список","a2-1","b10","b12-1","b18-1","b23-1"],"not_rendered":{"charts":0,"images":0,"macros":1,"external_links":0,"defined_names":17,"comments":0,"pivot_tables":0},"unopened":[],"bounds":{"document_bytes":16777216,"sheet_cells":100000,"rows_first":2000,"rows_last":500,"rows_between":2000,"halvings":0,"cell_chars":16384,"cell_head_chars":4096},"cells_cut":0,"cells_raw":0,"read":"whole","date_system":"1900"}

{"sheet":"список","index":0,"n_rows":19,"n_cols":14,"rows_kept":19,"cut":false,"hidden":false,"merged":[]}
[null,"Адрес","Номер","Сумма",null,null,null,null,null,null,"адрес","кол-во копий",null,"кол-во копий если адреса нет в списке"]
[null,"a2-1",null,100,null,null,null,null,null,null,"a2-1",4,null,{"$f":"IF(COUNTIF(B2:B19,K2),L2,)","v":4}]
[null,"b10",null,200,null,null,null,null,null,null,"b10",7,null,{"$f":"IF(COUNTIF(B3:B20,K3),L3,)","v":7}]
[null,null,null,300,null,null,null,null,null,null,"b12-1",2,null,0]
[null,"b18-1",null,400,null,null,null,null,null,null,"b18-1",9,null,9]
["*",null,null,500,null,null,null,null,null,null,"b23-1",5,null,0]
{"$rows_left_out":14}
{"sheet":"a2-1","index":1,"n_rows":7,"n_cols":5,"rows_kept":7,"cut":false,"hidden":false,"merged":[[0,0,0,4]]}
["a2-1"]
["Номер","Сумма",null,"Номер","Сумма"]
[{"$f":"IF(ROW(список!B1)>-INT(-COUNTIF(список!$B$2:$B$3002,$A$1)/2),\"\",INDEX(список!C$1:C$3002,SMALL(IF(список!$B$2:$B$3002=$A$1,ROW(список!B$2:B$3002)),ROW(список!B1)-(COLUMN(список!B1)>3)*INT(-COUNTIF(список!$B$2:$B$3002,$A$1)/2))))","v":0},{"$f":"IF(ROW(список!C1)>-INT(-COUNTIF(список!$B$2:$B$3002,$A$1)/2),\"\",INDEX(список!D$1:D$3002,SMALL(IF(список!$B$2:$B$3002=$A$1,ROW(список!C$2:C$3002)),ROW(список!C1)-(COLUMN(список!C1)>3)*INT(-COUNTIF(список!$B$2:$B$3002,$A$1)/2))))","v":100},null,{"$f":"IF(ROW(список!B1)>TRUNC(COUNTIF(список!$B$2:$B$3002,$A$1)/2),\"\",INDEX(список!C$1:C$3002,SMALL(IF(список!$B$2:$B$3002=$A$1,ROW(список!E$2:E$3002)),ROW(список!E1)-(COLUMN(список!E1)>3)*INT(-COUNTIF(список!$B$2:$B$3002,$A$1)/2))))","v":0},{"$f":"IF(ROW(список!C1)>TRUNC(COUNTIF(список!$B$2:$B$3002,$A$1)/2),\"\",INDEX(список!D$1:D$3002,SMALL(IF(список!$B$2:$B$3002=$A$1,ROW(список!F$2:F$3002)),ROW(список!F1)-(COLUMN(список!F1)>3)*INT(-COUNTIF(список!$B$2:$B$3002,$A$1)/2))))","v":1300}]
[{"$f":"IF(ROW(список!B2)>-INT(-COUNTIF(список!$B$2:$B$3002,$A$1)/2),\"\",INDEX(список!C$1:C$3002,SMALL(IF(список!$B$2:$B$3002=$A$1,ROW(список!B$2:B$3002)),ROW(список!B2)-(COLUMN(список!B2)>3)*INT(-COUNTIF(список!$B$2:$B$3002,$A$1)/2))))","v":0},{"$f":"IF(ROW(список!C2)>-INT(-COUNTIF(список!$B$2:$B$3002,$A$1)/2),\"\",INDEX(список!D$1:D$3002,SMALL(IF(список!$B$2:$B$3002=$A$1,ROW(список!C$2:C$3002)),ROW(список!C2)-(COLUMN(список!C2)>3)*INT(-COUNTIF(список!$B$2:$B$3002,$A$1)/2))))","v":600},null,{"$f":"IF(ROW(список!B2)>TRUNC(COUNTIF(список!$B$2:$B$3002,$A$1)/2),\"\",INDEX(список!C$1:C$3002,SMALL(IF(список!$B$2:$B$3002=$A$1,ROW(список!E$2:E$3002)),ROW(список!E2)-(COLUMN(список!E2)>3)*INT(-COUNTIF(список!$B$2:$B$3002,$A$1)/2))))","v":0},{"$f":"IF(ROW(список!C2)>TRUNC(COUNTIF(список!$B$2:$B$3002,$A$1)/2),\"\",INDEX(список!D$1:D$3002,SMALL(IF(список!$B$2:$B$3002=$A$1,ROW(список!F$2:F$3002)),ROW(список!F2)-(COLUMN(список!F2)>3)*INT(-COUNTIF(список!$B$2:$B$3002,$A$1)/2))))","v":1400}]
[{"$f":"IF(ROW(список!B3)>-INT(-COUNTIF(список!$B$2:$B$3002,$A$1)/2),\"\",INDEX(список!C$1:C$3002,SMALL(IF(список!$B$2:$B$3002=$A$1,ROW(список!B$2:B$3002)),ROW(список!B3)-(COLUMN(список!B3)>3)*INT(-COUNTIF(список!$B$2:$B$3002,$A$1)/2))))","v":0},{"$f":"IF(ROW(список!C3)>-INT(-COUNTIF(список!$B$2:$B$3002,$A$1)/2),\"\",INDEX(список!D$1:D$3002,SMALL(IF(список!$B$2:$B$3002=$A$1,ROW(список!C$2:C$3002)),ROW(список!C3)-(COLUMN(список!C3)>3)*INT(-COUNTIF(список!$B$2:$B$3002,$A$1)/2))))","v":900},null,{"$f":"IF(ROW(список!B3)>TRUNC(COUNTIF(список!$B$2:$B$3002,$A$1)/2),\"\",INDEX(список!C$1:C$3002,SMALL(IF(список!$B$2:$B$3002=$A$1,ROW(список!E$2:E$3002)),ROW(список!E3)-(COLUMN(список!E3)>3)*INT(-COUNTIF(список!$B$2:$B$3002,$A$1)/2))))","v":""},{"$f":"IF(ROW(список!C3)>TRUNC(COUNTIF(список!$B$2:$B$3002,$A$1)/2),\"\",INDEX(список!D$1:D$3002,SMALL(IF(список!$B$2:$B$3002=$A$1,ROW(список!F$2:F$3002)),ROW(список!F3)-(COLUMN(список!F3)>3)*INT(-COUNTIF(список!$B$2:$B$3002,$A$1)/2))))","v":""}]
[{"$f":"IF(ROW(список!B4)>-INT(-COUNTIF(список!$B$2:$B$3002,$A$1)/2),\"\",INDEX(список!C$1:C$3002,SMALL(IF(список!$B$2:$B$3002=$A$1,ROW(список!B$2:B$3002)),ROW(список!B4)-(COLUMN(список!B4)>3)*INT(-COUNTIF(список!$B$2:$B$3002,$A$1)/2))))","v":""},{"$f":"IF(ROW(список!C4)>-INT(-COUNTIF(список!$B$2:$B$3002,$A$1)/2),\"\",INDEX(список!D$1:D$3002,SMALL(IF(список!$B$2:$B$3002=$A$1,ROW(список!C$2:C$3002)),ROW(список!C4)-(COLUMN(список!C4)>3)*INT(-COUNTIF(список!$B$2:$B$3002,$A$1)/2))))","v":""},null,{"$f":"IF(ROW(список!B4)>TRUNC(COUNTIF(список!$B$2:$B$3002,$A$1)/2),\"\",INDEX(список!C$1:C$3002,SMALL(IF(список!$B$2:$B$3002=$A$1,ROW(список!E$2:E$3002)),ROW(список!E4)-(COLUMN(список!E4)>3)*INT(-COUNTIF(список!$B$2:$B$3002,$A$1)/2))))","v":""},{"$f":"IF(ROW(список!C4)>TRUNC(COUNTIF(список!$B$2:$B$3002,$A$1)/2),\"\",INDEX(список!D$1:D$3002,SMALL(IF(список!$B$2:$B$3002=$A$1,ROW(список!F$2:F$3002)),ROW(список!F4)-(COLUMN(список!F4)>3)*INT(-COUNTIF(список!$B$2:$B$3002,$A$1)/2))))","v":""}]
{"$rows_left_out":2}
{"sheet":"b10","index":2,"n_rows":7,"n_cols":5,"rows_kept":7,"cut":false,"hidden":false,"merged":[[0,0,0,4]]}
["b10"]
["Номер","Сумма",null,"Номер","Сумма"]
[{"$f":"IF(ROW(список!B1)>-INT(-COUNTIF(список!$B$2:$B$3002,$A$1)/2),\"\",INDEX(список!C$1:C$3002,SMALL(IF(список!$B$2:$B$3002=$A$1,ROW(список!B$2:B$3002)),ROW(список!B1)-(COLUMN(список!B1)>3)*INT(-COUNTIF(список!$B$2:$B$3002,$A$1)/2))))","v":0},{"$f":"IF(ROW(список!C1)>-INT(-COUNTIF(список!$B$2:$B$3002,$A$1)/2),\"\",INDEX(список!D$1:D$3002,SMALL(IF(список!$B$2:$B$3002=$A$1,ROW(список!C$2:C$3002)),ROW(список!C1)-(COLUMN(список!C1)>3)*INT(-COUNTIF(список!$B$2:$B$3002,$A$1)/2))))","v":200},null,{"$f":"IF(ROW(список!B1)>TRUNC(COUNTIF(список!$B$2:$B$3002,$A$1)/2),\"\",INDEX(список!C$1:C$3002,SMALL(IF(список!$B$2:$B$3002=$A$1,ROW(список!E$2:E$3002)),ROW(список!E1)-(COLUMN(список!E1)>3)*INT(-COUNTIF(список!$B$2:$B$3002,$A$1)/2))))","v":0},{"$f":"IF(ROW(список!C1)>TRUNC(COUNTIF(список!$B$2:$B$3002,$A$1)/2),\"\",INDEX(список!D$1:D$3002,SMALL(IF(список!$B$2:$B$3002=$A$1,ROW(список!F$2:F$3002)),ROW(список!F1)-(COLUMN(список!F1)>3)*INT(-COUNTIF(список!$B$2:$B$3002,$A$1)/2))))","v":1000}]
[{"$f":"IF(ROW(список!B2)>-INT(-COUNTIF(список!$B$2:$B$3002,$A$1)/2),\"\",INDEX(список!C$1:C$3002,SMALL(IF(список!$B$2:$B$3002=$A$1,ROW(список!B$2:B$3002)),ROW(список!B2)-(COLUMN(список!B2)>3)*INT(-COUNTIF(список!$B$2:$B$3002,$A$1)/2))))","v":0},{"$f":"IF(ROW(список!C2)>-INT(-COUNTIF(список!$B$2:$B$3002,$A$1)/2),\"\",INDEX(список!D$1:D$3002,SMALL(IF(список!$B$2:$B$3002=$A$1,ROW(список!C$2:C$3002)),ROW(список!C2)-(COLUMN(список!C2)>3)*INT(-COUNTIF(список!$B$2:$B$3002,$A$1)/2))))","v":700},null,{"$f":"IF(ROW(список!B2)>TRUNC(COUNTIF(список!$B$2:$B$3002,$A$1)/2),\"\",INDEX(список!C$1:C$3002,SMALL(IF(список!$B$2:$B$3002=$A$1,ROW(список!E$2:E$3002)),ROW(список!E2)-(COLUMN(список!E2)>3)*INT(-COUNTIF(список!$B$2:$B$3002,$A$1)/2))))","v":0},{"$f":"IF(ROW(список!C2)>TRUNC(COUNTIF(список!$B$2:$B$3002,$A$1)/2),\"\",INDEX(список!D$1:D$3002,SMALL(IF(список!$B$2:$B$3002=$A$1,ROW(список!F$2:F$3002)),ROW(список!F2)-(COLUMN(список!F2)>3)*INT(-COUNTIF(список!$B$2:$B$3002,$A$1)/2))))","v":1500}]
[{"$f":"IF(ROW(список!B3)>-INT(-COUNTIF(список!$B$2:$B$3002,$A$1)/2),\"\",INDEX(список!C$1:C$3002,SMALL(IF(список!$B$2:$B$3002=$A$1,ROW(список!B$2:B$3002)),ROW(список!B3)-(COLUMN(список!B3)>3)*INT(-COUNTIF(список!$B$2:$B$3002,$A$1)/2))))","v":""},{"$f":"IF(ROW(список!C3)>-INT(-COUNTIF(список!$B$2:$B$3002,$A$1)/2),\"\",INDEX(список!D$1:D$3002,SMALL(IF(список!$B$2:$B$3002=$A$1,ROW(список!C$2:C$3002)),ROW(список!C3)-(COLUMN(список!C3)>3)*INT(-COUNTIF(список!$B$2:$B$3002,$A$1)/2))))","v":""},null,{"$f":"IF(ROW(список!B3)>TRUNC(COUNTIF(список!$B$2:$B$3002,$A$1)/2),\"\",INDEX(список!C$1:C$3002,SMALL(IF(список!$B$2:$B$3002=$A$1,ROW(список!E$2:E$3002)),ROW(список!E3)-(COLUMN(список!E3)>3)*INT(-COUNTIF(список!$B$2:$B$3002,$A$1)/2))))","v":""},{"$f":"IF(ROW(список!C3)>TRUNC(COUNTIF(список!$B$2:$B$3002,$A$1)/2),\"\",INDEX(список!D$1:D$3002,SMALL(IF(список!$B$2:$B$3002=$A$1,ROW(список!F$2:F$3002)),ROW(список!F3)-(COLUMN(список!F3)>3)*INT(-COUNTIF(список!$B$2:$B$3002,$A$1)/2))))","v":""}]
[{"$f":"IF(ROW(список!B4)>-INT(-COUNTIF(список!$B$2:$B$3002,$A$1)/2),\"\",INDEX(список!C$1:C$3002,SMALL(IF(список!$B$2:$B$3002=$A$1,ROW(список!B$2:B$3002)),ROW(список!B4)-(COLUMN(список!B4)>3)*INT(-COUNTIF(список!$B$2:$B$3002,$A$1)/2))))","v":""},{"$f":"IF(ROW(список!C4)>-INT(-COUNTIF(список!$B$2:$B$3002,$A$1)/2),\"\",INDEX(список!D$1:D$3002,SMALL(IF(список!$B$2:$B$3002=$A$1,ROW(список!C$2:C$3002)),ROW(список!C4)-(COLUMN(список!C4)>3)*INT(-COUNTIF(список!$B$2:$B$3002,$A$1)/2))))","v":""},null,{"$f":"IF(ROW(список!B4)>TRUNC(COUNTIF(список!$B$2:$B$3002,$A$1)/2),\"\",INDEX(список!C$1:C$3002,SMALL(IF(список!$B$2:$B$3002=$A$1,ROW(список!E$2:E$3002)),ROW(список!E4)-(COLUMN(список!E4)>3)*INT(-COUNTIF(список!$B$2:$B$3002,$A$1)/2))))","v":""},{"$f":"IF(ROW(список!C4)>TRUNC(COUNTIF(список!$B$2:$B$3002,$A$1)/2),\"\",INDEX(список!D$1:D$3002,SMALL(IF(список!$B$2:$B$3002=$A$1,ROW(список!F$2:F$3002)),ROW(список!F4)-(COLUMN(список!F4)>3)*INT(-COUNTIF(список!$B$2:$B$3002,$A$1)/2))))","v":""}]
{"$rows_left_out":2}
{"sheet":"b12-1","index":3,"n_rows":7,"n_cols":5,"rows_kept":7,"cut":false,"hidden":false,"merged":[[0,0,0,4]]}
["b12-1"]
["Номер","Сумма",null,"Номер","Сумма"]
[{"$f":"IF(ROW(список!B1)>-INT(-COUNTIF(список!$B$2:$B$3002,$A$1)/2),\"\",INDEX(список!C$1:C$3002,SMALL(IF(список!$B$2:$B$3002=$A$1,ROW(список!B$2:B$3002)),ROW(список!B1)-(COLUMN(список!B1)>3)*INT(-COUNTIF(список!$B$2:$B$3002,$A$1)/2))))","v":""},{"$f":"IF(ROW(список!C1)>-INT(-COUNTIF(список!$B$2:$B$3002,$A$1)/2),\"\",INDEX(список!D$1:D$3002,SMALL(IF(список!$B$2:$B$3002=$A$1,ROW(список!C$2:C$3002)),ROW(список!C1)-(COLUMN(список!C1)>3)*INT(-COUNTIF(список!$B$2:$B$3002,$A$1)/2))))","v":""},null,{"$f":"IF(ROW(список!B1)>TRUNC(COUNTIF(список!$B$2:$B$3002,$A$1)/2),\"\",INDEX(список!C$1:C$3002,SMALL(IF(список!$B$2:$B$3002=$A$1,ROW(список!E$2:E$3002)),ROW(список!E1)-(COLUMN(список!E1)>3)*INT(-COUNTIF(список!$B$2:$B$3002,$A$1)/2))))","v":""},{"$f":"IF(ROW(список!C1)>TRUNC(COUNTIF(список!$B$2:$B$3002,$A$1)/2),\"\",INDEX(список!D$1:D$3002,SMALL(IF(список!$B$2:$B$3002=$A$1,ROW(список!F$2:F$3002)),ROW(список!F1)-(COLUMN(список!F1)>3)*INT(-COUNTIF(список!$B$2:$B$3002,$A$1)/2))))","v":""}]
[{"$f":"IF(ROW(список!B2)>-INT(-COUNTIF(список!$B$2:$B$3002,$A$1)/2),\"\",INDEX(список!C$1:C$3002,SMALL(IF(список!$B$2:$B$3002=$A$1,ROW(список!B$2:B$3002)),ROW(список!B2)-(COLUMN(список!B2)>3)*INT(-COUNTIF(список!$B$2:$B$3002,$A$1)/2))))","v":""},{"$f":"IF(ROW(список!C2)>-INT(-COUNTIF(список!$B$2:$B$3002,$A$1)/2),\"\",INDEX(список!D$1:D$3002,SMALL(IF(список!$B$2:$B$3002=$A$1,ROW(список!C$2:C$3002)),ROW(список!C2)-(COLUMN(список!C2)>3)*INT(-COUNTIF(список!$B$2:$B$3002,$A$1)/2))))","v":""},null,{"$f":"IF(ROW(список!B2)>TRUNC(COUNTIF(список!$B$2:$B$3002,$A$1)/2),\"\",INDEX(список!C$1:C$3002,SMALL(IF(список!$B$2:$B$3002=$A$1,ROW(список!E$2:E$3002)),ROW(список!E2)-(COLUMN(список!E2)>3)*INT(-COUNTIF(список!$B$2:$B$3002,$A$1)/2))))","v":""},{"$f":"IF(ROW(список!C2)>TRUNC(COUNTIF(список!$B$2:$B$3002,$A$1)/2),\"\",INDEX(список!D$1:D$3002,SMALL(IF(список!$B$2:$B$3002=$A$1,ROW(список!F$2:F$3002)),ROW(список!F2)-(COLUMN(список!F2)>3)*INT(-COUNTIF(список!$B$2:$B$3002,$A$1)/2))))","v":""}]
[{"$f":"IF(ROW(список!B3)>-INT(-COUNTIF(список!$B$2:$B$3002,$A$1)/2),\"\",INDEX(список!C$1:C$3002,SMALL(IF(список!$B$2:$B$3002=$A$1,ROW(список!B$2:B$3002)),ROW(список!B3)-(COLUMN(список!B3)>3)*INT(-COUNTIF(список!$B$2:$B$3002,$A$1)/2))))","v":""},{"$f":"IF(ROW(список!C3)>-INT(-COUNTIF(список!$B$2:$B$3002,$A$1)/2),\"\",INDEX(список!D$1:D$3002,SMALL(IF(список!$B$2:$B$3002=$A$1,ROW(список!C$2:C$3002)),ROW(список!C3)-(COLUMN(список!C3)>3)*INT(-COUNTIF(список!$B$2:$B$3002,$A$1)/2))))","v":""},null,{"$f":"IF(ROW(список!B3)>TRUNC(COUNTIF(список!$B$2:$B$3002,$A$1)/2),\"\",INDEX(список!C$1:C$3002,SMALL(IF(список!$B$2:$B$3002=$A$1,ROW(список!E$2:E$3002)),ROW(список!E3)-(COLUMN(список!E3)>3)*INT(-COUNTIF(список!$B$2:$B$3002,$A$1)/2))))","v":""},{"$f":"IF(ROW(список!C3)>TRUNC(COUNTIF(список!$B$2:$B$3002,$A$1)/2),\"\",INDEX(список!D$1:D$3002,SMALL(IF(список!$B$2:$B$3002=$A$1,ROW(список!F$2:F$3002)),ROW(список!F3)-(COLUMN(список!F3)>3)*INT(-COUNTIF(список!$B$2:$B$3002,$A$1)/2))))","v":""}]
[{"$f":"IF(ROW(список!B4)>-INT(-COUNTIF(список!$B$2:$B$3002,$A$1)/2),\"\",INDEX(список!C$1:C$3002,SMALL(IF(список!$B$2:$B$3002=$A$1,ROW(список!B$2:B$3002)),ROW(список!B4)-(COLUMN(список!B4)>3)*INT(-COUNTIF(список!$B$2:$B$3002,$A$1)/2))))","v":""},{"$f":"IF(ROW(список!C4)>-INT(-COUNTIF(список!$B$2:$B$3002,$A$1)/2),\"\",INDEX(список!D$1:D$3002,SMALL(IF(список!$B$2:$B$3002=$A$1,ROW(список!C$2:C$3002)),ROW(список!C4)-(COLUMN(список!C4)>3)*INT(-COUNTIF(список!$B$2:$B$3002,$A$1)/2))))","v":""},null,{"$f":"IF(ROW(список!B4)>TRUNC(COUNTIF(список!$B$2:$B$3002,$A$1)/2),\"\",INDEX(список!C$1:C$3002,SMALL(IF(список!$B$2:$B$3002=$A$1,ROW(список!E$2:E$3002)),ROW(список!E4)-(COLUMN(список!E4)>3)*INT(-COUNTIF(список!$B$2:$B$3002,$A$1)/2))))","v":""},{"$f":"IF(ROW(список!C4)>TRUNC(COUNTIF(список!$B$2:$B$3002,$A$1)/2),\"\",INDEX(список!D$1:D$3002,SMALL(IF(список!$B$2:$B$3002=$A$1,ROW(список!F$2:F$3002)),ROW(список!F4)-(COLUMN(список!F4)>3)*INT(-COUNTIF(список!$B$2:$B$3002,$A$1)/2))))","v":""}]
{"$rows_left_out":2}
{"sheet":"b18-1","index":4,"n_rows":7,"n_cols":5,"rows_kept":7,"cut":false,"hidden":false,"merged":[[0,0,0,4]]}
["b18-1"]
["Номер","Сумма",null,"Номер","Сумма"]
[{"$f":"IF(ROW(список!B1)>-INT(-COUNTIF(список!$B$2:$B$3002,$A$1)/2),\"\",INDEX(список!C$1:C$3002,SMALL(IF(список!$B$2:$B$3002=$A$1,ROW(список!B$2:B$3002)),ROW(список!B1)-(COLUMN(список!B1)>3)*INT(-COUNTIF(список!$B$2:$B$3002,$A$1)/2))))","v":0},{"$f":"IF(ROW(список!C1)>-INT(-COUNTIF(список!$B$2:$B$3002,$A$1)/2),\"\",INDEX(список!D$1:D$3002,SMALL(IF(список!$B$2:$B$3002=$A$1,ROW(список!C$2:C$3002)),ROW(список!C1)-(COLUMN(список!C1)>3)*INT(-COUNTIF(список!$B$2:$B$3002,$A$1)/2))))","v":400},null,{"$f":"IF(ROW(список!B1)>TRUNC(COUNTIF(список!$B$2:$B$3002,$A$1)/2),\"\",INDEX(список!C$1:C$3002,SMALL(IF(список!$B$2:$B$3002=$A$1,ROW(список!E$2:E$3002)),ROW(список!E1)-(COLUMN(список!E1)>3)*INT(-COUNTIF(список!$B$2:$B$3002,$A$1)/2))))","v":0},{"$f":"IF(ROW(список!C1)>TRUNC(COUNTIF(список!$B$2:$B$3002,$A$1)/2),\"\",INDEX(список!D$1:D$3002,SMALL(IF(список!$B$2:$B$3002=$A$1,ROW(список!F$2:F$3002)),ROW(список!F1)-(COLUMN(список!F1)>3)*INT(-COUNTIF(список!$B$2:$B$3002,$A$1)/2))))","v":1700}]
[{"$f":"IF(ROW(список!B2)>-INT(-COUNTIF(список!$B$2:$B$3002,$A$1)/2),\"\",INDEX(список!C$1:C$3002,SMALL(IF(список!$B$2:$B$3002=$A$1,ROW(список!B$2:B$3002)),ROW(список!B2)-(COLUMN(список!B2)>3)*INT(-COUNTIF(список!$B$2:$B$3002,$A$1)/2))))","v":0},{"$f":"IF(ROW(список!C2)>-INT(-COUNTIF(список!$B$2:$B$3002,$A$1)/2),\"\",INDEX(список!D$1:D$3002,SMALL(IF(список!$B$2:$B$3002=$A$1,ROW(список!C$2:C$3002)),ROW(список!C2)-(COLUMN(список!C2)>3)*INT(-COUNTIF(список!$B$2:$B$3002,$A$1)/2))))","v":1200},null,{"$f":"IF(ROW(список!B2)>TRUNC(COUNTIF(список!$B$2:$B$3002,$A$1)/2),\"\",INDEX(список!C$1:C$3002,SMALL(IF(список!$B$2:$B$3002=$A$1,ROW(список!E$2:E$3002)),ROW(список!E2)-(COLUMN(список!E2)>3)*INT(-COUNTIF(список!$B$2:$B$3002,$A$1)/2))))","v":""},{"$f":"IF(ROW(список!C2)>TRUNC(COUNTIF(список!$B$2:$B$3002,$A$1)/2),\"\",INDEX(список!D$1:D$3002,SMALL(IF(список!$B$2:$B$3002=$A$1,ROW(список!F$2:F$3002)),ROW(список!F2)-(COLUMN(список!F2)>3)*INT(-COUNTIF(список!$B$2:$B$3002,$A$1)/2))))","v":""}]
[{"$f":"IF(ROW(список!B3)>-INT(-COUNTIF(список!$B$2:$B$3002,$A$1)/2),\"\",INDEX(список!C$1:C$3002,SMALL(IF(список!$B$2:$B$3002=$A$1,ROW(список!B$2:B$3002)),ROW(список!B3)-(COLUMN(список!B3)>3)*INT(-COUNTIF(список!$B$2:$B$3002,$A$1)/2))))","v":""},{"$f":"IF(ROW(список!C3)>-INT(-COUNTIF(список!$B$2:$B$3002,$A$1)/2),\"\",INDEX(список!D$1:D$3002,SMALL(IF(список!$B$2:$B$3002=$A$1,ROW(список!C$2:C$3002)),ROW(список!C3)-(COLUMN(список!C3)>3)*INT(-COUNTIF(список!$B$2:$B$3002,$A$1)/2))))","v":""},null,{"$f":"IF(ROW(список!B3)>TRUNC(COUNTIF(список!$B$2:$B$3002,$A$1)/2),\"\",INDEX(список!C$1:C$3002,SMALL(IF(список!$B$2:$B$3002=$A$1,ROW(список!E$2:E$3002)),ROW(список!E3)-(COLUMN(список!E3)>3)*INT(-COUNTIF(список!$B$2:$B$3002,$A$1)/2))))","v":""},{"$f":"IF(ROW(список!C3)>TRUNC(COUNTIF(список!$B$2:$B$3002,$A$1)/2),\"\",INDEX(список!D$1:D$3002,SMALL(IF(список!$B$2:$B$3002=$A$1,ROW(список!F$2:F$3002)),ROW(список!F3)-(COLUMN(список!F3)>3)*INT(-COUNTIF(список!$B$2:$B$3002,$A$1)/2))))","v":""}]
[{"$f":"IF(ROW(список!B4)>-INT(-COUNTIF(список!$B$2:$B$3002,$A$1)/2),\"\",INDEX(список!C$1:C$3002,SMALL(IF(список!$B$2:$B$3002=$A$1,ROW(список!B$2:B$3002)),ROW(список!B4)-(COLUMN(список!B4)>3)*INT(-COUNTIF(список!$B$2:$B$3002,$A$1)/2))))","v":""},{"$f":"IF(ROW(список!C4)>-INT(-COUNTIF(список!$B$2:$B$3002,$A$1)/2),\"\",INDEX(список!D$1:D$3002,SMALL(IF(список!$B$2:$B$3002=$A$1,ROW(список!C$2:C$3002)),ROW(список!C4)-(COLUMN(список!C4)>3)*INT(-COUNTIF(список!$B$2:$B$3002,$A$1)/2))))","v":""},null,{"$f":"IF(ROW(список!B4)>TRUNC(COUNTIF(список!$B$2:$B$3002,$A$1)/2),\"\",INDEX(список!C$1:C$3002,SMALL(IF(список!$B$2:$B$3002=$A$1,ROW(список!E$2:E$3002)),ROW(список!E4)-(COLUMN(список!E4)>3)*INT(-COUNTIF(список!$B$2:$B$3002,$A$1)/2))))","v":""},{"$f":"IF(ROW(список!C4)>TRUNC(COUNTIF(список!$B$2:$B$3002,$A$1)/2),\"\",INDEX(список!D$1:D$3002,SMALL(IF(список!$B$2:$B$3002=$A$1,ROW(список!F$2:F$3002)),ROW(список!F4)-(COLUMN(список!F4)>3)*INT(-COUNTIF(список!$B$2:$B$3002,$A$1)/2))))","v":""}]
{"$rows_left_out":2}
{"sheet":"b23-1","index":5,"n_rows":7,"n_cols":5,"rows_kept":7,"cut":false,"hidden":false,"merged":[[0,0,0,4]]}
["b23-1"]
["Номер","Сумма",null,"Номер","Сумма"]
[{"$f":"IF(ROW(список!B1)>-INT(-COUNTIF(список!$B$2:$B$3002,$A$1)/2),\"\",INDEX(список!C$1:C$3002,SMALL(IF(список!$B$2:$B$3002=$A$1,ROW(список!B$2:B$3002)),ROW(список!B1)-(COLUMN(список!B1)>3)*INT(-COUNTIF(список!$B$2:$B$3002,$A$1)/2))))","v":""},{"$f":"IF(ROW(список!C1)>-INT(-COUNTIF(список!$B$2:$B$3002,$A$1)/2),\"\",INDEX(список!D$1:D$3002,SMALL(IF(список!$B$2:$B$3002=$A$1,ROW(список!C$2:C$3002)),ROW(список!C1)-(COLUMN(список!C1)>3)*INT(-COUNTIF(список!$B$2:$B$3002,$A$1)/2))))","v":""},null,{"$f":"IF(ROW(список!B1)>TRUNC(COUNTIF(список!$B$2:$B$3002,$A$1)/2),\"\",INDEX(список!C$1:C$3002,SMALL(IF(список!$B$2:$B$3002=$A$1,ROW(список!E$2:E$3002)),ROW(список!E1)-(COLUMN(список!E1)>3)*INT(-COUNTIF(список!$B$2:$B$3002,$A$1)/2))))","v":""},{"$f":"IF(ROW(список!C1)>TRUNC(COUNTIF(список!$B$2:$B$3002,$A$1)/2),\"\",INDEX(список!D$1:D$3002,SMALL(IF(список!$B$2:$B$3002=$A$1,ROW(список!F$2:F$3002)),ROW(список!F1)-(COLUMN(список!F1)>3)*INT(-COUNTIF(список!$B$2:$B$3002,$A$1)/2))))","v":""}]
[{"$f":"IF(ROW(список!B2)>-INT(-COUNTIF(список!$B$2:$B$3002,$A$1)/2),\"\",INDEX(список!C$1:C$3002,SMALL(IF(список!$B$2:$B$3002=$A$1,ROW(список!B$2:B$3002)),ROW(список!B2)-(COLUMN(список!B2)>3)*INT(-COUNTIF(список!$B$2:$B$3002,$A$1)/2))))","v":""},{"$f":"IF(ROW(список!C2)>-INT(-COUNTIF(список!$B$2:$B$3002,$A$1)/2),\"\",INDEX(список!D$1:D$3002,SMALL(IF(список!$B$2:$B$3002=$A$1,ROW(список!C$2:C$3002)),ROW(список!C2)-(COLUMN(список!C2)>3)*INT(-COUNTIF(список!$B$2:$B$3002,$A$1)/2))))","v":""},null,{"$f":"IF(ROW(список!B2)>TRUNC(COUNTIF(список!$B$2:$B$3002,$A$1)/2),\"\",INDEX(список!C$1:C$3002,SMALL(IF(список!$B$2:$B$3002=$A$1,ROW(список!E$2:E$3002)),ROW(список!E2)-(COLUMN(список!E2)>3)*INT(-COUNTIF(список!$B$2:$B$3002,$A$1)/2))))","v":""},{"$f":"IF(ROW(список!C2)>TRUNC(COUNTIF(список!$B$2:$B$3002,$A$1)/2),\"\",INDEX(список!D$1:D$3002,SMALL(IF(список!$B$2:$B$3002=$A$1,ROW(список!F$2:F$3002)),ROW(список!F2)-(COLUMN(список!F2)>3)*INT(-COUNTIF(список!$B$2:$B$3002,$A$1)/2))))","v":""}]
[{"$f":"IF(ROW(список!B3)>-INT(-COUNTIF(список!$B$2:$B$3002,$A$1)/2),\"\",INDEX(список!C$1:C$3002,SMALL(IF(список!$B$2:$B$3002=$A$1,ROW(список!B$2:B$3002)),ROW(список!B3)-(COLUMN(список!B3)>3)*INT(-COUNTIF(список!$B$2:$B$3002,$A$1)/2))))","v":""},{"$f":"IF(ROW(список!C3)>-INT(-COUNTIF(список!$B$2:$B$3002,$A$1)/2),\"\",INDEX(список!D$1:D$3002,SMALL(IF(список!$B$2:$B$3002=$A$1,ROW(список!C$2:C$3002)),ROW(список!C3)-(COLUMN(список!C3)>3)*INT(-COUNTIF(список!$B$2:$B$3002,$A$1)/2))))","v":""},null,{"$f":"IF(ROW(список!B3)>TRUNC(COUNTIF(список!$B$2:$B$3002,$A$1)/2),\"\",INDEX(список!C$1:C$3002,SMALL(IF(список!$B$2:$B$3002=$A$1,ROW(список!E$2:E$3002)),ROW(список!E3)-(COLUMN(список!E3)>3)*INT(-COUNTIF(список!$B$2:$B$3002,$A$1)/2))))","v":""},{"$f":"IF(ROW(список!C3)>TRUNC(COUNTIF(список!$B$2:$B$3002,$A$1)/2),\"\",INDEX(список!D$1:D$3002,SMALL(IF(список!$B$2:$B$3002=$A$1,ROW(список!F$2:F$3002)),ROW(список!F3)-(COLUMN(список!F3)>3)*INT(-COUNTIF(список!$B$2:$B$3002,$A$1)/2))))","v":""}]
[{"$f":"IF(ROW(список!B4)>-INT(-COUNTIF(список!$B$2:$B$3002,$A$1)/2),\"\",INDEX(список!C$1:C$3002,SMALL(IF(список!$B$2:$B$3002=$A$1,ROW(список!B$2:B$3002)),ROW(список!B4)-(COLUMN(список!B4)>3)*INT(-COUNTIF(список!$B$2:$B$3002,$A$1)/2))))","v":""},{"$f":"IF(ROW(список!C4)>-INT(-COUNTIF(список!$B$2:$B$3002,$A$1)/2),\"\",INDEX(список!D$1:D$3002,SMALL(IF(список!$B$2:$B$3002=$A$1,ROW(список!C$2:C$3002)),ROW(список!C4)-(COLUMN(список!C4)>3)*INT(-COUNTIF(список!$B$2:$B$3002,$A$1)/2))))","v":""},null,{"$f":"IF(ROW(список!B4)>TRUNC(COUNTIF(список!$B$2:$B$3002,$A$1)/2),\"\",INDEX(список!C$1:C$3002,SMALL(IF(список!$B$2:$B$3002=$A$1,ROW(список!E$2:E$3002)),ROW(список!E4)-(COLUMN(список!E4)>3)*INT(-COUNTIF(список!$B$2:$B$3002,$A$1)/2))))","v":""},{"$f":"IF(ROW(список!C4)>TRUNC(COUNTIF(список!$B$2:$B$3002,$A$1)/2),\"\",INDEX(список!D$1:D$3002,SMALL(IF(список!$B$2:$B$3002=$A$1,ROW(список!F$2:F$3002)),ROW(список!F4)-(COLUMN(список!F4)>3)*INT(-COUNTIF(список!$B$2:$B$3002,$A$1)/2))))","v":""}]
{"$rows_left_out":1}