{"text_format":"1","workbook":"xlsx","n_sheets":3,"sheets":["Реестр спецификаций","Спецификации","Разные данные"],"not_rendered":{"charts":0,"images":1,"macros":1,"external_links":0,"defined_names":1,"comments":0,"pivot_tables":0},"unopened":[],"bounds":{"document_bytes":16777216,"sheet_cells":100000,"rows_first":2000,"rows_last":500,"rows_between":2000,"halvings":0,"cell_chars":16384,"cell_head_chars":4096},"cells_cut":0,"cells_raw":0,"read":"whole","date_system":"1900"}

{"sheet":"Реестр спецификаций","index":0,"n_rows":5,"n_cols":7,"rows_kept":5,"cut":false,"hidden":false,"merged":[[0,0,0,6]]}
["РЕЕСТР ЗАКАЗОВ-СПЕЦИФИКАЦИЙ"]
[]
["№",null,"ФИО","Адрес доставки\\установки","Контактный\nтелефон","e-mail","Стоимость\nизделий \nруб."]
[1,null,"Иванов Иван Иванович","Санкт-Петербург","8-911-ХХХ","111@mail.ru",{"$f":"Спецификации!C21","v":0}]
[{"$f":"A4+1","v":2},null,"Сидоров А.А.","Сертолово","8-921-ХХХ","222@mail.ru",{"$f":"Спецификации!C22","v":0}]

{"sheet":"Спецификации","index":1,"n_rows":35,"n_cols":8,"rows_kept":35,"cut":false,"hidden":false,"merged":[[12,0,12,1],[14,3,14,4],[25,1,25,7],[19,0,19,1],[20,0,20,1],[21,0,21,1],[14,5,14,7],[22,0,22,1],[0,0,0,2],[2,2,2,7],[3,2,3,7],[4,2,4,7],[5,2,5,7],[0,4,0,7],[2,0,2,1],[3,0,3,1],[4,0,4,1],[5,0,5,1],[6,0,6,1],[9,0,9,1],[8,0,8,1],[10,0,10,1],[11,0,11,1],[7,0,7,5],[6,2,6,7],[8,2,8,4],[10,5,10,7],[11,5,11,7],[9,5,9,7],[34,0,34,2],[9,3,9,4],[10,3,10,4],[11,3,11,4],[12,3,12,4],[13,3,13,4],[30,0,30,2],[31,0,31,2],[32,0,32,2],[17,0,17,7],[12,5,12,7],[13,5,13,7],[31,4,32,5],[28,1,28,7],[13,0,13,1],[14,0,14,1]]}
["ЗАКАЗ-СПЕЦИФИКАЦИЯ № ",null,null,6,"к договору №________ от ___.___.2017г."]
[]
["Исполнитель:",null,"ООО \"ПРИВЕТ\"\nИНН\nКПП\nОГРН\nАДРЕС"]
["Заказчик:",null,"Иванов Иван Иванович"]
["Адрес доставки\\\nустановки:",null,"Санкт-Петербург"]
["Конт. телефон:",null,"8-911-ХХХ"]
["E-mail:",null,"111@mail.ru"]
[]
["Вид изделия:",null,null,null,null,"Кол-во",0,"шт."]
["Название параметра",null,"Значение параметра","Примечание"]
[{"$f":"IF($C$9='Разные данные'!$B$2,'Разные данные'!$A$17,IF($C$9='Разные данные'!$B$3,'Разные данные'!$B$17,IF($C$9='Разные данные'!$B$4,'Разные данные'!$B$17,IF($C$9='Разные данные'!$B$5,'Разные данные'!$B$17,IF($C$9='Разные данные'!$B$6,'Разные данные'!$B$17,IF($C$9='Разные данные'!$B$7,'Разные данные'!$B$17,IF($C$9='Разные данные'!$B$8,'Разные данные'!$B$17,IF($C$9='Разные данные'!$B$9,'Разные данные'!$B$17,IF($C$9='Разные данные'!$B$10,'Разные данные'!$B$17,IF($C$9='Разные данные'!$B$11,'Разные данные'!$B$17,IF($C$9='Разные данные'!$B$12,'Разные данные'!$B$17,IF($C$9='Разные данные'!$B$13,\"-\"))))))))))))","v":"-"}]
[{"$f":"IF($C$9='Разные данные'!$B$2,'Разные данные'!$A$22,IF($C$9='Разные данные'!$B$3,'Разные данные'!$B$22,IF($C$9='Разные данные'!$B$4,'Разные данные'!$B$22,IF($C$9='Разные данные'!$B$5,'Разные данные'!$B$22,IF($C$9='Разные данные'!$B$6,'Разные данные'!$B$22,IF($C$9='Разные данные'!$B$7,'Разные данные'!$B$22,IF($C$9='Разные данные'!$B$8,'Разные данные'!$B$22,IF($C$9='Разные данные'!$B$9,'Разные данные'!$B$22,IF($C$9='Разные данные'!$B$10,'Разные данные'!$B$22,IF($C$9='Разные данные'!$B$11,'Разные данные'!$B$22,IF($C$9='Разные данные'!$B$12,'Разные данные'!$B$22,IF($C$9='Разные данные'!$B$13,\"-\"))))))))))))","v":"-"}]
[{"$f":"IF($C$9='Разные данные'!$B$2,'Разные данные'!$A$27,IF($C$9='Разные данные'!$B$3,'Разные данные'!$B$27,IF($C$9='Разные данные'!$B$4,'Разные данные'!$B$27,IF($C$9='Разные данные'!$B$5,'Разные данные'!$B$27,IF($C$9='Разные данные'!$B$6,'Разные данные'!$B$27,IF($C$9='Разные данные'!$B$7,'Разные данные'!$B$27,IF($C$9='Разные данные'!$B$8,'Разные данные'!$B$27,IF($C$9='Разные данные'!$B$9,'Разные данные'!$B$27,IF($C$9='Разные данные'!$B$10,'Разные данные'!$B$27,IF($C$9='Разные данные'!$B$11,'Разные данные'!$B$27,IF($C$9='Разные данные'!$B$12,'Разные данные'!$B$27,IF($C$9='Разные данные'!$B$13,\"-\"))))))))))))","v":"-"}]
[{"$f":"IF($C$9='Разные данные'!$B$2,'Разные данные'!$A$32,IF($C$9='Разные данные'!$B$3,'Разные данные'!$B$32,IF($C$9='Разные данные'!$B$4,'Разные данные'!$B$32,IF($C$9='Разные данные'!$B$5,'Разные данные'!$B$32,IF($C$9='Разные данные'!$B$6,'Разные данные'!$B$32,IF($C$9='Разные данные'!$B$7,'Разные данные'!$B$32,IF($C$9='Разные данные'!$B$8,'Разные данные'!$B$32,IF($C$9='Разные данные'!$B$9,'Разные данные'!$B$32,IF($C$9='Разные данные'!$B$10,'Разные данные'!$B$32,IF($C$9='Разные данные'!$B$11,'Разные данные'!$B$32,IF($C$9='Разные данные'!$B$12,'Разные данные'!$B$32,IF($C$9='Разные данные'!$B$13,\"-\"))))))))))))","v":"-"}]
[{"$f":"IF($C$9='Разные данные'!$B$2,'Разные данные'!$A$37,IF($C$9='Разные данные'!$B$3,'Разные данные'!$B$37,IF($C$9='Разные данные'!$B$4,'Разные данные'!$B$37,IF($C$9='Разные данные'!$B$5,'Разные данные'!$B$37,IF($C$9='Разные данные'!$B$6,'Разные данные'!$B$37,IF($C$9='Разные данные'!$B$7,'Разные данные'!$B$37,IF($C$9='Разные данные'!$B$8,'Разные данные'!$B$37,IF($C$9='Разные данные'!$B$9,'Разные данные'!$B$37,IF($C$9='Разные данные'!$B$10,'Разные данные'!$B$37,IF($C$9='Разные данные'!$B$11,'Разные данные'!$B$37,IF($C$9='Разные данные'!$B$12,'Разные данные'!$B$37,IF($C$9='Разные данные'!$B$13,\"-\"))))))))))))","v":"-"}]
[]
["Дополнение:"]
[]
[]
["Цена за 1 изделие",null,0,"рублей"]
["Стоимость изделий",null,{"$f":"G9*C20","v":0},"рублей"]
["Доставка",null,0,"рублей"]
["Установка",null,0,"рублей"]
[]
["СУММА \nЗАКАЗА",null,{"$f":"C21+C22+C23","v":0},"рублей"]
[null,{"$f":"ЧислоПрописьюВалюта(C25,1)","v":"рублей 00коп."}]
[]
["Аванс 30%",null,{"$f":"ROUND((C21)*0.3,0)","v":0},"рублей"]
[null,{"$f":"ЧислоПрописьюВалюта(C28,1)","v":"рублей 00коп."}]
[]
["Исполнитель",null,null,null,"Заказчик:"]
["ООО \"Привет\"",null,null,null,{"$f":"INDEX('Реестр спецификаций'!$A$4:$G$5,$D$1,3)","v":{"$error":"#REF!"}}]
["Генеральный директор"]
[]
["__________/__________________/",null,null,null,"__________/_________________/"]

{"sheet":"Разные данные","index":2,"n_rows":37,"n_cols":2,"rows_kept":37,"cut":false,"hidden":false,"merged":[[34,0,34,1],[1,0,12,0],[14,0,14,1],[19,0,19,1],[24,0,24,1],[29,0,29,1]]}
[]
["Тип изделия","Ремонтная накладка на подоконник"]
[null,"Москитная сетка стандартная Z-крепление"]
[null,"Москитная сетка стандартная штоковое крепление"]
[null,"Москитная сетка РУЛОННАЯ"]
[null,"Москитная сетка ПЛИССЕ"]
[null,"Москитная сетка АНТИПЫЛЬ"]
[null,"Москитная сетка АНТИКОШКА"]
[null,"Москитная сетка РАЗДВИЖНАЯ на лоджию "]
[null,"Москитная сетка на балконную дверь (профиль 25)"]
[null,"Москитная сетка на балконную дверь (профиль 32)"]
[null,"Москитная сетка АРОЧНАЯ стандартная"]
[]
[]
["Параметр 1"]
["Ремонтная накладка \nна подоконник","Москитные сетки "]
["Длина","Ширина"]
[]
[]
["Параметр 2"]
["Ремонтная накладка \nна подоконник","Москитные сетки "]
["Ширина","Высота"]
[]
[]
["Параметр 3"]
["Ремонтная накладка \nна подоконник","Москитные сетки "]
["Высота загиба","Цвет"]
[]
[]
["Параметр 4"]
["Ремонтная накладка \nна подоконник","Москитные сетки "]
["Цвет","-"]
[]
[]
["Параметр 5"]
["Ремонтная накладка \nна подоконник","Москитные сетки "]
["Кол-во заглушек, шт.","-"]