{"text_format":"1","workbook":"xlsx","n_sheets":4,"sheets":["ТТС","водители","путевка1","путевка2"],"not_rendered":{"charts":0,"images":0,"macros":1,"external_links":0,"defined_names":2,"comments":0,"pivot_tables":0},"unopened":[],"bounds":{"document_bytes":16777216,"sheet_cells":100000,"rows_first":2000,"rows_last":500,"rows_between":2000,"halvings":0,"cell_chars":16384,"cell_head_chars":4096},"cells_cut":0,"cells_raw":0,"read":"whole","date_system":"1900"}

{"sheet":"ТТС","index":0,"n_rows":13,"n_cols":29,"rows_kept":13,"cut":false,"hidden":false,"merged":[[3,0,4,0],[2,0,2,12],[3,6,4,6],[3,7,4,7],[3,13,4,13],[2,13,2,18],[3,1,4,1],[3,2,4,2],[3,3,4,3],[3,4,4,4],[3,5,4,5],[3,8,3,10],[3,11,4,11],[3,19,4,19],[3,20,4,20],[3,21,3,22],[0,1,0,12],[1,1,1,12],[3,14,4,14],[3,15,4,15],[3,16,4,16],[3,17,4,17],[3,18,4,18],[2,19,2,27]]}
[null,"Журнал учета путевых листов ООО \"ТехТрансСервис\""]
[null,"2017-08-01"]
["Заполняется при выпуске путевого листа",null,null,null,null,null,null,null,null,null,null,null,null,"Изменяется при получении п/л если есть отклонения "]
["Х","№ п/л","Дата","Марка а/м","№ а/м","Ф.И.О. водителя","№ водительского удостоверения","Табельный номер","Маршрут",null,null,"Заказчик","а/к","Отметка о сдаче п/л","Дата","Марка а/м","№ а/м","Ф.И.О. водителя","Заказчик","Общее кол-во рейсов","Общий объём м3  ","ПОВТОР",null,"ЭкоТранс ","Экология Пром","Даниловский-2","ПОВТОР - Экология Пром","ПОВТОР-ЭкоТранс","Даниловский-2 или другой полигон"]
[null,null,null,null,null,null,null,null,"рейс №1","рейс №2","рейс №3",null,null,null,null,null,null,null,null,null,null,"рейс","м3","рейс","рейс","рейс","рейс","рейс","рейс"]
["п","0029666","2016-09-03","КАМАЗ","А 603 ХН","Фролов В.В.",{"$f":"VLOOKUP($F6,водители!$A$2:$B$6,2,0)","v":"77 ХХ 777 777"},{"$f":"VLOOKUP($F6,водители!$A$1:$E$6,5,0)","v":135},"УК-2 (КГО)","УК-2 (КГО)",null,null,2]
["п","0029667","2016-09-03","КАМАЗ","А 607 ХН","Зайцев А.А.",{"$f":"VLOOKUP($F7,водители!$A$2:$B$6,2,0)","v":"78 ХХ 777 888"},{"$f":"VLOOKUP($F7,водители!$A$1:$E$6,5,0)","v":204},"РЭУ-13 (КГО)","РЭУ-13 (КГО)",null,null,2]
["п","0029668","2016-09-03","КАМАЗ","В 306 ЕН","Берсенев А.А.",{"$f":"VLOOKUP($F8,водители!$A$2:$B$6,2,0)","v":"79 ХХ 777 333"},{"$f":"VLOOKUP($F8,водители!$A$1:$E$6,5,0)","v":332},"Частный сектор","Частный сектор",null,null,2]
[null,"0029669","2016-09-03","ХТЗ-150К-09-25","СУ 6326","Панин И.А.",{"$f":"VLOOKUP($F9,водители!$A$2:$B$6,2,0)","v":"80 ХХ 777 444"},{"$f":"VLOOKUP($F9,водители!$A$1:$E$6,5,0)","v":184},"Клининг(дорожники)",null,null,null,2]
[null,"0029670","2016-09-03","Амкадор","СУ 5828","Юсупов Д.Э.",{"$f":"VLOOKUP($F10,водители!$A$2:$B$6,2,0)","v":"81 ХХ 777 999"},{"$f":"VLOOKUP($F10,водители!$A$1:$E$6,5,0)","v":341},"Клининг(дорожники)",null,null,null,2]
[null,null,null,null,null,null,{"$f":"VLOOKUP($F11,водители!$A$2:$B$6,2,0)","v":{"$error":"#N/A"}},{"$f":"VLOOKUP($F11,водители!$A$1:$E$6,5,0)","v":{"$error":"#N/A"}}]
[null,null,null,null,null,null,{"$f":"VLOOKUP($F12,водители!$A$2:$B$6,2,0)","v":{"$error":"#N/A"}},{"$f":"VLOOKUP($F12,водители!$A$1:$E$6,5,0)","v":{"$error":"#N/A"}}]
[null,null,null,null,null,null,{"$f":"VLOOKUP($F13,водители!$A$2:$B$6,2,0)","v":{"$error":"#N/A"}},{"$f":"VLOOKUP($F13,водители!$A$1:$E$6,5,0)","v":{"$error":"#N/A"}}]

{"sheet":"водители","index":1,"n_rows":224,"n_cols":6,"rows_kept":224,"cut":false,"hidden":false,"merged":[]}
["ФИО","№ водительского удостоверения","Должность","Фамилия Имя Отчество","ТАБЕЛЬ"]
["Фролов В.В.","77 ХХ 777 777","Водитель автомобиля    ЗПБО","Аббясов Рамиль Расимович",135," "]
["Зайцев А.А.","78 ХХ 777 888","Тракторист 4 разряда   ЗПБО","Абдюшев Руфил Равилович",204]
["Берсенев А.А.","79 ХХ 777 333","Тракторист 4 разряда   ЗПБО","Абрамов Александр Анатольевич",332]
["Панин И.А.","80 ХХ 777 444","Водитель автомобиля","Абрамов Михаил Константинович",184]
["Юсупов Д.Э.","81 ХХ 777 999","Тракторист 4 разряда   ЗПБО","Абрамов Сергей Анатольевич",341]
[]
[]
[]
[]
[]
[]
[]
[]
[]
{"$rows_left_out":210}
{"sheet":"путевка1","index":2,"n_rows":51,"n_cols":180,"rows_kept":51,"cut":false,"hidden":false,"merged":[[43,14,44,26],[43,29,44,59],[43,102,44,113],[43,116,44,139],[48,1,50,10],[9,15,10,102],[6,99,7,117],[8,165,8,187],[9,176,10,187],[23,156,23,163],[23,166,23,184],[47,102,47,113],[47,116,47,139],[40,102,40,113],[40,116,40,139],[35,109,35,139],[32,83,33,108],[49,102,49,113],[49,116,49,139],[42,102,42,113],[42,116,42,139],[41,145,41,166],[41,167,41,187],[39,145,39,187],[40,145,40,187],[38,145,38,187],[37,109,37,139],[36,178,36,187],[29,167,29,185],[2,152,3,161],[32,159,32,187],[38,0,38,57],[38,58,38,71],[38,72,38,82],[38,83,38,108],[38,109,38,139],[37,0,37,2],[37,3,37,57],[37,58,37,71],[37,72,37,82],[34,164,34,187],[31,141,37,144],[37,156,37,185],[35,58,35,71],[35,72,35,82],[35,83,35,108],[31,0,31,108],[31,109,31,139],[37,83,37,108],[32,109,32,139],[36,58,36,71],[36,72,36,82],[36,83,36,108],[35,0,35,2],[35,3,35,57],[34,0,34,57],[34,58,34,71],[34,72,34,82],[36,109,36,139],[33,109,33,139],[34,109,34,139],[36,0,36,2],[36,3,36,57],[46,29,46,59],[47,14,47,26],[47,29,47,59],[45,115,45,139],[46,115,46,139],[29,120,29,128],[29,129,29,139],[28,0,29,14],[28,55,29,72],[29,73,29,82],[28,99,28,108],[29,109,29,119],[28,73,28,82],[28,24,29,32],[28,33,29,41],[28,83,28,98],[29,83,29,89],[29,90,29,98],[29,99,29,108],[32,0,33,57],[33,58,33,71],[33,72,33,82],[32,58,32,82],[30,0,30,24],[27,73,27,82],[26,145,26,187],[28,145,28,187],[27,120,27,128],[27,129,27,139],[28,109,28,139],[26,109,26,119],[27,109,27,119],[26,120,26,128],[26,129,26,139],[30,25,30,139],[34,83,34,108],[26,73,26,82],[26,83,26,89],[26,90,26,98],[25,55,25,63],[26,0,26,14],[26,15,26,23],[26,24,26,32],[26,33,26,41],[26,42,26,54],[26,55,26,63],[26,99,26,108],[27,0,27,14],[27,15,27,23],[27,24,27,32],[27,33,27,41],[27,42,27,54],[27,55,27,63],[27,64,27,72],[26,64,26,72],[27,83,27,89],[27,90,27,98],[27,99,27,108],[13,119,13,139],[23,120,24,139],[14,119,14,139],[16,145,17,167],[18,145,18,156],[18,157,18,167],[15,12,15,98],[15,119,15,139],[16,12,16,98],[19,26,19,59],[19,145,20,156],[21,9,21,31],[21,67,21,91],[21,157,21,167],[20,22,20,59],[19,70,20,91],[24,156,24,163],[24,166,24,184],[21,178,21,187],[19,178,20,187],[24,83,24,98],[19,157,20,167],[19,141,24,144],[21,119,21,139],[24,33,25,41],[25,120,25,128],[25,129,25,139],[16,168,17,187],[19,168,20,177],[21,145,21,156],[21,168,21,177],[25,64,25,72],[19,97,20,110],[19,92,20,96],[23,55,23,119],[24,109,25,119],[24,99,25,108],[25,90,25,98],[24,73,25,82],[25,83,25,89],[24,55,24,72],[12,109,12,117],[11,108,11,117],[6,56,6,71],[9,103,10,117],[8,15,8,103],[8,107,8,117],[11,0,11,106],[6,146,7,158],[6,160,7,187],[9,146,10,175],[6,119,7,139],[8,119,8,139],[9,119,10,139],[11,156,11,187],[11,119,11,139],[12,119,12,139],[12,146,12,187],[6,35,6,52],[5,77,5,96],[5,119,5,139],[1,90,2,139],[3,90,4,139],[2,162,3,178],[5,151,5,168],[2,25,4,57],[0,2,0,20],[5,56,5,71],[1,2,2,20],[0,145,1,187],[5,72,5,76],[48,157,48,166],[49,157,49,166],[48,102,48,113],[48,116,48,139],[47,167,47,178],[41,20,41,50],[41,102,41,113],[41,116,41,139],[48,169,48,186],[45,145,46,156],[45,157,46,166],[45,167,46,178],[45,179,46,187],[42,179,44,187],[49,146,50,151],[49,169,49,186],[47,179,47,187],[47,145,47,156],[47,157,47,166],[50,102,50,113],[50,116,50,139],[42,14,42,26],[42,29,42,59],[46,14,46,26],[42,145,44,156],[42,157,44,166],[42,167,44,178],[13,146,13,187],[18,168,18,177],[18,178,18,187],[31,156,31,173],[28,42,29,54],[13,22,13,118],[17,20,17,83],[40,20,40,50],[22,9,22,31],[14,36,14,98],[15,99,15,117],[14,100,14,117],[17,92,17,107],[18,26,18,59],[28,15,29,23],[14,146,14,187],[24,0,25,14],[24,15,25,23],[24,24,25,32],[23,0,23,54],[24,42,25,54]]}
[4,null,"Место для штампа",null,null,null,null,null,null,null,null,null,null,null,null,null,null,null,null,null,null,null,null,null,null,null,null,null,null,null,null,null,null,null,null,null,null,null,null,null,null,null,null,null,null,null,null,null,null,null,null,null,null,null,null,null,null,null,null,null,null,null,null,null,null,null,null,null,null,null,null,null,null,null,null,null,null,null,null,null,null,null,null,null,null,null,null,null,null,null,"Типовая межотраслевая форма № 3 спец.",null,null,null,null,null,null,null,null,null,null,null,null,null,null,null,null,null,null,null,null,null,null,null,null,null,null,null,null,null,null,null,null,null,null,null,null,null,null,null,null,null,null,null,null,null,null,null,null,null,null,null,null,null,null,"Талон первого заказчика к путевому"]
[null,null,"организации",null,null,null,null,null,null,null,null,null,null,null,null,null,null,null,null,null,null,null,null,null,null,null,null,null,null,null,null,null,null,null,null,null,null,null,null,null,null,null,null,null,null,null,null,null,null,null,null,null,null,null,null,null,null,null,null,null,null,null,null,null,null,null,null,null,null,null,null,null,null,null,null,null,null,null,null,null,null,null,null,null,null,null,null,null,null,null,"Утверждена постановлением Госкомстата России"]
[null,null,null,null,null,null,null,null,null,null,null,null,null,null,null,null,null,null,null,null,null,null,null,null,null,"ПУТЕВОЙ ЛИСТ",null,null,null,null,null,null,null,null,null,null,null,null,null,null,null,null,null,null,null,null,null,null,null,null,null,null,null,null,null,null,null,null,null,null,null,null,null,null,null,null,null,null,null,null,null,null,null,null,null,null,null,null,null,null,null,null,null,null,null,null,null,null,null,null,null,null,null,null,null,null,null,null,null,null,null,null,null,null,null,null,null,null,null,null,null,null,null,null,null,null,null,null,null,null,null,null,null,null,null,null,null,null,null,null,null,null,null,null,null,null,null,null,null,null,null,null,null,null,null,null,null,null,null,null,null,null,"листу №"]
[null,null,null,null,null,null,null,null,null,null,null,null,null,null,null,null,null,null,null,null,null,null,null,null,null,null,null,null,null,null,null,null,null,null,null,null,null,null,null,null,null,null,null,null,null,null,null,null,null,null,null,null,null,null,null,null,null,null,null,null,null,null,null,null,null,null,null,null,null,null,null,null,null,null,null,null,null,null,null,null,null,null,null,null,null,null,null,null,null,null,"от 28.11.97 № 78"]
[]
[null,null,null,null,null,null,null,null,null,null,null,null,null,null,null,null,null,null,null,"специального автомобиля",null,null,null,null,null,null,null,null,null,null,null,null,null,null,null,null,null,null,null,null,null,null,null,null,null,null,null,null,null,null,null,null,null,null,null,null,"ОТ-63",null,null,null,null,null,null,null,null,null,null,null,null,null,null,null,"№",null,null,null,null,{"$f":"VLOOKUP(\"п\",ТТС!A6:M16,2,0)","v":"0029666"},null,null,null,null,null,null,null,null,null,null,null,null,null,null,null,null,null,null,null,null,null,null,null,null,null,null,null,null,null,null,null,null,null,null,null,null,null,null,null,null,null,"Коды",null,null,null,null,null,null,null,null,null,null,null,null,null,null,null,null,null,null,null,null,null,null,null,null,null,null,null,"от",null,null,null,{"$f":"AJ7","v":"2016-09-03"},null,null,null,null,null,null,null,null,null,null,null,null,null,null,null,null,null,"г."]
[null,null,null,null,null,null,null,null,null,null,null,null,null,null,null,null,null,null,null,null,null,null,null,null,null,null,null,null,null,null,null,null,null,null,null,{"$f":"VLOOKUP(\"п\",ТТС!A6:M16,3,0)","v":"2016-09-03"},null,null,null,null,null,null,null,null,null,null,null,null,null,null,null,null,null,"г.",null,null,"(серия)",null,null,null,null,null,null,null,null,null,null,null,null,null,null,null,null,null,null,null,null,null,null,null,null,null,null,null,null,null,null,null,null,null,null,null,null,null,null,null,null,null,null,"Форма по ОКУД",null,null,null,null,null,null,null,null,null,null,null,null,null,null,null,null,null,null,null,345002,null,null,null,null,null,null,null,null,null,null,null,null,null,null,null,null,null,null,null,null,null,null,null,null,null,null,"Организация"]
[]
["Организация",null,null,null,null,null,null,null,null,null,null,null,null,null,null,null,null,null,null,null,null,null,null,null,null,null,null,null,null,null,null,null,null,null,null,null,null,null,null,null,null,null,null,null,null,null,null,null,null,null,null,null,null,null,null,null,null,null,null,null,null,null,null,null,null,null,null,null,null,null,null,null,null,null,null,null,null,null,null,null,null,null,null,null,null,null,null,null,null,null,null,null,null,null,null,null,null,null,null,null,null,null,null,null,null,null,null,"по ОКПО",null,null,null,null,null,null,null,null,null,null,null,85936045,null,null,null,null,null,null,null,null,null,null,null,null,null,null,null,null,null,null,null,null,null,null,null,null,null,null,"Марка автомобиля",null,null,null,null,null,null,null,null,null,null,null,null,null,null,null,null,null,null,{"$f":"W14","v":"КАМАЗ"}]
[null,null,null,null,null,null,null,null,null,null,null,null,null,null,null,"445043, Самарская обл., г.Тольятти, ул. Северная, д.40, оф. 211",null,null,null,null,null,null,null,null,null,null,null,null,null,null,null,null,null,null,null,null,null,null,null,null,null,null,null,null,null,null,null,null,null,null,null,null,null,null,null,null,null,null,null,null,null,null,null,null,null,null,null,null,null,null,null,null,null,null,null,null,null,null,null,null,null,null,null,null,null,null,null,null,null,null,null,null,null,null,null,null,null,null,null,null,null,null,null,"Режим работы",null,null,null,null,null,null,null,null,null,null,null,null,null,null,null,17,null,null,null,null,null,null,null,null,null,null,null,null,null,null,null,null,null,null,null,null,null,null,null,null,null,null,"Государственный номерной знак",null,null,null,null,null,null,null,null,null,null,null,null,null,null,null,null,null,null,null,null,null,null,null,null,null,null,null,null,null,{"$f":"AK15","v":"А 603 ХН"}]
[]
[null,null,null,null,null,null,null,null,null,null,null,null,null,null,null,null,null,null,null,null,null,null,null,null,null,null,null,null,null,null,null,null,null,null,null,null,null,null,null,null,null,null,null,null,null,null,null,null,null,null,null,null,null,null,null,null,null,null,null,null,null,null,null,null,null,null,null,null,null,null,null,null,null,null,null,null,null,null,null,null,null,null,null,null,null,null,null,null,null,null,null,null,null,null,null,null,null,null,null,null,null,null,null,null,null,null,null,null,"Колонна",null,null,null,null,null,null,null,null,null,null,{"$f":"VLOOKUP(\"п\",ТТС!A6:M16,13,0)","v":2},null,null,null,null,null,null,null,null,null,null,null,null,null,null,null,null,null,null,null,null,null,null,null,null,null,null,"Заказчик"]
[null,null,null,null,null,null,null,null,null,null,null,null,null,null,null,null,null,null,null,null,null,null,null,null,null,null,null,null,null,null,null,null,null,null,null,null,null,null,null,null,null,null,null,null,null,null,null,null,null,null,null,null,null,null,null,null,null,null,null,null,null,null,null,null,null,null,null,null,null,null,null,null,null,null,null,null,null,null,null,null,null,null,null,null,null,null,null,null,null,null,null,null,null,null,null,null,null,null,null,null,null,null,null,null,null,null,null,null,null,"Бригада"]
["Марка автомобиля",null,null,null,null,null,null,null,null,null,null,null,null,null,null,null,null,null,null,null,null,null,{"$f":"VLOOKUP(\"п\",ТТС!A6:M16,4,0)","v":"КАМАЗ"}]
["Государственный номерной знак",null,null,null,null,null,null,null,null,null,null,null,null,null,null,null,null,null,null,null,null,null,null,null,null,null,null,null,null,null,null,null,null,null,null,null,{"$f":"VLOOKUP(\"п\",ТТС!A6:M16,5,0)","v":"А 603 ХН"},null,null,null,null,null,null,null,null,null,null,null,null,null,null,null,null,null,null,null,null,null,null,null,null,null,null,null,null,null,null,null,null,null,null,null,null,null,null,null,null,null,null,null,null,null,null,null,null,null,null,null,null,null,null,null,null,null,null,null,null,null,null,null,"Гаражный номер",null,null,null,null,null,null,null,null,null,null,null,null,null,null,null,null,null,null,null,null,null,null,null,null,null,null,null,null,null,null,null,null,null,null,null,null,null,null,null,null,null,null,null,null,null,"(фамилия, и., о. ответственного лица)"]
{"$rows_left_out":37}
{"sheet":"путевка2","index":3,"n_rows":39,"n_cols":185,"rows_kept":39,"cut":false,"hidden":false,"merged":[[27,146,28,184],[29,146,29,184],[37,122,37,145],[37,146,37,184],[35,146,35,184],[34,68,34,74],[34,75,34,83],[34,84,34,101],[33,122,33,145],[36,122,36,145],[34,122,34,145],[33,146,33,184],[34,146,34,184],[36,146,36,184],[35,122,35,145],[38,16,38,22],[35,30,35,38],[35,60,35,121],[36,42,36,121],[37,42,37,121],[37,16,37,22],[37,24,37,38],[38,24,38,38],[34,102,34,121],[34,42,34,67],[26,122,26,145],[31,146,31,184],[26,30,26,38],[26,42,26,57],[34,0,34,2],[34,3,34,17],[33,18,33,29],[33,30,33,38],[34,18,34,29],[34,30,34,38],[33,102,33,121],[33,84,33,101],[33,42,33,67],[33,68,33,74],[33,75,33,83],[32,146,32,184],[26,146,26,184],[32,30,32,38],[32,42,32,67],[32,68,32,74],[32,75,32,83],[32,122,32,145],[32,84,32,101],[32,102,32,121],[27,30,27,38],[27,102,30,121],[25,122,25,145],[25,146,25,184],[30,146,30,184],[29,30,31,38],[30,75,30,83],[31,42,31,67],[31,68,31,74],[31,75,31,83],[23,39,31,41],[27,42,27,101],[23,84,24,107],[23,71,24,83],[31,102,31,121],[28,42,30,67],[28,68,30,74],[28,75,29,101],[30,84,30,101],[31,84,31,101],[31,122,31,145],[29,122,29,145],[27,122,28,145],[30,122,30,145],[26,58,26,70],[26,71,26,83],[26,84,26,107],[25,84,25,107],[26,108,26,121],[25,108,25,121],[25,30,25,38],[25,42,25,57],[25,58,25,70],[25,71,25,83],[22,0,22,38],[22,71,22,107],[20,42,20,67],[20,68,20,95],[20,96,20,145],[20,146,20,184],[22,108,24,121],[23,0,23,29],[23,30,23,38],[22,42,22,70],[24,0,24,29],[24,30,24,38],[23,42,24,57],[23,58,24,70],[22,122,22,145],[22,146,22,184],[23,122,23,145],[23,146,23,184],[24,122,24,145],[24,146,24,184],[21,42,21,121],[21,122,21,184],[17,96,17,145],[17,146,17,184],[16,30,16,38],[19,0,19,38],[18,16,18,22],[18,24,18,38],[17,42,17,67],[17,16,17,22],[17,24,17,38],[16,39,20,41],[18,146,18,184],[19,42,19,67],[19,68,19,95],[19,96,19,145],[19,146,19,184],[18,42,18,67],[18,68,18,95],[18,96,18,145],[17,68,17,95],[16,42,16,95],[15,96,16,184],[20,0,21,38],[8,96,8,111],[10,30,12,38],[11,42,12,70],[8,42,10,70],[13,139,14,145],[13,146,14,184],[13,42,14,70],[13,71,14,86],[13,87,14,95],[13,96,13,111],[14,96,14,111],[8,71,10,86],[11,139,12,145],[11,146,12,184],[8,146,10,184],[11,71,12,86],[11,87,12,95],[11,96,11,111],[12,96,12,111],[8,139,10,145],[8,112,8,138],[9,112,10,138],[8,87,10,95],[9,96,10,111],[13,30,13,38],[15,0,15,1],[15,2,15,18],[15,19,15,29],[15,30,15,38],[14,30,14,38],[13,112,13,138],[14,112,14,138],[11,112,11,138],[12,112,12,138],[8,0,8,25],[14,0,14,1],[14,2,14,18],[14,19,14,29],[13,0,13,18],[13,19,13,29],[10,0,12,18],[10,19,12,29],[15,42,15,95],[8,26,8,38],[0,0,0,38],[1,0,1,38],[3,0,3,38],[4,0,4,25],[4,26,4,38],[4,71,4,86],[1,42,1,184],[4,148,4,164],[7,71,7,86],[6,3,6,25],[7,3,7,25],[5,146,5,158],[6,146,6,158],[2,139,2,184],[2,112,2,138],[2,96,2,111],[5,0,5,25],[5,26,5,38],[2,42,6,70],[3,96,4,111],[3,139,6,145],[3,167,3,181],[3,148,3,164],[2,71,2,95],[4,87,4,95],[6,0,6,2],[7,0,7,2],[4,167,4,181],[5,96,6,111],[3,112,4,138],[5,112,6,138],[5,159,5,181],[6,159,6,181],[6,26,6,38],[7,42,7,70],[7,146,7,184],[7,26,7,38],[7,87,7,95],[7,96,7,111],[7,112,7,138],[7,139,7,145],[25,3,25,29],[26,3,26,29],[33,0,33,2],[33,3,33,17],[25,0,25,2],[26,0,26,2],[29,0,31,17],[29,18,31,29],[32,18,32,29],[32,0,32,17],[27,0,27,29]]}
["Сведения о выполненной работе",null,null,null,null,null,null,null,null,null,null,null,null,null,null,null,null,null,null,null,null,null,null,null,null,null,null,null,null,null,null,null,null,null,null,null,null,null,null,null,null,null,null,null,null,null,null,null,null,null,null,null,null,null,null,null,null,null,null,null,null,null,null,null,null,null,null,null,null,null,null,null,null,null,null,null,null,null,null,null,null,null,null,null,null,null,null,null,null,null,null,null,null,null,null,null,null,null,null,null,null,null,null,null,null,null,null,null,null,null,null,null,null,null,null,null,null,null,null,null,null,null,null,null,null,null,null,null,null,null,null,null,null,null,null,null,null,null,null,null,null,null,null,null,null,null,null,null,null,null,null,null,null,null,null,null,null,null,null,null,null,null,null,null,null,null,null,null,null,null,null,null,null,null,null,null,null,null,null,null,null,null,null,null,"Оборотная сторона формы № 3 спец."]
["(заполняется организацией)",null,null,null,null,null,null,null,null,null,null,null,null,null,null,null,null,null,null,null,null,null,null,null,null,null,null,null,null,null,null,null,null,null,null,null,null,null,null,null,null,null,"О т м е т к а   о   в ы п о л н е н и и   з а д а н и я"]
[null,null,null,null,null,null,null,null,null,null,null,null,null,null,null,null,null,null,null,null,null,null,null,null,null,null,null,null,null,null,null,null,null,null,null,null,null,null,null,null,null,null,"маршрут движения\nили объект работы",null,null,null,null,null,null,null,null,null,null,null,null,null,null,null,null,null,null,null,null,null,null,null,null,null,null,null,null,"вид работы",null,null,null,null,null,null,null,null,null,null,null,null,null,null,null,null,null,null,null,null,null,null,null,null,"время, ч. мин.",null,null,null,null,null,null,null,null,null,null,null,null,null,null,null,"показания спидометра при",null,null,null,null,null,null,null,null,null,null,null,null,null,null,null,null,null,null,null,null,null,null,null,null,null,null,"заказчик"]
["Вид работы",null,null,null,null,null,null,null,null,null,null,null,null,null,null,null,null,null,null,null,null,null,null,null,null,null,null,null,null,null,null,null,null,null,null,null,null,null,null,null,null,null,null,null,null,null,null,null,null,null,null,null,null,null,null,null,null,null,null,null,null,null,null,null,null,null,null,null,null,null,null,null,null,null,null,null,null,null,null,null,null,null,null,null,null,null,null,null,null,null,null,null,null,null,null,null,"прибытия",null,null,null,null,null,null,null,null,null,null,null,null,null,null,null,"прибытии",null,null,null,null,null,null,null,null,null,null,null,null,null,null,null,null,null,null,null,null,null,null,null,null,null,null,"код"]
["наименование",null,null,null,null,null,null,null,null,null,null,null,null,null,null,null,null,null,null,null,null,null,null,null,null,null,"код",null,null,null,null,null,null,null,null,null,null,null,null,null,null,null,null,null,null,null,null,null,null,null,null,null,null,null,null,null,null,null,null,null,null,null,null,null,null,null,null,null,null,null,null,"наименование",null,null,null,null,null,null,null,null,null,null,null,null,null,null,null,"код",null,null,null,null,null,null,null,null,null,null,null,null,null,null,null,null,null,null,null,null,null,null,null,null,null,null,null,null,null,null,null,null,null,null,null,null,null,null,null,null,null,null,null,null,null,null,null,null,null,null,null,null,null,null,null,null,null,null,null,null,"(должность)",null,null,null,null,null,null,null,null,null,null,null,null,null,null,null,null,null,null,"(подпись)"]
[27,null,null,null,null,null,null,null,null,null,null,null,null,null,null,null,null,null,null,null,null,null,null,null,null,null,28,null,null,null,null,null,null,null,null,null,null,null,null,null,null,null,null,null,null,null,null,null,null,null,null,null,null,null,null,null,null,null,null,null,null,null,null,null,null,null,null,null,null,null,null,null,null,null,null,null,null,null,null,null,null,null,null,null,null,null,null,null,null,null,null,null,null,null,null,null,"убытия",null,null,null,null,null,null,null,null,null,null,null,null,null,null,null,"убытии",null,null,null,null,null,null,null,null,null,null,null,null,null,null,null,null,null,null,null,null,null,null,null,null,null,null,null,null,null,null,null,null,null,"место для"]
["1.",null,null,null,null,null,null,null,null,null,null,null,null,null,null,null,null,null,null,null,null,null,null,null,null,null,null,null,null,null,null,null,null,null,null,null,null,null,null,null,null,null,null,null,null,null,null,null,null,null,null,null,null,null,null,null,null,null,null,null,null,null,null,null,null,null,null,null,null,null,null,null,null,null,null,null,null,null,null,null,null,null,null,null,null,null,null,null,null,null,null,null,null,null,null,null,null,null,null,null,null,null,null,null,null,null,null,null,null,null,null,null,null,null,null,null,null,null,null,null,null,null,null,null,null,null,null,null,null,null,null,null,null,null,null,null,null,null,null,null,null,null,null,null,null,null,"штампа",null,null,null,null,null,null,null,null,null,null,null,null,"(расшифровка подписи)"]
["2.",null,null,null,null,null,null,null,null,null,null,null,null,null,null,null,null,null,null,null,null,null,null,null,null,null,null,null,null,null,null,null,null,null,null,null,null,null,null,null,null,null,37,null,null,null,null,null,null,null,null,null,null,null,null,null,null,null,null,null,null,null,null,null,null,null,null,null,null,null,null,38,null,null,null,null,null,null,null,null,null,null,null,null,null,null,null,39,null,null,null,null,null,null,null,null,40,null,null,null,null,null,null,null,null,null,null,null,null,null,null,null,41,null,null,null,null,null,null,null,null,null,null,null,null,null,null,null,null,null,null,null,null,null,null,null,null,null,null,42,null,null,null,null,null,null,43]
[]
[]
["Время оплачи-\nваемое, ч. мин.",null,null,null,null,null,null,null,null,null,null,null,null,null,null,null,null,null,null,"Тариф,\nруб. коп.",null,null,null,null,null,null,null,null,null,null,"Всего к\nоплате,\nруб. коп."]
[]
[]
[29,null,null,null,null,null,null,null,null,null,null,null,null,null,null,null,null,null,null,30,null,null,null,null,null,null,null,null,null,null,31]
["1."]
{"$rows_left_out":24}