{"text_format":"1","workbook":"xlsx","n_sheets":3,"sheets":["Динамика","01082017","Лист3"],"not_rendered":{"charts":0,"images":0,"macros":1,"external_links":0,"defined_names":1,"comments":0,"pivot_tables":0},"unopened":[],"bounds":{"document_bytes":16777216,"sheet_cells":100000,"rows_first":2000,"rows_last":500,"rows_between":2000,"halvings":0,"cell_chars":16384,"cell_head_chars":4096},"cells_cut":0,"cells_raw":0,"read":"whole","date_system":"1900"}

{"sheet":"Динамика","index":0,"n_rows":9,"n_cols":10,"rows_kept":9,"cut":false,"hidden":false,"merged":[[7,0,7,1],[8,0,8,1]]}
[]
["Фирма","ИНН","Информация","по","другим","итогам","Август","Апрель","Март","Разница за последние два месяца"]
[{"$f":"INDEX('01082017'!A$1:A$1806,MATCH($B3,'01082017'!$D$1:$D$1809,0))","v":"Рога и копыта"},11233222,null,null,null,null,{"$f":"INDEX('01082017'!G$1:G$1806,MATCH($B3,'01082017'!$D$1:$D$1809,0))","v":12},1,2,{"$f":"INDIRECT(\"G\"&ROW(),1)-INDIRECT(\"H\"&ROW(),1)","v":11}]
[{"$f":"INDEX('01082017'!A$1:A$1806,MATCH($B4,'01082017'!$D$1:$D$1809,0))","v":"Вася пупкин"},32166666,null,null,null,null,{"$f":"INDEX('01082017'!G$1:G$1806,MATCH($B4,'01082017'!$D$1:$D$1809,0))","v":10},3,4,{"$f":"INDIRECT(\"G\"&ROW(),1)-INDIRECT(\"H\"&ROW(),1)","v":7}]
[{"$f":"INDEX('01082017'!A$1:A$1806,MATCH($B5,'01082017'!$D$1:$D$1809,0))","v":"Всё для вас"},15622222,null,null,null,null,{"$f":"INDEX('01082017'!G$1:G$1806,MATCH($B5,'01082017'!$D$1:$D$1809,0))","v":5},5,6,0]
["Всё что было",78911111,null,null,null,null,{"$f":"IFERROR(INDEX('01082017'!G$1:G$1806,MATCH($B6,'01082017'!$D$1:$D$1809,0)),0)","v":0},7,8,-7]
[{"$f":"INDEX('01082017'!A$1:A$1806,MATCH($B7,'01082017'!$D$1:$D$1809,0))","v":{"$error":"#N/A"}},12499999,null,null,null,null,{"$f":"IFERROR(INDEX('01082017'!G$1:G$1806,MATCH($B7,'01082017'!$D$1:$D$1809,0)),0)","v":0},null,null,0]
["Другие фирмы",null,null,null,null,null,{"$f":"INDEX('01082017'!G$1:G$1806,MATCH($A8,'01082017'!$A$1:$A$1809,0))","v":120},30,null,90]
["Итог",null,null,null,null,null,{"$f":"SUM(G3:G8)","v":147}]

{"sheet":"01082017","index":1,"n_rows":39,"n_cols":9,"rows_kept":39,"cut":false,"hidden":false,"merged":[[18,0,18,2],[19,0,19,2],[3,0,5,2],[3,3,5,4],[6,0,7,2],[6,3,6,4],[8,0,8,2],[8,3,8,4],[14,0,14,2],[17,0,17,2],[13,0,13,2],[16,0,16,2],[18,3,18,4],[38,0,38,2],[24,3,24,4],[35,0,35,2],[20,0,20,2],[26,0,26,2],[30,0,30,2],[21,0,21,2],[22,0,22,2],[23,0,23,2],[24,0,24,2]]}
[]
[]
[]
["Контрагент",null,null,"ИНН"]
[]
[]
["Шифр",null,null,"Договор"]
[null,null,null,"номер","дата","другая","информация","по","контрагенту"]
["Рога и копыта",null,null,11233222,null,null,12]
[null,null,null,"2013/3197 ","29.07.2013"]
[null,null,null,"2013/3197 ","29.07.2013"]
[null,null,null,"2013/3197","29.07.2013"]
[null,null,null,"2013/3197","29.07.2013"]
["рога",null,null,"2014/2-516","28.10.2014"]
["копыта",null,null,"2014/2-531","30.10.2014"]
[null,null,null,"2014/2-556","13.11.2014"]
["уши",null,null,"2014/2-316","01.08.2014"]
["хвосты",null,null,"2014/2-333","31.07.2014"]
["Вася пупкин",null,null,32166666,null,null,10]
["вино",null,null," 3153 ","16.07.2012"]
["водка",null,null," 3152 ","16.07.2012"]
["пиво",null,null,1541,"22.12.2011"]
["воды",null,null,3007,"22.05.2012"]
["закуска",null,null,"ИА-13-302","04.04.2013"]
["Всё для вас",null,null,15622222,null,null,5]
[null,null,null,"ИА-13-302"]
["Ничего для нас",null,null,42555555,null,null,22]
[null,null,null,2134]
[null,null,null,"ИА-13-302"]
[null,null,null,654]
["Все себе",null,null,66611111,null,null,33]
[null,null,null,258]
[null,null,null,"ИА-13-302"]
[null,null,null,"ИА-13-302"]
[null,null,null,456]
["Лучшее детям",null,null,13444444,null,null,44]
[null,null,null,"ИА-13-302"]
[null,null,null,354]
["Другие фирмы",null,null,null,null,null,120]

{"sheet":"Лист3","index":2,"n_rows":0,"n_cols":0,"rows_kept":0,"cut":false,"hidden":false,"merged":[]}