{"text_format":"1","workbook":"xlsx","n_sheets":5,"sheets":["Лист1","Лист2","Лист3","Лист4","Лист5"],"not_rendered":{"charts":0,"images":0,"macros":0,"external_links":0,"defined_names":1,"comments":0,"pivot_tables":0},"unopened":[],"bounds":{"document_bytes":16777216,"sheet_cells":100000,"rows_first":2000,"rows_last":500,"rows_between":2000,"halvings":0,"cell_chars":16384,"cell_head_chars":4096},"cells_cut":0,"cells_raw":0,"read":"whole","date_system":"1900"}

{"sheet":"Лист1","index":0,"n_rows":16,"n_cols":1,"rows_kept":16,"cut":false,"hidden":false,"merged":[]}
[{"$f":"IFERROR(INDEX(Оглавление,ROW(Лист4!E1)),\"\")","v":"Лист1"}]
[{"$f":"IFERROR(INDEX(Оглавление,ROW(Лист4!E2)),\"\")","v":"Лист2"}]
[{"$f":"IFERROR(INDEX(Оглавление,ROW(Лист4!E3)),\"\")","v":"Лист3"}]
[{"$f":"IFERROR(INDEX(Оглавление,ROW(Лист4!E4)),\"\")","v":"Лист4"}]
[{"$f":"IFERROR(INDEX(Оглавление,ROW(Лист4!E5)),\"\")","v":"Лист5"}]
[{"$f":"IFERROR(INDEX(Оглавление,ROW(Лист4!E6)),\"\")","v":""}]
[{"$f":"IFERROR(INDEX(Оглавление,ROW(Лист4!E7)),\"\")","v":""}]
[{"$f":"IFERROR(INDEX(Оглавление,ROW(Лист4!E8)),\"\")","v":""}]
[{"$f":"IFERROR(INDEX(Оглавление,ROW(Лист4!E9)),\"\")","v":""}]
[{"$f":"IFERROR(INDEX(Оглавление,ROW(Лист4!E10)),\"\")","v":""}]
[{"$f":"IFERROR(INDEX(Оглавление,ROW(Лист4!E11)),\"\")","v":""}]
[{"$f":"IFERROR(INDEX(Оглавление,ROW(Лист4!E12)),\"\")","v":""}]
[{"$f":"IFERROR(INDEX(Оглавление,ROW(Лист4!E13)),\"\")","v":""}]
[{"$f":"IFERROR(INDEX(Оглавление,ROW(Лист4!E14)),\"\")","v":""}]
[{"$f":"IFERROR(INDEX(Оглавление,ROW(Лист4!E15)),\"\")","v":""}]
[{"$f":"IFERROR(INDEX(Оглавление,ROW(Лист4!E16)),\"\")","v":""}]

{"sheet":"Лист2","index":1,"n_rows":0,"n_cols":0,"rows_kept":0,"cut":false,"hidden":false,"merged":[]}

{"sheet":"Лист3","index":2,"n_rows":0,"n_cols":0,"rows_kept":0,"cut":false,"hidden":false,"merged":[]}

{"sheet":"Лист4","index":3,"n_rows":0,"n_cols":0,"rows_kept":0,"cut":false,"hidden":false,"merged":[]}

{"sheet":"Лист5","index":4,"n_rows":0,"n_cols":0,"rows_kept":0,"cut":false,"hidden":false,"merged":[]}