{"text_format":"1","workbook":"xlsx","n_sheets":2,"sheets":["Лист1","Создаем таблицы"],"not_rendered":{"charts":0,"images":0,"macros":1,"external_links":0,"defined_names":0,"comments":0,"pivot_tables":0},"unopened":[],"bounds":{"document_bytes":16777216,"sheet_cells":100000,"rows_first":2000,"rows_last":500,"rows_between":2000,"halvings":0,"cell_chars":16384,"cell_head_chars":4096},"cells_cut":0,"cells_raw":0,"read":"whole","date_system":"1900"}

{"sheet":"Лист1","index":0,"n_rows":7,"n_cols":4,"rows_kept":7,"cut":false,"hidden":false,"merged":[]}
["№","ФИО","К-во1","К-во2"]
[null,"Иванов И.И.",10000,100]
[null,"Петров",15000,200]
[null,"Сидоров",16000,100]
[null,"Николаев",17000]
[null,"Пупкин",18000]
[null,"Александр",19000]

{"sheet":"Создаем таблицы","index":1,"n_rows":24,"n_cols":8,"rows_kept":24,"cut":false,"hidden":false,"merged":[]}
["Таблица №",null,null,null,null,null,"Необходимо по списку в Лист 1 создать определенное количество в Лист1  таблиц по образцу первой таблицы которая в любом случае будет не удалена"]
[1,"Иванов И.И.","К-во1",{"$f":"VLOOKUP(B2,Лист1!$B$2:$C$7,2,0)","v":10000},null,null,"Например 6 человек - 6 таблиц, 80 человек - 80 таблиц."]
[null,null,"К-во2",{"$f":"VLOOKUP(B2,Лист1!$B$2:$D$7,3,0)","v":100},null,"Не удаляем",null,"Меняем только Фио первого человека в таблице Н"]
[null,"Всего",null,{"$f":"SUM(D2:D3)","v":10100}]
[]
[2,"Петров","К-во1",{"$f":"VLOOKUP(B6,Лист1!$B$2:$C$7,2,0)","v":15000}]
["Удаляем",null,"К-во2",{"$f":"VLOOKUP(B6,Лист1!$B$2:$D$7,3,0)","v":200}]
[null,"Всего",null,{"$f":"SUM(D6:D7)","v":15200}]
[]
[3,"Сидоров","К-во1",{"$f":"VLOOKUP(B10,Лист1!$B$2:$C$7,2,0)","v":16000}]
[null,null,"К-во2",{"$f":"VLOOKUP(B10,Лист1!$B$2:$D$7,3,0)","v":100}]
[null,"Всего",null,{"$f":"SUM(D10:D11)","v":16100}]
[]
[4,"Николаев","К-во1",{"$f":"VLOOKUP(B14,Лист1!$B$2:$C$7,2,0)","v":17000}]
[null,null,"К-во2",{"$f":"VLOOKUP(B14,Лист1!$B$2:$D$7,3,0)","v":0}]
[null,"Всего",null,{"$f":"SUM(D14:D15)","v":17000}]
[]
[5,"Пупкин","К-во1",{"$f":"VLOOKUP(B18,Лист1!$B$2:$C$7,2,0)","v":18000}]
[null,null,"К-во2",{"$f":"VLOOKUP(B18,Лист1!$B$2:$D$7,3,0)","v":0}]
[null,"Всего",null,{"$f":"SUM(D18:D19)","v":18000}]
[]
[6,"Александр","К-во1",{"$f":"VLOOKUP(B22,Лист1!$B$2:$C$7,2,0)","v":19000}]
[null,null,"К-во2",{"$f":"VLOOKUP(B22,Лист1!$B$2:$D$7,3,0)","v":0}]
[null,"Всего",null,{"$f":"SUM(D22:D23)","v":19000}]