{"text_format":"1","workbook":"xlsx","n_sheets":3,"sheets":["МЕНЮ","СПИСОК","Лист3"],"not_rendered":{"charts":0,"images":0,"macros":1,"external_links":0,"defined_names":2,"comments":0,"pivot_tables":0},"unopened":[],"bounds":{"document_bytes":16777216,"sheet_cells":100000,"rows_first":2000,"rows_last":500,"rows_between":2000,"halvings":0,"cell_chars":16384,"cell_head_chars":4096},"cells_cut":0,"cells_raw":0,"read":"whole","date_system":"1900"}

{"sheet":"МЕНЮ","index":0,"n_rows":23,"n_cols":6,"rows_kept":23,"cut":false,"hidden":false,"merged":[[0,0,0,5]]}
["МЕНЮ-РАСКЛАДКА  НА 25.09 .2017"]
["ЗАВТРАК","Выход блюда","Продукты","Кол-во","Цена","Сумма"]
["Борщ с капустой и картофелем",{"$f":"IFERROR(VLOOKUP($A3,СПИСОК!$A$2:$E$45,2,0),\"\")","v":200},"Гречневая крупа",{"$f":"VLOOKUP(D3,СПИСОК!$C$2:$D$34,3,0)","v":0},{"$f":"IFERROR(VLOOKUP($C3,СПИСОК!$C$2:$E$45,2,0),\"\")","v":2}]
[null,{"$f":"IFERROR(VLOOKUP($A4,СПИСОК!$A$2:$E$45,2,0),\"\")","v":""},null,{"$f":"VLOOKUP(D4,СПИСОК!$C$2:$D$34,3,0)","v":0},{"$f":"IFERROR(VLOOKUP($C4,СПИСОК!$C$2:$E$45,2,0),\"\")","v":""}]
[null,{"$f":"IFERROR(VLOOKUP($A5,СПИСОК!$A$2:$E$45,2,0),\"\")","v":""},null,{"$f":"VLOOKUP(D5,СПИСОК!$C$2:$D$34,3,0)","v":0},{"$f":"IFERROR(VLOOKUP($C5,СПИСОК!$C$2:$E$45,2,0),\"\")","v":""}]
[null,{"$f":"IFERROR(VLOOKUP($A6,СПИСОК!$A$2:$E$45,2,0),\"\")","v":""},null,{"$f":"VLOOKUP(D6,СПИСОК!$C$2:$D$34,3,0)","v":0},{"$f":"IFERROR(VLOOKUP($C6,СПИСОК!$C$2:$E$45,2,0),\"\")","v":""}]
[null,{"$f":"IFERROR(VLOOKUP($A7,СПИСОК!$A$2:$E$45,2,0),\"\")","v":""},null,{"$f":"VLOOKUP(D7,СПИСОК!$C$2:$D$34,3,0)","v":0},{"$f":"IFERROR(VLOOKUP($C7,СПИСОК!$C$2:$E$45,2,0),\"\")","v":""}]
[null,{"$f":"IFERROR(VLOOKUP($A8,СПИСОК!$A$2:$E$45,2,0),\"\")","v":""},null,{"$f":"VLOOKUP(D8,СПИСОК!$C$2:$D$34,3,0)","v":0},{"$f":"IFERROR(VLOOKUP($C8,СПИСОК!$C$2:$E$45,2,0),\"\")","v":""}]
[null,{"$f":"IFERROR(VLOOKUP($A9,СПИСОК!$A$2:$E$45,2,0),\"\")","v":""},null,{"$f":"VLOOKUP(D9,СПИСОК!$C$2:$D$34,3,0)","v":0},{"$f":"IFERROR(VLOOKUP($C9,СПИСОК!$C$2:$E$45,2,0),\"\")","v":""}]
[null,{"$f":"IFERROR(VLOOKUP($A10,СПИСОК!$A$2:$E$45,2,0),\"\")","v":""},null,{"$f":"VLOOKUP(D10,СПИСОК!$C$2:$D$34,3,0)","v":0},{"$f":"IFERROR(VLOOKUP($C10,СПИСОК!$C$2:$E$45,2,0),\"\")","v":""}]
[null,{"$f":"IFERROR(VLOOKUP($A11,СПИСОК!$A$2:$E$45,2,0),\"\")","v":""},null,{"$f":"VLOOKUP(D11,СПИСОК!$C$2:$D$34,3,0)","v":0},{"$f":"IFERROR(VLOOKUP($C11,СПИСОК!$C$2:$E$45,2,0),\"\")","v":""}]
[null,{"$f":"IFERROR(VLOOKUP($A12,СПИСОК!$A$2:$E$45,2,0),\"\")","v":""},null,{"$f":"VLOOKUP(D12,СПИСОК!$C$2:$D$34,3,0)","v":0},{"$f":"IFERROR(VLOOKUP($C12,СПИСОК!$C$2:$E$45,2,0),\"\")","v":""}]
["ОБЕД","Выход блюда","Продукты","Кол-во","Цена","Сумма"]
["Бутерброд с маслом",{"$f":"IFERROR(VLOOKUP($A14,СПИСОК!$A$2:$E$45,2,0),\"\")","v":50},"Дрожжи прессованные",null,{"$f":"IFERROR(VLOOKUP($C14,СПИСОК!$C$2:$E$45,2,0),\"\")","v":3}]
[null,{"$f":"IFERROR(VLOOKUP($A15,СПИСОК!$A$2:$E$45,2,0),\"\")","v":""},null,null,{"$f":"IFERROR(VLOOKUP($C15,СПИСОК!$C$2:$E$45,2,0),\"\")","v":""}]
[null,{"$f":"IFERROR(VLOOKUP($A16,СПИСОК!$A$2:$E$45,2,0),\"\")","v":""},null,null,{"$f":"IFERROR(VLOOKUP($C16,СПИСОК!$C$2:$E$45,2,0),\"\")","v":""}]
[null,{"$f":"IFERROR(VLOOKUP($A17,СПИСОК!$A$2:$E$45,2,0),\"\")","v":""},null,null,{"$f":"IFERROR(VLOOKUP($C17,СПИСОК!$C$2:$E$45,2,0),\"\")","v":""}]
[null,{"$f":"IFERROR(VLOOKUP($A18,СПИСОК!$A$2:$E$45,2,0),\"\")","v":""},null,null,{"$f":"IFERROR(VLOOKUP($C18,СПИСОК!$C$2:$E$45,2,0),\"\")","v":""}]
[null,{"$f":"IFERROR(VLOOKUP($A19,СПИСОК!$A$2:$E$45,2,0),\"\")","v":""},null,null,{"$f":"IFERROR(VLOOKUP($C19,СПИСОК!$C$2:$E$45,2,0),\"\")","v":""}]
[null,{"$f":"IFERROR(VLOOKUP($A20,СПИСОК!$A$2:$E$45,2,0),\"\")","v":""},null,null,{"$f":"IFERROR(VLOOKUP($C20,СПИСОК!$C$2:$E$45,2,0),\"\")","v":""}]
[null,{"$f":"IFERROR(VLOOKUP($A21,СПИСОК!$A$2:$E$45,2,0),\"\")","v":""},null,null,{"$f":"IFERROR(VLOOKUP($C21,СПИСОК!$C$2:$E$45,2,0),\"\")","v":""}]
[null,{"$f":"IFERROR(VLOOKUP($A22,СПИСОК!$A$2:$E$45,2,0),\"\")","v":""},null,null,{"$f":"IFERROR(VLOOKUP($C22,СПИСОК!$C$2:$E$45,2,0),\"\")","v":""}]
[null,{"$f":"IFERROR(VLOOKUP($A23,СПИСОК!$A$2:$E$45,2,0),\"\")","v":""},null,null,{"$f":"IFERROR(VLOOKUP($C23,СПИСОК!$C$2:$E$45,2,0),\"\")","v":""}]

{"sheet":"СПИСОК","index":1,"n_rows":45,"n_cols":5,"rows_kept":45,"cut":false,"hidden":false,"merged":[]}
["БЛЮДА","ВЫХОД БЛЮДА","ПРОДУКТЫ","ЦЕНА","КОЛИЧЕСТВО"]
["Блины",150,"Вермишель",1,2]
["Борщ с капустой и картофелем",200,"Гречневая крупа",2,4]
["Бутерброд с маслом",50,"Дрожжи прессованные",3,6]
["Бутерброд с сыром",55,"Капуста свежая",4,8]
["Вафли",20,"Картофель",5,10]
["Винегрет овощной",200,"Кисель",6,12]
["Гуляш из отварного мяса",140,"Консервы рыбные в собственном соку",7,14]
["Картофельное пюре  с рыбой",200,"Крупа \"Геркулес\"",8,2]
["Каша \"Дружба\" ",200,"Крупа манная",9,4]
["Каша геркулесовая",200,"Крупа пшеничная",10,6]
["Каша гречневая  рассыпчатая ",200,"Крупа пшено",11,8]
["Каша манная",200,"Крупа рисовая",12,10]
["Каша манная с маслом",200,"Крупа ячневая",13,12]
["Каша пшеная с маслом",200,"Лук репчатый",14,14]
["Каша пшеничная с маслом",200,"Макароны",15,2]
["Каша рисовая с маслом",200,"Масло растительное",16,4]
["Каша ячневая с маслом",200,"Масло сливочное",17,6]
["Кисель",200,"Молоко",18,8]
["Компот из свежих плодов",200,"Морковь",19,10]
["Компот из сухофруктов",200,"Мука пшеничная",20,12]
["Макароны отварные",150,"Мясо говядины",21,14]
["Огурцы",200,"Мясо курицы",22,2]
["Печенье",20,"Огурцы соленые",23,4]
["Плов из птицы, мяса",200,"Рыба",24,6]
["Пряник",20,"Сахар",25,8]
["Пюре картофельное ",150,"Свекла",26,10]
["Рассольник",200,"Сосиски",27,12]
["Рис отварной",150,"Сыр",28,14]
["Рожки отварные с сосисками",200,"Томатное пюре",29,2]
["Рыба тушеная",70,"Фрукты сушеные (смесь)",30,4]
["Салат из капусты",60,"Чай заварка",31,6]
["Салат из моркови",60,"Яблоки",32,8]
["Салат из свеклы",60,"Яйца",33,10]
["Суп  с рисом",200]
["Суп вермишелевый с мясом",250]
["Суп гороховый",200]
["Суп молочный с макронными изделиями",200]
["Суп рыбными консервами ",200]
["Суп с вермишелью",200]
["Суп с пшеном",200]
["Суп ячневый",200]
["Хлеб пшеничный",45]
["Чай с сахаром",180]
["Щи из свежей капусты с мясом",250]

{"sheet":"Лист3","index":2,"n_rows":0,"n_cols":0,"rows_kept":0,"cut":false,"hidden":false,"merged":[]}