{"text_format":"1","workbook":"xlsx","n_sheets":4,"sheets":["Лист1","С формулами","С формулами (2)","С формулами (3)"],"not_rendered":{"charts":0,"images":0,"macros":1,"external_links":0,"defined_names":0,"comments":0,"pivot_tables":0},"unopened":[],"bounds":{"document_bytes":16777216,"sheet_cells":100000,"rows_first":2000,"rows_last":500,"rows_between":2000,"halvings":0,"cell_chars":16384,"cell_head_chars":4096},"cells_cut":0,"cells_raw":0,"read":"whole","date_system":"1900"}

{"sheet":"Лист1","index":0,"n_rows":18,"n_cols":10,"rows_kept":18,"cut":false,"hidden":false,"merged":[]}
[1,1,234,234234,234350.5,304643.7,374936.9,445230.1,515523.3,585816.5]
[2,432,234,234234,234350.5,304643.7,374936.9,445230.1,515523.3,585816.5]
[3,863,234,234234,234350.5,304643.7,374936.9,445230.1,515523.3,585816.5]
[4,1294,234,234234,234350.5,304643.7,374936.9,445230.1,515523.3,585816.5]
[5,1725,234,234234,234350.5,304643.7,374936.9,445230.1,515523.3,585816.5]
[6,2156,234,234234,234350.5,304643.7,374936.9,445230.1,515523.3,585816.5]
[7,2587,234,234234,234350.5,304643.7,374936.9,445230.1,515523.3,585816.5]
[8,null,234,234234,234350.5,304643.7,374936.9,445230.1,515523.3,585816.5]
[9,null,234,234234,234350.5,304643.7,374936.9,445230.1,515523.3,585816.5]
[10,null,234,234234,234350.5,304643.7,374936.9,445230.1,515523.3,585816.5]
[11,null,234,234234,234350.5,304643.7,374936.9,445230.1,515523.3,585816.5]
[12,null,234,null,234350.5,304643.7,374936.9,445230.1,515523.3,585816.5]
[13,null,234,null,234350.5,304643.7,374936.9,445230.1,515523.3,585816.5]
[14,null,null,null,234350.5,304643.7,374936.9,445230.1,515523.3,585816.5]
[15]
[16]
[17]
[18]

{"sheet":"С формулами","index":1,"n_rows":22,"n_cols":12,"rows_kept":22,"cut":false,"hidden":false,"merged":[]}
[1,"a","b","c","d","e","f","g","h","i","j","k"]
[2,{"$f":"IF($A2<18,B$1&\" - \"&$A2,\"\")","v":"a - 2"},{"$f":"IF($A2<18,C$1&\" - \"&$A2,\"\")","v":"b - 2"},"c - 2","d - 2","e - 2","f - 2","g - 2","h - 2","i - 2","j - 2","k - 2"]
[3,{"$f":"IF($A3<18,B$1&\" - \"&$A3,\"\")","v":"a - 3"},"b - 3","c - 3","d - 3","e - 3","f - 3","g - 3","h - 3","i - 3","j - 3","k - 3"]
[4,"a - 4","b - 4","c - 4","d - 4","e - 4","f - 4","g - 4","h - 4","i - 4","j - 4","k - 4"]
[5,"a - 5","b - 5","c - 5","d - 5","e - 5","f - 5","g - 5","h - 5","i - 5","j - 5","k - 5"]
[6,"a - 6","b - 6","c - 6","d - 6","e - 6","f - 6","g - 6","h - 6","i - 6","j - 6","k - 6"]
[7,"a - 7","b - 7","c - 7","d - 7","e - 7","f - 7","g - 7","h - 7","i - 7","j - 7","k - 7"]
[8,"a - 8","b - 8","c - 8","d - 8","e - 8","f - 8","g - 8","h - 8","i - 8","j - 8","k - 8"]
[9,"a - 9","b - 9","c - 9","d - 9","e - 9","f - 9","g - 9","h - 9","i - 9","j - 9","k - 9"]
[10,"a - 10","b - 10","c - 10","d - 10","e - 10","f - 10","g - 10","h - 10","i - 10","j - 10","k - 10"]
[11,"a - 11","b - 11","c - 11","d - 11","e - 11","f - 11","g - 11","h - 11","i - 11","j - 11","k - 11"]
[12,"a - 12","b - 12","c - 12","d - 12","e - 12","f - 12","g - 12","h - 12","i - 12","j - 12","k - 12"]
[13,"a - 13","b - 13","c - 13","d - 13","e - 13","f - 13","g - 13","h - 13","i - 13","j - 13","k - 13"]
[14,"a - 14","b - 14","c - 14","d - 14","e - 14","f - 14","g - 14","h - 14","i - 14","j - 14","k - 14"]
[15,"a - 15","b - 15","c - 15","d - 15","e - 15","f - 15","g - 15","h - 15","i - 15","j - 15","k - 15"]
[16,"a - 16","b - 16","c - 16","d - 16","e - 16","f - 16","g - 16","h - 16","i - 16","j - 16","k - 16"]
[17,"a - 17","b - 17","c - 17","d - 17","e - 17","f - 17","g - 17","h - 17","i - 17","j - 17","k - 17"]
[18,"","","","","","","","","","",""]
[19,"","","","","","","","","","",""]
[20,"","","","","","","","","","",""]
[21,"","","","","","","","","","",""]
[22,"","","","","","","","","","",""]

{"sheet":"С формулами (2)","index":2,"n_rows":22,"n_cols":12,"rows_kept":22,"cut":false,"hidden":false,"merged":[]}
[1,"a","b","c","d","e","f","g","h","i","j","k"]
[2,{"$f":"IF($A2<18,B$1&\" - \"&$A2,\"\")","v":"a - 2"},{"$f":"IF($A2<18,C$1&\" - \"&$A2,\"\")","v":"b - 2"},"c - 2","d - 2","e - 2","f - 2","g - 2","h - 2","i - 2","j - 2","k - 2"]
[3,{"$f":"IF($A3<18,B$1&\" - \"&$A3,\"\")","v":"a - 3"},"b - 3","c - 3","d - 3","e - 3","f - 3","g - 3","h - 3","i - 3","j - 3","k - 3"]
[4,"a - 4","b - 4","c - 4","d - 4","e - 4","f - 4","g - 4","h - 4","i - 4","j - 4","k - 4"]
[5,"a - 5","b - 5","c - 5","d - 5","e - 5","f - 5","g - 5","h - 5","i - 5","j - 5","k - 5"]
[6,"a - 6","b - 6","c - 6","d - 6","e - 6","f - 6","g - 6","h - 6","i - 6","j - 6","k - 6"]
[7,"a - 7","b - 7","c - 7","d - 7","e - 7","f - 7","g - 7","h - 7","i - 7","j - 7","k - 7"]
[8,"a - 8","b - 8","c - 8","d - 8","e - 8","f - 8","g - 8","h - 8","i - 8","j - 8","k - 8"]
[9,"a - 9","b - 9","c - 9","d - 9","e - 9","f - 9","g - 9","h - 9","i - 9","j - 9","k - 9"]
[10,"a - 10","b - 10","c - 10","d - 10","e - 10","f - 10","g - 10","h - 10","i - 10","j - 10","k - 10"]
[11,"a - 11","b - 11","c - 11","d - 11","e - 11","f - 11","g - 11","h - 11","i - 11","j - 11","k - 11"]
[12,"a - 12","b - 12","c - 12","d - 12","e - 12","f - 12","g - 12","h - 12","i - 12","j - 12","k - 12"]
[13,"a - 13","b - 13","c - 13","d - 13","e - 13","f - 13","g - 13","h - 13","i - 13","j - 13","k - 13"]
[14,"a - 14","b - 14","c - 14","d - 14","e - 14","f - 14","g - 14","h - 14","i - 14","j - 14","k - 14"]
[15,"a - 15","b - 15","c - 15","d - 15","e - 15","f - 15","g - 15","h - 15","i - 15","j - 15","k - 15"]
[16,"a - 16","b - 16","c - 16","d - 16","e - 16","f - 16","g - 16","h - 16","i - 16","j - 16","k - 16"]
[17,"a - 17","b - 17","c - 17","d - 17","e - 17","f - 17","g - 17","h - 17","i - 17","j - 17","k - 17"]
[18,"","","","","","","","","","",""]
[19,"","","","","","","","","","",""]
[20,"","","","","","","","","","",""]
[21,"","","","","","","","","","",""]
[22,"","","","","","","","","","",""]

{"sheet":"С формулами (3)","index":3,"n_rows":22,"n_cols":12,"rows_kept":22,"cut":false,"hidden":false,"merged":[]}
[1,"a","b","c","d","e","f","g","h","i","j","k"]
[2,{"$f":"IF($A2<18,B$1&\" - \"&$A2,\"\")","v":"a - 2"},{"$f":"IF($A2<18,C$1&\" - \"&$A2,\"\")","v":"b - 2"},"c - 2","d - 2","e - 2","f - 2","g - 2","h - 2","i - 2","j - 2","k - 2"]
[3,{"$f":"IF($A3<18,B$1&\" - \"&$A3,\"\")","v":"a - 3"},"b - 3","c - 3","d - 3","e - 3","f - 3","g - 3","h - 3","i - 3","j - 3","k - 3"]
[4,"a - 4","b - 4","c - 4","d - 4","e - 4","f - 4","g - 4","h - 4","i - 4","j - 4","k - 4"]
[5,"a - 5","b - 5","c - 5","d - 5","e - 5","f - 5","g - 5","h - 5","i - 5","j - 5","k - 5"]
[6,"a - 6","b - 6","c - 6","d - 6","e - 6","f - 6","g - 6","h - 6","i - 6","j - 6","k - 6"]
[7,"a - 7","b - 7","c - 7","d - 7","e - 7","f - 7","g - 7","h - 7","i - 7","j - 7","k - 7"]
[8,"a - 8","b - 8","c - 8","d - 8","e - 8","f - 8","g - 8","h - 8","i - 8","j - 8","k - 8"]
[9,"a - 9","b - 9","c - 9","d - 9","e - 9","f - 9","g - 9","h - 9","i - 9","j - 9","k - 9"]
[10,"a - 10","b - 10","c - 10","d - 10","e - 10","f - 10","g - 10","h - 10","i - 10","j - 10","k - 10"]
[11,"a - 11","b - 11","c - 11","d - 11","e - 11","f - 11","g - 11","h - 11","i - 11","j - 11","k - 11"]
[12,"a - 12","b - 12","c - 12","d - 12","e - 12","f - 12","g - 12","h - 12","i - 12","j - 12","k - 12"]
[13,"a - 13","b - 13","c - 13","d - 13","e - 13","f - 13","g - 13","h - 13","i - 13","j - 13","k - 13"]
[14,"a - 14","b - 14","c - 14","d - 14","e - 14","f - 14","g - 14","h - 14","i - 14","j - 14","k - 14"]
[15,"a - 15","b - 15","c - 15","d - 15","e - 15","f - 15","g - 15","h - 15","i - 15","j - 15","k - 15"]
[16,"a - 16","b - 16","c - 16","d - 16","e - 16","f - 16","g - 16","h - 16","i - 16","j - 16","k - 16"]
[17,"a - 17","b - 17","c - 17","d - 17","e - 17","f - 17","g - 17","h - 17","i - 17","j - 17","k - 17"]
[18,"","","","","","","","","","",""]
[19,"","","","","","","","","","",""]
[20,"","","","","","","","","","",""]
[21,"","","","","","","","","","",""]
[22,"","","","","","","","","","",""]