{"text_format":"1","workbook":"xlsx","n_sheets":3,"sheets":["поиск по артиклу","учёт","таблица шкафов"],"not_rendered":{"charts":0,"images":0,"macros":1,"external_links":0,"defined_names":2,"comments":1,"pivot_tables":0},"unopened":[],"bounds":{"document_bytes":16777216,"sheet_cells":100000,"rows_first":2000,"rows_last":500,"rows_between":2000,"halvings":0,"cell_chars":16384,"cell_head_chars":4096},"cells_cut":0,"cells_raw":0,"read":"whole","date_system":"1900"}

{"sheet":"поиск по артиклу","index":0,"n_rows":91,"n_cols":59,"rows_kept":91,"cut":false,"hidden":false,"merged":[[88,0,89,1],[90,0,91,1],[78,0,79,1],[80,0,81,1],[82,0,83,1],[84,0,85,1],[85,31,87,42],[86,0,87,1],[85,47,88,59],[85,2,88,30],[85,43,88,46],[76,0,77,1],[60,0,61,1],[62,0,63,1],[64,0,65,1],[66,0,67,1],[68,0,69,1],[70,0,71,1],[72,0,73,1],[72,53,73,54],[74,0,75,1],[74,2,84,59],[61,2,71,59],[72,2,73,52],[72,55,73,56],[72,59,73,59],[38,0,39,1],[40,0,41,1],[41,42,44,55],[42,0,43,1],[44,0,45,1],[45,6,48,21],[45,25,48,30],[46,0,47,1],[48,0,49,1],[49,42,52,55],[50,0,51,1],[52,0,53,1],[53,6,56,13],[53,16,56,21],[53,24,56,31],[54,0,55,1],[56,0,57,1],[57,42,60,55],[58,0,59,1],[49,2,52,41],[45,2,48,5],[45,22,48,24],[45,31,48,59],[53,2,56,5],[28,0,29,1],[29,13,33,53],[30,0,31,1],[32,0,33,1],[16,2,19,59],[20,2,24,12],[20,54,24,59],[25,2,28,59],[36,0,37,1],[0,0,1,1],[0,2,1,3],[0,56,1,57],[0,58,1,59],[0,36,1,37],[0,38,1,39],[0,40,1,41],[0,42,1,43],[0,44,1,45],[0,46,1,47],[0,24,1,25],[0,26,1,27],[0,28,1,29],[0,30,1,31],[0,32,1,33],[0,34,1,35],[0,4,1,5],[0,6,1,7],[0,8,1,9],[2,0,3,1],[4,0,5,1],[6,0,7,1],[8,0,9,1],[10,0,11,1],[49,56,52,59],[29,2,33,12],[29,54,33,59],[34,2,40,59],[41,2,44,41],[41,56,44,59],[14,0,15,1],[2,2,10,59],[11,2,15,12],[11,13,15,59],[12,0,13,1],[34,0,35,1],[16,0,17,1],[18,0,19,1],[20,0,21,1],[20,13,24,53],[22,0,23,1],[24,0,25,1],[26,0,27,1],[53,14,56,15],[53,22,56,23],[53,32,56,59],[57,56,60,59],[57,2,60,41],[72,57,73,58],[0,52,1,53],[0,54,1,55],[0,10,1,11],[0,12,1,13],[0,14,1,15],[0,16,1,17],[0,18,1,19],[0,20,1,21],[0,48,1,49],[0,50,1,51],[0,22,1,23]]}
[1,null,2,null,3,null,4,null,5,null,6,null,7,null,8,null,9,null,10,null,11,null,12,null,13,null,14,null,15,null,16,null,17,null,18,null,19,null,20,null,21,null,22,null,23,null,24,null,25,null,26,null,27,null,28,null,29,null,30]
[]
[3]
[]
[5]
[]
[7]
[]
[9]
[]
[11]
[null,null,null,null,null,null,null,null,null,null,null,null,null,{"$f":"VLOOKUP(N21,'таблица шкафов'!C3:E300,2)","v":"SK-FFS/2-2,2(6A)/J-2,5A/V-3~1,0A"}]
[13]
[]
[15]
[]
[17]
[]
[19]
[]
[21,null,"Артикул",null,null,null,null,null,null,null,null,null,null,2898064]
[]
[23]
[]
[25]
[]
[27]
[]
[29]
[null,null,"Серийник",null,null,null,null,null,null,null,null,null,null,250058535]
[31]
[]
[33]
[]
[35]
[]
[37]
[]
[39]
[]
[41]
[null,null,null,null,null,null,null,null,null,null,null,null,null,null,null,null,null,null,null,null,null,null,null,null,null,null,null,null,null,null,null,null,null,null,null,null,null,null,null,null,null,null,0]
[43]
[]
[45]
[null,null,null,null,null,null,"3~400",null,null,null,null,null,null,null,null,null,null,null,null,null,null,null,null,null,null,50]
[47]
[]
[49]
[null,null,null,null,null,null,null,null,null,null,null,null,null,null,null,null,null,null,null,null,null,null,null,null,null,null,null,null,null,null,null,null,null,null,null,null,null,null,null,null,null,null,2]
[51]
[]
[53]
[null,null,null,null,null,null,{"$f":"VLOOKUP(N21,'таблица шкафов'!C4:E300,3)","v":2.2000000000000002},null,null,null,null,null,null,null,null,null,1,null,null,null,null,null,null,null,{"$f":"VLOOKUP(N21,'таблица шкафов'!C4:E300,3)","v":2.2000000000000002}]
[55]
[]
[57]
[null,null,null,null,null,null,null,null,null,null,null,null,null,null,null,null,null,null,null,null,null,null,null,null,null,null,null,null,null,null,null,null,null,null,null,null,null,null,null,null,null,null,1]
[59]
[]
[61]
[]
[63]
[]
[65]
[]
[67]
[]
[69]
[]
[71]
[]
[73,null,null,null,null,null,null,null,null,null,null,null,null,null,null,null,null,null,null,null,null,null,null,null,null,null,null,null,null,null,null,null,null,null,null,null,null,null,null,null,null,null,null,null,null,null,null,null,null,null,null,null,null,"Х",null,null,null,"Х"]
[]
[75]
[]
[77]
[]
[79]
[]
[81]
[]
[83]
[]
[85]
[null,null,"Дата",null,null,null,null,null,null,null,null,null,null,null,null,null,null,null,null,null,null,null,null,null,null,null,null,null,null,null,null,{"$f":" TODAY()","v":"2017-10-12"},null,null,null,null,null,null,null,null,null,null,null,null,null,null,null,"Кириллов"]
[87]
[]
[89]
[]
[91]

{"sheet":"учёт","index":1,"n_rows":9,"n_cols":9,"rows_kept":9,"cut":false,"hidden":false,"merged":[]}
[null,null,{"$f":"TODAY()","v":"2017-10-12"}]
[]
[null,null,"2017-10-05",250058301,2898905,"1708-3050",341,{"$f":"VLOOKUP(E3,'таблица шкафов'!$C$4:$E$34,3,0)","v":{"$error":"#N/A"}},"Кириллов"]
[null,null,"2017-10-05",250058302,2898067,"1706-2834",341,{"$f":"VLOOKUP(E4,'таблица шкафов'!$C$4:$E$34,3,0)","v":5.5},"Кириллов"]
[null,null,"2017-10-09",250057631,2898070,"1706-2673",341,{"$f":"VLOOKUP(E5,'таблица шкафов'!$C$4:$E$34,3,0)","v":15},"Кириллов"]
[null,null,"2017-10-09",250058355,2898070,"1707-2871",341,{"$f":"VLOOKUP(E6,'таблица шкафов'!$C$4:$E$34,3,0)","v":15},"Иванов"]
[null,null,"2017-10-10",250058534,2898063,"1706-2833",341,{"$f":"VLOOKUP(E7,'таблица шкафов'!$C$4:$E$34,3,0)","v":1.5},"Сидоров"]
[null,null,"2017-10-13",250058535,2898064,"1706-2538",341,{"$f":"VLOOKUP(E8,'таблица шкафов'!$C$4:$E$34,3,0)","v":2.2000000000000002},"Кириллов"]
[null,null,"2017-10-12",250058535,2898064,null,null,null,"Кириллов"]

{"sheet":"таблица шкафов","index":2,"n_rows":142,"n_cols":12,"rows_kept":142,"cut":false,"hidden":false,"merged":[[1,4,2,4],[1,2,2,2],[1,3,2,3],[1,6,2,6],[1,7,2,7],[1,5,2,5]]}
[]
[null,null,2898068,{"$f":"VLOOKUP(C2,C4:E34,2,)","v":"SK-FFS/2-7,5(18A)/J-6,3A/V-3~1,0A"},{"$f":"VLOOKUP(C2,C4:E34,3,)","v":7.5}]
[null,null,null,null,null,null,null,null,null,2016,2017,2018]
[null,1,2898062,"SK-FFS/2-0,75(2,5A)/J-2,5A/V-3~1,0A",0.75,2798123,null,null,null,{"$f":"COUNTIF(учёт!#REF!,C4)","v":{"$error":"#REF!"}},{"$f":"COUNTIF(учёт!$E$3:$E$73,C4)","v":0},{"$f":"COUNTIF(учёт!#REF!,C4)","v":{"$error":"#REF!"}}]
[null,2,2898063,"SK-FFS/2-1,5(4A)/J-2,5A/V-3~1,0A",1.5,2798124,null,null,null,{"$f":"COUNTIF(учёт!#REF!,C5)","v":{"$error":"#REF!"}},{"$f":"COUNTIF(учёт!$E$3:$E$73,C5)","v":1},{"$f":"COUNTIF(учёт!#REF!,C5)","v":{"$error":"#REF!"}}]
[null,3,2898064,"SK-FFS/2-2,2(6A)/J-2,5A/V-3~1,0A",2.2000000000000002,2798125,null,null,null,{"$f":"COUNTIF(учёт!#REF!,C6)","v":{"$error":"#REF!"}},{"$f":"COUNTIF(учёт!$E$3:$E$73,C6)","v":2},{"$f":"COUNTIF(учёт!#REF!,C6)","v":{"$error":"#REF!"}}]
[null,4,2898065,"SK-FFS/2-3,0(8A)/J-4,0A/V-3~1,0A",3,2798126,null,null,null,{"$f":"COUNTIF(учёт!#REF!,C7)","v":{"$error":"#REF!"}},{"$f":"COUNTIF(учёт!$E$3:$E$73,C7)","v":0},{"$f":"COUNTIF(учёт!#REF!,C7)","v":{"$error":"#REF!"}}]
[null,5,2898066,"SK-FFS/2-4,0(10A)/J-4,0A/V-3~1,0A",4,2798127,null,null,null,{"$f":"COUNTIF(учёт!#REF!,C8)","v":{"$error":"#REF!"}},{"$f":"COUNTIF(учёт!$E$3:$E$73,C8)","v":0},{"$f":"COUNTIF(учёт!#REF!,C8)","v":{"$error":"#REF!"}}]
[null,6,2898067,"SK-FFS/2-5,5(12A)/J-6,3A/V-3~1,0A",5.5,2798128,null,null,null,{"$f":"COUNTIF(учёт!#REF!,C9)","v":{"$error":"#REF!"}},{"$f":"COUNTIF(учёт!$E$3:$E$73,C9)","v":1},{"$f":"COUNTIF(учёт!#REF!,C9)","v":{"$error":"#REF!"}}]
[null,7,2898068,"SK-FFS/2-7,5(18A)/J-6,3A/V-3~1,0A",7.5,2798129,null,null,null,{"$f":"COUNTIF(учёт!#REF!,C10)","v":{"$error":"#REF!"}},{"$f":"COUNTIF(учёт!$E$3:$E$73,C10)","v":0},{"$f":"COUNTIF(учёт!#REF!,C10)","v":{"$error":"#REF!"}}]
[null,8,2898069,"SK-FFS/2-11(24A)/J-6,3A/V-3~1,0A",11,2798130,"600х600х210","33кг","025-17-D1",{"$f":"COUNTIF(учёт!#REF!,C11)","v":{"$error":"#REF!"}},{"$f":"COUNTIF(учёт!$E$3:$E$73,C11)","v":0},{"$f":"COUNTIF(учёт!#REF!,C11)","v":{"$error":"#REF!"}}]
[null,9,2898070,"SK-FFS/2-15(32A)/J-6,3A/V-3~1,0A",15,2798131,null,null,null,{"$f":"COUNTIF(учёт!#REF!,C12)","v":{"$error":"#REF!"}},{"$f":"COUNTIF(учёт!$E$3:$E$73,C12)","v":2},{"$f":"COUNTIF(учёт!#REF!,C12)","v":{"$error":"#REF!"}}]
[null,10,2898071,"SK-FFS/2-18(40A)/J-10A/V-3~1,0A",18,2798132,null,null,null,{"$f":"COUNTIF(учёт!#REF!,C13)","v":{"$error":"#REF!"}},{"$f":"COUNTIF(учёт!$E$3:$E$73,C13)","v":0},{"$f":"COUNTIF(учёт!#REF!,C13)","v":{"$error":"#REF!"}}]
[null,11,2898072,"SK-FFS/2-22(50A)/J-10A/V-3~1,0A",22,2798133,null,null,null,{"$f":"COUNTIF(учёт!#REF!,C14)","v":{"$error":"#REF!"}},{"$f":"COUNTIF(учёт!$E$3:$E$73,C14)","v":0},{"$f":"COUNTIF(учёт!#REF!,C14)","v":{"$error":"#REF!"}}]
[null,12,2898073,"SK-FFS/2-30(65A)/J-10A/V-3~1,0A",30,2798134,null,null,null,{"$f":"COUNTIF(учёт!#REF!,C15)","v":{"$error":"#REF!"}},{"$f":"COUNTIF(учёт!$E$3:$E$73,C15)","v":0},{"$f":"COUNTIF(учёт!#REF!,C15)","v":{"$error":"#REF!"}}]
[null,13,2898074,"SK-FFS/2-37(80A)/J-10A/V-3~1,0A",37,2798135,null,null,null,{"$f":"COUNTIF(учёт!#REF!,C16)","v":{"$error":"#REF!"}},{"$f":"COUNTIF(учёт!$E$3:$E$73,C16)","v":0},{"$f":"COUNTIF(учёт!#REF!,C16)","v":{"$error":"#REF!"}}]
[null,14,2898075,"SK-FFS/2-55(95A)/J-10A/V-3~1,0A",55,2798136,null,null,null,{"$f":"COUNTIF(учёт!#REF!,C17)","v":{"$error":"#REF!"}},{"$f":"COUNTIF(учёт!$E$3:$E$73,C17)","v":0},{"$f":"COUNTIF(учёт!#REF!,C17)","v":{"$error":"#REF!"}}]
[null,15,2898077,"SK-FFS/2-75(150A)/J-10A/V-3~1,0A",75,2798138,null,null,null,{"$f":"COUNTIF(учёт!#REF!,C18)","v":{"$error":"#REF!"}},{"$f":"COUNTIF(учёт!$E$3:$E$73,C18)","v":0},{"$f":"COUNTIF(учёт!#REF!,C18)","v":{"$error":"#REF!"}}]
[null,16,2898080,"SK-FFS/2-132(265A)/J-10A/V-3~1,0A",132,2798196,null,null,null,{"$f":"COUNTIF(учёт!#REF!,C19)","v":{"$error":"#REF!"}},{"$f":"COUNTIF(учёт!$E$3:$E$73,C19)","v":0},{"$f":"COUNTIF(учёт!#REF!,C19)","v":{"$error":"#REF!"}}]
[null,17,2898093,"SK-FFS/3-18(40A)/J-10A/V-3~1,0A",18,null,null,null,null,{"$f":"COUNTIF(учёт!#REF!,C20)","v":{"$error":"#REF!"}},{"$f":"COUNTIF(учёт!$E$3:$E$73,C20)","v":0}]
[null,18,2898821,"SK-FFS/2-11(24A)/V2-3~1,0A",11,null,null,null,null,{"$f":"COUNTIF(учёт!#REF!,C21)","v":{"$error":"#REF!"}},{"$f":"COUNTIF(учёт!$E$3:$E$73,C21)","v":0},{"$f":"COUNTIF(учёт!#REF!,C21)","v":{"$error":"#REF!"}}]
[null,19,2898837,"SK-FFS/1-250(590A)/J-4,0A/SS/D",250,2785603,null,null,null,{"$f":"COUNTIF(учёт!#REF!,C22)","v":{"$error":"#REF!"}},{"$f":"COUNTIF(учёт!$E$3:$E$73,C22)","v":0},{"$f":"COUNTIF(учёт!#REF!,C22)","v":{"$error":"#REF!"}}]
[null,20,2898846,"SK-FFS/4-63(115A)/M2/SP2",63,2785607,null,null,null,{"$f":"COUNTIF(учёт!#REF!,C23)","v":{"$error":"#REF!"}},{"$f":"COUNTIF(учёт!$E$3:$E$73,C23)","v":0},{"$f":"COUNTIF(учёт!#REF!,C23)","v":{"$error":"#REF!"}}]
[null,21,2898848,"SK-FFS/2-4,0(10A)/V2-1~1,0A/X8",4,null,null,null,null,{"$f":"COUNTIF(учёт!#REF!,C24)","v":{"$error":"#REF!"}},{"$f":"COUNTIF(учёт!$E$3:$E$73,C24)","v":0},{"$f":"COUNTIF(учёт!#REF!,C24)","v":{"$error":"#REF!"}}]
[null,22,2898849,"SK-FFS/2-7,5(18A)/V2-3~2,5A",7.5,null,null,null,null,{"$f":"COUNTIF(учёт!#REF!,C25)","v":{"$error":"#REF!"}},{"$f":"COUNTIF(учёт!$E$3:$E$73,C25)","v":0},{"$f":"COUNTIF(учёт!#REF!,C25)","v":{"$error":"#REF!"}}]
[null,23,2898850,"SK-FFS/2-15(32A)/V2-1~1,0A",15,2785611,null,null,null,{"$f":"COUNTIF(учёт!#REF!,C26)","v":{"$error":"#REF!"}},{"$f":"COUNTIF(учёт!$E$3:$E$73,C26)","v":0},{"$f":"COUNTIF(учёт!#REF!,C26)","v":{"$error":"#REF!"}}]
[null,24,2898854,"SK-FFS/2-3,0(8A)/V2-3~1,0A",3,null,null,null,null,{"$f":"COUNTIF(учёт!#REF!,C27)","v":{"$error":"#REF!"}},{"$f":"COUNTIF(учёт!$E$3:$E$73,C27)","v":0},{"$f":"COUNTIF(учёт!#REF!,C27)","v":{"$error":"#REF!"}}]
[null,25,2898855,"SK-FFS/3-90(185A)/J-14A",90,2785615,null,null,null,{"$f":"COUNTIF(учёт!#REF!,C28)","v":{"$error":"#REF!"}},{"$f":"COUNTIF(учёт!$E$3:$E$73,C28)","v":0}]
[null,26,2898887,"SK-FFS/2-15(32A)/J-6,3A/V2-3~0,63A/Х8",15,null,null,null,null,{"$f":"COUNTIF(учёт!#REF!,C29)","v":{"$error":"#REF!"}},{"$f":"COUNTIF(учёт!$E$3:$E$73,C29)","v":0}]
[null,27,2898893,"SK-FFS/2-37(80A)/V6-3~1,0A/Х16/RC2",37,2785616,null,null,null,{"$f":"COUNTIF(учёт!#REF!,C30)","v":{"$error":"#REF!"}},{"$f":"COUNTIF(учёт!$E$3:$E$73,C30)","v":0}]
[null,28,2898894,"SK-FFS/5-37(80A)/V6-3~1,0A/Х16/RC2",37,2785617,"1000х1800х400\n600х600х210\n260х310х315","136кг\nхх\nхх",null,{"$f":"COUNTIF(учёт!#REF!,C31)","v":{"$error":"#REF!"}},{"$f":"COUNTIF(учёт!$E$3:$E$73,C31)","v":0}]
[null,29,2898896,"SK-FFS/3-30(65A)/J6,A/Х16",30,2784702,"800х1000х300","59кг",null,{"$f":"COUNTIF(учёт!#REF!,C32)","v":{"$error":"#REF!"}},{"$f":"COUNTIF(учёт!$E$3:$E$73,C32)","v":0}]
[null,30,2898897,"SK-FFS/2-4,0(10A)/V-3~1,0A/X16",4,2784703,null,null,null,{"$f":"COUNTIF(учёт!#REF!,C33)","v":{"$error":"#REF!"}},{"$f":"COUNTIF(учёт!$E$3:$E$73,C33)","v":0}]
[null,31,2898898,"SK-FFS/2-37(80A)/J-4,0A/V-3~1,0A/X16",37,2784704,null,null,null,{"$f":"COUNTIF(учёт!#REF!,C34)","v":{"$error":"#REF!"}},{"$f":"COUNTIF(учёт!$E$3:$E$73,C34)","v":0}]
[null,32,2898899,"SK-FFS/4-30(65A)",30,2784705,null,null,null,{"$f":"COUNTIF(учёт!#REF!,C35)","v":{"$error":"#REF!"}},{"$f":"COUNTIF(учёт!$E$3:$E$73,C35)","v":0}]
[null,33,2898902,"SK-FFS/2-7,5(18A)/V2-3~0,40A",7.5,2784706,null,null,null,{"$f":"COUNTIF(учёт!#REF!,C36)","v":{"$error":"#REF!"}},{"$f":"COUNTIF(учёт!$E$3:$E$73,C36)","v":0}]
[null,34,2898903,"SK-FFS/3-30(65A)/SD/X8",30,null,null,null,null,{"$f":"COUNTIF(учёт!#REF!,C37)","v":{"$error":"#REF!"}},{"$f":"COUNTIF(учёт!$E$3:$E$73,C37)","v":0}]
[null,35,2898904,"SK-FFS/3-30(65A)J-10A/V-3~1,0A",30]
[null,36,2898905,"SK-FFS/3-37(80A)J-10A/V-3~1,0A/PN40",37]
[null,37,2898920,"SK-FFS/2-5,5(12A)/V2-1~1,0A",5.5]
[null,38]
[null,39]
[null,40]
[null,41]
[null,42]
[null,43]
[null,44]
[null,45]
[null,46]
[null,47]
[null,48]
[null,49]
[null,50]
[null,51]
[null,52]
[null,53]
[null,54]
[null,55]
[null,56]
[null,57]
[null,58]
[null,59]
[null,60]
[null,61]
[null,62]
[null,63]
[null,64]
[null,65]
[null,66]
[null,67]
[null,68]
[null,69]
[null,70]
[null,71]
[null,72]
[null,73]
[null,74]
[null,75]
[null,76]
[null,77]
[null,78]
[null,79]
[null,80]
[null,81]
[null,82]
[null,83]
[null,84]
[null,85]
[null,86]
[null,87]
[null,88]
[null,89]
[null,90]
[null,91]
[null,92]
[null,93]
[null,94]
[null,95]
[null,96]
[null,97]
[null,98]
[null,99]
[null,100]
[null,101]
[null,102]
[null,103]
[null,104]
[null,105]
[null,106]
[null,107]
[null,108]
[null,109]
[null,110]
[null,111]
[null,112]
[null,113]
[null,114]
[null,115]
[null,116]
[null,117]
[null,118]
[null,119]
[null,120]
[null,121]
[null,122]
[null,123]
[null,124]
[null,125]
[null,126]
[null,127]
[null,128]
[null,129]
[null,130]
[null,131]
[null,132]
[null,133]
[null,134]
[null,135]
[null,136]
[null,137]
[null,138]
[null,139]