{"text_format":"1","workbook":"xlsx","n_sheets":6,"sheets":["общая","н08","к02","н07","н15","м15"],"not_rendered":{"charts":0,"images":0,"macros":0,"external_links":0,"defined_names":1,"comments":0,"pivot_tables":0},"unopened":[],"bounds":{"document_bytes":16777216,"sheet_cells":100000,"rows_first":2000,"rows_last":500,"rows_between":2000,"halvings":0,"cell_chars":16384,"cell_head_chars":4096},"cells_cut":0,"cells_raw":0,"read":"whole","date_system":"1900"}

{"sheet":"общая","index":0,"n_rows":130,"n_cols":10,"rows_kept":130,"cut":false,"hidden":false,"merged":[]}
[]
[null,"№","Обозначение ","Дефицит"]
[null,"42","0603-NPO-50В-1000 пФ-5%",-17400,{"$f":"IFERROR(VLOOKUP($C3,INDIRECT(INDEX(листы,COLUMN(B1))&\"!$B$3:$C$1000\"),2,),\"\")","v":"        0.26"},{"$f":"IFERROR(VLOOKUP($C3,INDIRECT(INDEX(листы,COLUMN(C1))&\"!$B$3:$C$1000\"),2,),\"\")","v":""},{"$f":"IFERROR(VLOOKUP($C3,INDIRECT(INDEX(листы,COLUMN(D1))&\"!$B$3:$C$1000\"),2,),\"\")","v":""},{"$f":"IFERROR(VLOOKUP($C3,INDIRECT(INDEX(листы,COLUMN(E1))&\"!$B$3:$C$1000\"),2,),\"\")","v":""},{"$f":"IFERROR(VLOOKUP($C3,INDIRECT(INDEX(листы,COLUMN(F1))&\"!$B$3:$C$1000\"),2,),\"\")","v":""},{"$f":"IFERROR(VLOOKUP($C3,INDIRECT(INDEX(листы,COLUMN(G1))&\"!$B$3:$C$1000\"),2,),\"\")","v":""}]
[null,"43","0603-NPO-50В-330 пФ-10%",-24685,{"$f":"IFERROR(VLOOKUP($C4,INDIRECT(INDEX(листы,COLUMN(B2))&\"!$B$3:$C$1000\"),2,),\"\")","v":""},{"$f":"IFERROR(VLOOKUP($C4,INDIRECT(INDEX(листы,COLUMN(C2))&\"!$B$3:$C$1000\"),2,),\"\")","v":""},{"$f":"IFERROR(VLOOKUP($C4,INDIRECT(INDEX(листы,COLUMN(D2))&\"!$B$3:$C$1000\"),2,),\"\")","v":"        0.16"},{"$f":"IFERROR(VLOOKUP($C4,INDIRECT(INDEX(листы,COLUMN(E2))&\"!$B$3:$C$1000\"),2,),\"\")","v":"        0.16"},{"$f":"IFERROR(VLOOKUP($C4,INDIRECT(INDEX(листы,COLUMN(F2))&\"!$B$3:$C$1000\"),2,),\"\")","v":"        0.16"},{"$f":"IFERROR(VLOOKUP($C4,INDIRECT(INDEX(листы,COLUMN(G2))&\"!$B$3:$C$1000\"),2,),\"\")","v":""}]
[null,"44","0603-X7R-50В-0,047 мкФ-10%",2920,{"$f":"IFERROR(VLOOKUP($C5,INDIRECT(INDEX(листы,COLUMN(B3))&\"!$B$3:$C$1000\"),2,),\"\")","v":""},{"$f":"IFERROR(VLOOKUP($C5,INDIRECT(INDEX(листы,COLUMN(C3))&\"!$B$3:$C$1000\"),2,),\"\")","v":""},{"$f":"IFERROR(VLOOKUP($C5,INDIRECT(INDEX(листы,COLUMN(D3))&\"!$B$3:$C$1000\"),2,),\"\")","v":""},{"$f":"IFERROR(VLOOKUP($C5,INDIRECT(INDEX(листы,COLUMN(E3))&\"!$B$3:$C$1000\"),2,),\"\")","v":""},{"$f":"IFERROR(VLOOKUP($C5,INDIRECT(INDEX(листы,COLUMN(F3))&\"!$B$3:$C$1000\"),2,),\"\")","v":"        0.17"},{"$f":"IFERROR(VLOOKUP($C5,INDIRECT(INDEX(листы,COLUMN(G3))&\"!$B$3:$C$1000\"),2,),\"\")","v":""}]
[null,"45","0603-X7R-50В-0,1 мкФ-20%",-87808,{"$f":"IFERROR(VLOOKUP($C6,INDIRECT(INDEX(листы,COLUMN(B4))&\"!$B$3:$C$1000\"),2,),\"\")","v":"        0.15"},{"$f":"IFERROR(VLOOKUP($C6,INDIRECT(INDEX(листы,COLUMN(C4))&\"!$B$3:$C$1000\"),2,),\"\")","v":"        0.15"},{"$f":"IFERROR(VLOOKUP($C6,INDIRECT(INDEX(листы,COLUMN(D4))&\"!$B$3:$C$1000\"),2,),\"\")","v":"        0.15"},{"$f":"IFERROR(VLOOKUP($C6,INDIRECT(INDEX(листы,COLUMN(E4))&\"!$B$3:$C$1000\"),2,),\"\")","v":"        0.15"},{"$f":"IFERROR(VLOOKUP($C6,INDIRECT(INDEX(листы,COLUMN(F4))&\"!$B$3:$C$1000\"),2,),\"\")","v":"        0.15"},{"$f":"IFERROR(VLOOKUP($C6,INDIRECT(INDEX(листы,COLUMN(G4))&\"!$B$3:$C$1000\"),2,),\"\")","v":""}]
[null,"46","0603-X7R-50В-0,22 мкФ-20%",-26060,{"$f":"IFERROR(VLOOKUP($C7,INDIRECT(INDEX(листы,COLUMN(B5))&\"!$B$3:$C$1000\"),2,),\"\")","v":""},{"$f":"IFERROR(VLOOKUP($C7,INDIRECT(INDEX(листы,COLUMN(C5))&\"!$B$3:$C$1000\"),2,),\"\")","v":""},{"$f":"IFERROR(VLOOKUP($C7,INDIRECT(INDEX(листы,COLUMN(D5))&\"!$B$3:$C$1000\"),2,),\"\")","v":"        0.36"},{"$f":"IFERROR(VLOOKUP($C7,INDIRECT(INDEX(листы,COLUMN(E5))&\"!$B$3:$C$1000\"),2,),\"\")","v":"        0.36"},{"$f":"IFERROR(VLOOKUP($C7,INDIRECT(INDEX(листы,COLUMN(F5))&\"!$B$3:$C$1000\"),2,),\"\")","v":"        0.36"},{"$f":"IFERROR(VLOOKUP($C7,INDIRECT(INDEX(листы,COLUMN(G5))&\"!$B$3:$C$1000\"),2,),\"\")","v":""}]
[null,"47","0603-X7R-50В-3300 пФ-20%",-6200,{"$f":"IFERROR(VLOOKUP($C8,INDIRECT(INDEX(листы,COLUMN(B6))&\"!$B$3:$C$1000\"),2,),\"\")","v":""},{"$f":"IFERROR(VLOOKUP($C8,INDIRECT(INDEX(листы,COLUMN(C6))&\"!$B$3:$C$1000\"),2,),\"\")","v":"        0.12"},{"$f":"IFERROR(VLOOKUP($C8,INDIRECT(INDEX(листы,COLUMN(D6))&\"!$B$3:$C$1000\"),2,),\"\")","v":""},{"$f":"IFERROR(VLOOKUP($C8,INDIRECT(INDEX(листы,COLUMN(E6))&\"!$B$3:$C$1000\"),2,),\"\")","v":"        0.12"},{"$f":"IFERROR(VLOOKUP($C8,INDIRECT(INDEX(листы,COLUMN(F6))&\"!$B$3:$C$1000\"),2,),\"\")","v":""},{"$f":"IFERROR(VLOOKUP($C8,INDIRECT(INDEX(листы,COLUMN(G6))&\"!$B$3:$C$1000\"),2,),\"\")","v":""}]
[null,"54","0805-X7R-25В-1 мкФ-10%",-49887,{"$f":"IFERROR(VLOOKUP($C9,INDIRECT(INDEX(листы,COLUMN(B7))&\"!$B$3:$C$1000\"),2,),\"\")","v":""},{"$f":"IFERROR(VLOOKUP($C9,INDIRECT(INDEX(листы,COLUMN(C7))&\"!$B$3:$C$1000\"),2,),\"\")","v":"        0.53"},{"$f":"IFERROR(VLOOKUP($C9,INDIRECT(INDEX(листы,COLUMN(D7))&\"!$B$3:$C$1000\"),2,),\"\")","v":"        0.53"},{"$f":"IFERROR(VLOOKUP($C9,INDIRECT(INDEX(листы,COLUMN(E7))&\"!$B$3:$C$1000\"),2,),\"\")","v":"        0.53"},{"$f":"IFERROR(VLOOKUP($C9,INDIRECT(INDEX(листы,COLUMN(F7))&\"!$B$3:$C$1000\"),2,),\"\")","v":"        0.53"},{"$f":"IFERROR(VLOOKUP($C9,INDIRECT(INDEX(листы,COLUMN(G7))&\"!$B$3:$C$1000\"),2,),\"\")","v":""}]
[null,"55","0805-X7R-50В-0,22 мкФ-20%",1658,{"$f":"IFERROR(VLOOKUP($C10,INDIRECT(INDEX(листы,COLUMN(B8))&\"!$B$3:$C$1000\"),2,),\"\")","v":""},{"$f":"IFERROR(VLOOKUP($C10,INDIRECT(INDEX(листы,COLUMN(C8))&\"!$B$3:$C$1000\"),2,),\"\")","v":"        0.50"},{"$f":"IFERROR(VLOOKUP($C10,INDIRECT(INDEX(листы,COLUMN(D8))&\"!$B$3:$C$1000\"),2,),\"\")","v":""},{"$f":"IFERROR(VLOOKUP($C10,INDIRECT(INDEX(листы,COLUMN(E8))&\"!$B$3:$C$1000\"),2,),\"\")","v":""},{"$f":"IFERROR(VLOOKUP($C10,INDIRECT(INDEX(листы,COLUMN(F8))&\"!$B$3:$C$1000\"),2,),\"\")","v":""},{"$f":"IFERROR(VLOOKUP($C10,INDIRECT(INDEX(листы,COLUMN(G8))&\"!$B$3:$C$1000\"),2,),\"\")","v":""}]
[null,"75","1206-NPO-500В-220 пФ-10%",-12635,{"$f":"IFERROR(VLOOKUP($C11,INDIRECT(INDEX(листы,COLUMN(B9))&\"!$B$3:$C$1000\"),2,),\"\")","v":""},{"$f":"IFERROR(VLOOKUP($C11,INDIRECT(INDEX(листы,COLUMN(C9))&\"!$B$3:$C$1000\"),2,),\"\")","v":""},{"$f":"IFERROR(VLOOKUP($C11,INDIRECT(INDEX(листы,COLUMN(D9))&\"!$B$3:$C$1000\"),2,),\"\")","v":"        1.10"},{"$f":"IFERROR(VLOOKUP($C11,INDIRECT(INDEX(листы,COLUMN(E9))&\"!$B$3:$C$1000\"),2,),\"\")","v":""},{"$f":"IFERROR(VLOOKUP($C11,INDIRECT(INDEX(листы,COLUMN(F9))&\"!$B$3:$C$1000\"),2,),\"\")","v":""},{"$f":"IFERROR(VLOOKUP($C11,INDIRECT(INDEX(листы,COLUMN(G9))&\"!$B$3:$C$1000\"),2,),\"\")","v":""}]
[null,"76","1206-NPO-500В-470 пФ-10%",-7208,{"$f":"IFERROR(VLOOKUP($C12,INDIRECT(INDEX(листы,COLUMN(B10))&\"!$B$3:$C$1000\"),2,),\"\")","v":"        1.20"},{"$f":"IFERROR(VLOOKUP($C12,INDIRECT(INDEX(листы,COLUMN(C10))&\"!$B$3:$C$1000\"),2,),\"\")","v":"        1.20"},{"$f":"IFERROR(VLOOKUP($C12,INDIRECT(INDEX(листы,COLUMN(D10))&\"!$B$3:$C$1000\"),2,),\"\")","v":""},{"$f":"IFERROR(VLOOKUP($C12,INDIRECT(INDEX(листы,COLUMN(E10))&\"!$B$3:$C$1000\"),2,),\"\")","v":""},{"$f":"IFERROR(VLOOKUP($C12,INDIRECT(INDEX(листы,COLUMN(F10))&\"!$B$3:$C$1000\"),2,),\"\")","v":""},{"$f":"IFERROR(VLOOKUP($C12,INDIRECT(INDEX(листы,COLUMN(G10))&\"!$B$3:$C$1000\"),2,),\"\")","v":""}]
[null,"77","1206-X7R-1кВ-220 пФ-20%",-280,{"$f":"IFERROR(VLOOKUP($C13,INDIRECT(INDEX(листы,COLUMN(B11))&\"!$B$3:$C$1000\"),2,),\"\")","v":""},{"$f":"IFERROR(VLOOKUP($C13,INDIRECT(INDEX(листы,COLUMN(C11))&\"!$B$3:$C$1000\"),2,),\"\")","v":""},{"$f":"IFERROR(VLOOKUP($C13,INDIRECT(INDEX(листы,COLUMN(D11))&\"!$B$3:$C$1000\"),2,),\"\")","v":""},{"$f":"IFERROR(VLOOKUP($C13,INDIRECT(INDEX(листы,COLUMN(E11))&\"!$B$3:$C$1000\"),2,),\"\")","v":""},{"$f":"IFERROR(VLOOKUP($C13,INDIRECT(INDEX(листы,COLUMN(F11))&\"!$B$3:$C$1000\"),2,),\"\")","v":"        1.57"},{"$f":"IFERROR(VLOOKUP($C13,INDIRECT(INDEX(листы,COLUMN(G11))&\"!$B$3:$C$1000\"),2,),\"\")","v":""}]
[null,"78","1206-X7R-200В-0,01 мкФ-20%",-1334,{"$f":"IFERROR(VLOOKUP($C14,INDIRECT(INDEX(листы,COLUMN(B12))&\"!$B$3:$C$1000\"),2,),\"\")","v":""},{"$f":"IFERROR(VLOOKUP($C14,INDIRECT(INDEX(листы,COLUMN(C12))&\"!$B$3:$C$1000\"),2,),\"\")","v":"        0.68"},{"$f":"IFERROR(VLOOKUP($C14,INDIRECT(INDEX(листы,COLUMN(D12))&\"!$B$3:$C$1000\"),2,),\"\")","v":""},{"$f":"IFERROR(VLOOKUP($C14,INDIRECT(INDEX(листы,COLUMN(E12))&\"!$B$3:$C$1000\"),2,),\"\")","v":""},{"$f":"IFERROR(VLOOKUP($C14,INDIRECT(INDEX(листы,COLUMN(F12))&\"!$B$3:$C$1000\"),2,),\"\")","v":""},{"$f":"IFERROR(VLOOKUP($C14,INDIRECT(INDEX(листы,COLUMN(G12))&\"!$B$3:$C$1000\"),2,),\"\")","v":""}]
[null,"79","1206-X7R-200В-0,047 мкФ-20%",-2908,{"$f":"IFERROR(VLOOKUP($C15,INDIRECT(INDEX(листы,COLUMN(B13))&\"!$B$3:$C$1000\"),2,),\"\")","v":"        1.14"},{"$f":"IFERROR(VLOOKUP($C15,INDIRECT(INDEX(листы,COLUMN(C13))&\"!$B$3:$C$1000\"),2,),\"\")","v":""},{"$f":"IFERROR(VLOOKUP($C15,INDIRECT(INDEX(листы,COLUMN(D13))&\"!$B$3:$C$1000\"),2,),\"\")","v":""},{"$f":"IFERROR(VLOOKUP($C15,INDIRECT(INDEX(листы,COLUMN(E13))&\"!$B$3:$C$1000\"),2,),\"\")","v":""},{"$f":"IFERROR(VLOOKUP($C15,INDIRECT(INDEX(листы,COLUMN(F13))&\"!$B$3:$C$1000\"),2,),\"\")","v":""},{"$f":"IFERROR(VLOOKUP($C15,INDIRECT(INDEX(листы,COLUMN(G13))&\"!$B$3:$C$1000\"),2,),\"\")","v":""}]
[null,"80","1206-X7R-200В-0,1 мкФ-20%",4,{"$f":"IFERROR(VLOOKUP($C16,INDIRECT(INDEX(листы,COLUMN(B14))&\"!$B$3:$C$1000\"),2,),\"\")","v":""},{"$f":"IFERROR(VLOOKUP($C16,INDIRECT(INDEX(листы,COLUMN(C14))&\"!$B$3:$C$1000\"),2,),\"\")","v":"        1.01"},{"$f":"IFERROR(VLOOKUP($C16,INDIRECT(INDEX(листы,COLUMN(D14))&\"!$B$3:$C$1000\"),2,),\"\")","v":""},{"$f":"IFERROR(VLOOKUP($C16,INDIRECT(INDEX(листы,COLUMN(E14))&\"!$B$3:$C$1000\"),2,),\"\")","v":""},{"$f":"IFERROR(VLOOKUP($C16,INDIRECT(INDEX(листы,COLUMN(F14))&\"!$B$3:$C$1000\"),2,),\"\")","v":""},{"$f":"IFERROR(VLOOKUP($C16,INDIRECT(INDEX(листы,COLUMN(G14))&\"!$B$3:$C$1000\"),2,),\"\")","v":""}]
[null,"81","1206-X7R-500В-0,01 мкФ-20%",-1936,{"$f":"IFERROR(VLOOKUP($C17,INDIRECT(INDEX(листы,COLUMN(B15))&\"!$B$3:$C$1000\"),2,),\"\")","v":""},{"$f":"IFERROR(VLOOKUP($C17,INDIRECT(INDEX(листы,COLUMN(C15))&\"!$B$3:$C$1000\"),2,),\"\")","v":""},{"$f":"IFERROR(VLOOKUP($C17,INDIRECT(INDEX(листы,COLUMN(D15))&\"!$B$3:$C$1000\"),2,),\"\")","v":""},{"$f":"IFERROR(VLOOKUP($C17,INDIRECT(INDEX(листы,COLUMN(E15))&\"!$B$3:$C$1000\"),2,),\"\")","v":"        0.66"},{"$f":"IFERROR(VLOOKUP($C17,INDIRECT(INDEX(листы,COLUMN(F15))&\"!$B$3:$C$1000\"),2,),\"\")","v":"        0.66"},{"$f":"IFERROR(VLOOKUP($C17,INDIRECT(INDEX(листы,COLUMN(G15))&\"!$B$3:$C$1000\"),2,),\"\")","v":""}]
[null,"82","1206-X7R-500В-2200 пФ-20%",-16274,{"$f":"IFERROR(VLOOKUP($C18,INDIRECT(INDEX(листы,COLUMN(B16))&\"!$B$3:$C$1000\"),2,),\"\")","v":""},{"$f":"IFERROR(VLOOKUP($C18,INDIRECT(INDEX(листы,COLUMN(C16))&\"!$B$3:$C$1000\"),2,),\"\")","v":"        0.90"},{"$f":"IFERROR(VLOOKUP($C18,INDIRECT(INDEX(листы,COLUMN(D16))&\"!$B$3:$C$1000\"),2,),\"\")","v":"        0.90"},{"$f":"IFERROR(VLOOKUP($C18,INDIRECT(INDEX(листы,COLUMN(E16))&\"!$B$3:$C$1000\"),2,),\"\")","v":""},{"$f":"IFERROR(VLOOKUP($C18,INDIRECT(INDEX(листы,COLUMN(F16))&\"!$B$3:$C$1000\"),2,),\"\")","v":""},{"$f":"IFERROR(VLOOKUP($C18,INDIRECT(INDEX(листы,COLUMN(G16))&\"!$B$3:$C$1000\"),2,),\"\")","v":""}]
[null,"83","1206-X7R-500В-680 пФ-20%",365,{"$f":"IFERROR(VLOOKUP($C19,INDIRECT(INDEX(листы,COLUMN(B17))&\"!$B$3:$C$1000\"),2,),\"\")","v":""},{"$f":"IFERROR(VLOOKUP($C19,INDIRECT(INDEX(листы,COLUMN(C17))&\"!$B$3:$C$1000\"),2,),\"\")","v":""},{"$f":"IFERROR(VLOOKUP($C19,INDIRECT(INDEX(листы,COLUMN(D17))&\"!$B$3:$C$1000\"),2,),\"\")","v":""},{"$f":"IFERROR(VLOOKUP($C19,INDIRECT(INDEX(листы,COLUMN(E17))&\"!$B$3:$C$1000\"),2,),\"\")","v":"        0.98"},{"$f":"IFERROR(VLOOKUP($C19,INDIRECT(INDEX(листы,COLUMN(F17))&\"!$B$3:$C$1000\"),2,),\"\")","v":""},{"$f":"IFERROR(VLOOKUP($C19,INDIRECT(INDEX(листы,COLUMN(G17))&\"!$B$3:$C$1000\"),2,),\"\")","v":""}]
[null,"84","3311100 (1A 250V 3.6*10 axial)",-4889,{"$f":"IFERROR(VLOOKUP($C20,INDIRECT(INDEX(листы,COLUMN(B18))&\"!$B$3:$C$1000\"),2,),\"\")","v":"        2.86"},{"$f":"IFERROR(VLOOKUP($C20,INDIRECT(INDEX(листы,COLUMN(C18))&\"!$B$3:$C$1000\"),2,),\"\")","v":""},{"$f":"IFERROR(VLOOKUP($C20,INDIRECT(INDEX(листы,COLUMN(D18))&\"!$B$3:$C$1000\"),2,),\"\")","v":"        2.86"},{"$f":"IFERROR(VLOOKUP($C20,INDIRECT(INDEX(листы,COLUMN(E18))&\"!$B$3:$C$1000\"),2,),\"\")","v":"        2.86"},{"$f":"IFERROR(VLOOKUP($C20,INDIRECT(INDEX(листы,COLUMN(F18))&\"!$B$3:$C$1000\"),2,),\"\")","v":""},{"$f":"IFERROR(VLOOKUP($C20,INDIRECT(INDEX(листы,COLUMN(G18))&\"!$B$3:$C$1000\"),2,),\"\")","v":""}]
[null,"85","8N90",-7210,{"$f":"IFERROR(VLOOKUP($C21,INDIRECT(INDEX(листы,COLUMN(B19))&\"!$B$3:$C$1000\"),2,),\"\")","v":""},{"$f":"IFERROR(VLOOKUP($C21,INDIRECT(INDEX(листы,COLUMN(C19))&\"!$B$3:$C$1000\"),2,),\"\")","v":"       32.30"},{"$f":"IFERROR(VLOOKUP($C21,INDIRECT(INDEX(листы,COLUMN(D19))&\"!$B$3:$C$1000\"),2,),\"\")","v":""},{"$f":"IFERROR(VLOOKUP($C21,INDIRECT(INDEX(листы,COLUMN(E19))&\"!$B$3:$C$1000\"),2,),\"\")","v":"       32.30"},{"$f":"IFERROR(VLOOKUP($C21,INDIRECT(INDEX(листы,COLUMN(F19))&\"!$B$3:$C$1000\"),2,),\"\")","v":""},{"$f":"IFERROR(VLOOKUP($C21,INDIRECT(INDEX(листы,COLUMN(G19))&\"!$B$3:$C$1000\"),2,),\"\")","v":""}]
[null,"86","AO3404A",-6554,{"$f":"IFERROR(VLOOKUP($C22,INDIRECT(INDEX(листы,COLUMN(B20))&\"!$B$3:$C$1000\"),2,),\"\")","v":"        4.63"},{"$f":"IFERROR(VLOOKUP($C22,INDIRECT(INDEX(листы,COLUMN(C20))&\"!$B$3:$C$1000\"),2,),\"\")","v":""},{"$f":"IFERROR(VLOOKUP($C22,INDIRECT(INDEX(листы,COLUMN(D20))&\"!$B$3:$C$1000\"),2,),\"\")","v":""},{"$f":"IFERROR(VLOOKUP($C22,INDIRECT(INDEX(листы,COLUMN(E20))&\"!$B$3:$C$1000\"),2,),\"\")","v":""},{"$f":"IFERROR(VLOOKUP($C22,INDIRECT(INDEX(листы,COLUMN(F20))&\"!$B$3:$C$1000\"),2,),\"\")","v":""},{"$f":"IFERROR(VLOOKUP($C22,INDIRECT(INDEX(листы,COLUMN(G20))&\"!$B$3:$C$1000\"),2,),\"\")","v":""}]
[null,"87","AOD2N60",-5498,{"$f":"IFERROR(VLOOKUP($C23,INDIRECT(INDEX(листы,COLUMN(B21))&\"!$B$3:$C$1000\"),2,),\"\")","v":"        8.99"},{"$f":"IFERROR(VLOOKUP($C23,INDIRECT(INDEX(листы,COLUMN(C21))&\"!$B$3:$C$1000\"),2,),\"\")","v":""},{"$f":"IFERROR(VLOOKUP($C23,INDIRECT(INDEX(листы,COLUMN(D21))&\"!$B$3:$C$1000\"),2,),\"\")","v":""},{"$f":"IFERROR(VLOOKUP($C23,INDIRECT(INDEX(листы,COLUMN(E21))&\"!$B$3:$C$1000\"),2,),\"\")","v":""},{"$f":"IFERROR(VLOOKUP($C23,INDIRECT(INDEX(листы,COLUMN(F21))&\"!$B$3:$C$1000\"),2,),\"\")","v":""},{"$f":"IFERROR(VLOOKUP($C23,INDIRECT(INDEX(листы,COLUMN(G21))&\"!$B$3:$C$1000\"),2,),\"\")","v":""}]
[null,"88","B32922C3154M (X2 305В 0,15 мкФ)",-7304,{"$f":"IFERROR(VLOOKUP($C24,INDIRECT(INDEX(листы,COLUMN(B22))&\"!$B$3:$C$1000\"),2,),\"\")","v":"        3.93"},{"$f":"IFERROR(VLOOKUP($C24,INDIRECT(INDEX(листы,COLUMN(C22))&\"!$B$3:$C$1000\"),2,),\"\")","v":""},{"$f":"IFERROR(VLOOKUP($C24,INDIRECT(INDEX(листы,COLUMN(D22))&\"!$B$3:$C$1000\"),2,),\"\")","v":""},{"$f":"IFERROR(VLOOKUP($C24,INDIRECT(INDEX(листы,COLUMN(E22))&\"!$B$3:$C$1000\"),2,),\"\")","v":""},{"$f":"IFERROR(VLOOKUP($C24,INDIRECT(INDEX(листы,COLUMN(F22))&\"!$B$3:$C$1000\"),2,),\"\")","v":""},{"$f":"IFERROR(VLOOKUP($C24,INDIRECT(INDEX(листы,COLUMN(G22))&\"!$B$3:$C$1000\"),2,),\"\")","v":""}]
[null,"89","B32923C3474M (X2 305В 0,47 мкФ)",-7619,{"$f":"IFERROR(VLOOKUP($C25,INDIRECT(INDEX(листы,COLUMN(B23))&\"!$B$3:$C$1000\"),2,),\"\")","v":""},{"$f":"IFERROR(VLOOKUP($C25,INDIRECT(INDEX(листы,COLUMN(C23))&\"!$B$3:$C$1000\"),2,),\"\")","v":""},{"$f":"IFERROR(VLOOKUP($C25,INDIRECT(INDEX(листы,COLUMN(D23))&\"!$B$3:$C$1000\"),2,),\"\")","v":""},{"$f":"IFERROR(VLOOKUP($C25,INDIRECT(INDEX(листы,COLUMN(E23))&\"!$B$3:$C$1000\"),2,),\"\")","v":"        6.72"},{"$f":"IFERROR(VLOOKUP($C25,INDIRECT(INDEX(листы,COLUMN(F23))&\"!$B$3:$C$1000\"),2,),\"\")","v":"        6.72"},{"$f":"IFERROR(VLOOKUP($C25,INDIRECT(INDEX(листы,COLUMN(G23))&\"!$B$3:$C$1000\"),2,),\"\")","v":""}]
[null,"90","B8S",-6351,{"$f":"IFERROR(VLOOKUP($C26,INDIRECT(INDEX(листы,COLUMN(B24))&\"!$B$3:$C$1000\"),2,),\"\")","v":"        3.74"},{"$f":"IFERROR(VLOOKUP($C26,INDIRECT(INDEX(листы,COLUMN(C24))&\"!$B$3:$C$1000\"),2,),\"\")","v":""},{"$f":"IFERROR(VLOOKUP($C26,INDIRECT(INDEX(листы,COLUMN(D24))&\"!$B$3:$C$1000\"),2,),\"\")","v":""},{"$f":"IFERROR(VLOOKUP($C26,INDIRECT(INDEX(листы,COLUMN(E24))&\"!$B$3:$C$1000\"),2,),\"\")","v":""},{"$f":"IFERROR(VLOOKUP($C26,INDIRECT(INDEX(листы,COLUMN(F24))&\"!$B$3:$C$1000\"),2,),\"\")","v":""},{"$f":"IFERROR(VLOOKUP($C26,INDIRECT(INDEX(листы,COLUMN(G24))&\"!$B$3:$C$1000\"),2,),\"\")","v":""}]
[null,"91","BAT54A NXP",-6720,{"$f":"IFERROR(VLOOKUP($C27,INDIRECT(INDEX(листы,COLUMN(B25))&\"!$B$3:$C$1000\"),2,),\"\")","v":"        1.03"},{"$f":"IFERROR(VLOOKUP($C27,INDIRECT(INDEX(листы,COLUMN(C25))&\"!$B$3:$C$1000\"),2,),\"\")","v":""},{"$f":"IFERROR(VLOOKUP($C27,INDIRECT(INDEX(листы,COLUMN(D25))&\"!$B$3:$C$1000\"),2,),\"\")","v":""},{"$f":"IFERROR(VLOOKUP($C27,INDIRECT(INDEX(листы,COLUMN(E25))&\"!$B$3:$C$1000\"),2,),\"\")","v":""},{"$f":"IFERROR(VLOOKUP($C27,INDIRECT(INDEX(листы,COLUMN(F25))&\"!$B$3:$C$1000\"),2,),\"\")","v":"        1.03"},{"$f":"IFERROR(VLOOKUP($C27,INDIRECT(INDEX(листы,COLUMN(G25))&\"!$B$3:$C$1000\"),2,),\"\")","v":""}]
[null,"92","BAT54C NXP",-19919,{"$f":"IFERROR(VLOOKUP($C28,INDIRECT(INDEX(листы,COLUMN(B26))&\"!$B$3:$C$1000\"),2,),\"\")","v":""},{"$f":"IFERROR(VLOOKUP($C28,INDIRECT(INDEX(листы,COLUMN(C26))&\"!$B$3:$C$1000\"),2,),\"\")","v":""},{"$f":"IFERROR(VLOOKUP($C28,INDIRECT(INDEX(листы,COLUMN(D26))&\"!$B$3:$C$1000\"),2,),\"\")","v":"        0.82"},{"$f":"IFERROR(VLOOKUP($C28,INDIRECT(INDEX(листы,COLUMN(E26))&\"!$B$3:$C$1000\"),2,),\"\")","v":"        0.82"},{"$f":"IFERROR(VLOOKUP($C28,INDIRECT(INDEX(листы,COLUMN(F26))&\"!$B$3:$C$1000\"),2,),\"\")","v":"        0.82"},{"$f":"IFERROR(VLOOKUP($C28,INDIRECT(INDEX(листы,COLUMN(G26))&\"!$B$3:$C$1000\"),2,),\"\")","v":""}]
[null,"93","BAV23A",458,{"$f":"IFERROR(VLOOKUP($C29,INDIRECT(INDEX(листы,COLUMN(B27))&\"!$B$3:$C$1000\"),2,),\"\")","v":""},{"$f":"IFERROR(VLOOKUP($C29,INDIRECT(INDEX(листы,COLUMN(C27))&\"!$B$3:$C$1000\"),2,),\"\")","v":"        2.54"},{"$f":"IFERROR(VLOOKUP($C29,INDIRECT(INDEX(листы,COLUMN(D27))&\"!$B$3:$C$1000\"),2,),\"\")","v":""},{"$f":"IFERROR(VLOOKUP($C29,INDIRECT(INDEX(листы,COLUMN(E27))&\"!$B$3:$C$1000\"),2,),\"\")","v":""},{"$f":"IFERROR(VLOOKUP($C29,INDIRECT(INDEX(листы,COLUMN(F27))&\"!$B$3:$C$1000\"),2,),\"\")","v":""},{"$f":"IFERROR(VLOOKUP($C29,INDIRECT(INDEX(листы,COLUMN(G27))&\"!$B$3:$C$1000\"),2,),\"\")","v":""}]
[null,"94","BAV70",-25158,{"$f":"IFERROR(VLOOKUP($C30,INDIRECT(INDEX(листы,COLUMN(B28))&\"!$B$3:$C$1000\"),2,),\"\")","v":""},{"$f":"IFERROR(VLOOKUP($C30,INDIRECT(INDEX(листы,COLUMN(C28))&\"!$B$3:$C$1000\"),2,),\"\")","v":"        0.59"},{"$f":"IFERROR(VLOOKUP($C30,INDIRECT(INDEX(листы,COLUMN(D28))&\"!$B$3:$C$1000\"),2,),\"\")","v":"        0.59"},{"$f":"IFERROR(VLOOKUP($C30,INDIRECT(INDEX(листы,COLUMN(E28))&\"!$B$3:$C$1000\"),2,),\"\")","v":"        0.59"},{"$f":"IFERROR(VLOOKUP($C30,INDIRECT(INDEX(листы,COLUMN(F28))&\"!$B$3:$C$1000\"),2,),\"\")","v":"        0.59"},{"$f":"IFERROR(VLOOKUP($C30,INDIRECT(INDEX(листы,COLUMN(G28))&\"!$B$3:$C$1000\"),2,),\"\")","v":""}]
{"$rows_left_out":101}
{"sheet":"н08","index":1,"n_rows":65,"n_cols":3,"rows_kept":65,"cut":false,"hidden":false,"merged":[]}
[]
["№","Товар","Цена"]
[1,"0603-1 кОм-5%","        0.05"]
[2,"0603-1 МОм-5%","        0.04"]
[3,"0603-1,3 кОм-1%","        0.07"]
[4,"0603-1,8 кОм-1%","        0.09"]
[5,"0603-10 кОм-5%","        0.05"]
[6,"0603-2,4 кОм-5%","        0.02"]
[7,"0603-200 кОм-5%","        0.05"]
[8,"0603-3 Ом-5%","        0.04"]
[9,"0603-3,9 кОм-5%","        0.05"]
[10,"0603-30 кОм-5%","        0.03"]
[11,"0603-300 Ом-5%","        0.05"]
[12,"0603-47 кОм-1%","        0.07"]
[13,"0603-470 Ом-5%","        0.05"]
[14,"0603-7,5 кОм-5%","        0.02"]
[15,"0603-NPO-50В-1000 пФ-5%","        0.26"]
[16,"0603-X7R-50В-0,1 мкФ-20%","        0.15"]
[17,"0805-1 Ом-5%","        0.07"]
[18,"0805-15 кОм-5%","        0.11"]
[19,"0805-300 кОм-5%","        0.06"]
[20,"1206-1 Ом-5%","        0.11"]
[21,"1206-20 кОм-5%","        0.12"]
[22,"1206-4,7 МОм-5%","        0.06"]
[23,"1206-NPO-500В-470 пФ-10%","        1.20"]
[24,"1206-X7R-200В-0,047 мкФ-20%","        1.14"]
[25,"3311100 (1A 250V 3.6*10 axial)","        2.86"]
[26,"AO3404A","        4.63"]
[27,"AOD2N60","        8.99"]
[28,"B32922C3154M (X2 305В 0,15 мкФ)","        3.93"]
{"$rows_left_out":36}
{"sheet":"к02","index":2,"n_rows":74,"n_cols":3,"rows_kept":74,"cut":false,"hidden":false,"merged":[]}
[]
["№","Товар","Цена"]
[1,"0603-0 Ом","        0.05"]
[2,"0603-1 МОм-5%","        0.04"]
[3,"0603-1,3 кОм-1%","        0.07"]
[4,"0603-110 кОм-5%","        0.04"]
[5,"0603-12 кОм-1%","        0.07"]
[6,"0603-15 кОм-1%","        0.06"]
[7,"0603-2 кОм-1%","        0.06"]
[8,"0603-2,2 кОм-5%","        0.05"]
[9,"0603-24 кОм-5%","        0.05"]
[10,"0603-36 кОм-5%","        0.04"]
[11,"0603-X7R-50В-0,1 мкФ-20%","        0.15"]
[12,"0603-X7R-50В-3300 пФ-20%","        0.12"]
[13,"0805-1 кОм-5%","        0.06"]
[14,"0805-820 кОм-5%","        0.04"]
[15,"0805-X7R-25В-1 мкФ-10%","        0.53"]
[16,"0805-X7R-50В-0,22 мкФ-20%","        0.50"]
[17,"1206-1 МОм-5%","        0.12"]
[18,"1206-1 Ом-1%","        0.24"]
[19,"1206-1 Ом-5%","        0.11"]
[20,"1206-100 Ом-5%","        0.12"]
[21,"1206-150 кОм-5%","        0.14"]
[22,"1206-2,7 кОм-5%","        0.20"]
[23,"1206-200 кОм-5%","        0.20"]
[24,"1206-3 кОм-5%","        0.11"]
[25,"1206-47 кОм-5%","        0.12"]
[26,"1206-NPO-500В-470 пФ-10%","        1.20"]
[27,"1206-X7R-200В-0,01 мкФ-20%","        0.68"]
[28,"1206-X7R-200В-0,1 мкФ-20%","        1.01"]
{"$rows_left_out":45}
{"sheet":"н07","index":3,"n_rows":66,"n_cols":3,"rows_kept":66,"cut":false,"hidden":false,"merged":[]}
[]
["№","Товар","Цена"]
[1,"0603-0 Ом","        0.05"]
[2,"0603-1,3 кОм-1%","        0.07"]
[3,"0603-2 кОм-5%","        0.05"]
[4,"0603-2 МОм-5%","        0.05"]
[5,"0603-220 кОм-5%","        0.05"]
[6,"0603-24 кОм-5%","        0.05"]
[7,"0603-3 кОм-5%","        0.05"]
[8,"0603-3,6 кОм-1%","        0.06"]
[9,"0603-36 кОм-5%","        0.04"]
[10,"0603-43 кОм-1%","        0.07"]
[11,"0603-5,6 кОм-1%","        0.08"]
[12,"0603-NPO-50В-330 пФ-10%","        0.16"]
[13,"0603-X7R-50В-0,1 мкФ-20%","        0.15"]
[14,"0603-X7R-50В-0,22 мкФ-20%","        0.36"]
[15,"0805-15 Ом-5%","        0.06"]
[16,"0805-X7R-25В-1 мкФ-10%","        0.53"]
[17,"1206-1 МОм-5%","        0.12"]
[18,"1206-1 Ом-1%","        0.24"]
[19,"1206-1 Ом-5%","        0.11"]
[20,"1206-2 кОм-5%","        0.11"]
[21,"1206-240 кОм-5%","        0.11"]
[22,"1206-470 кОм-5%","        0.14"]
[23,"1206-68 кОм-5%","        0.12"]
[24,"1206-NPO-500В-220 пФ-10%","        1.10"]
[25,"1206-X7R-500В-2200 пФ-20%","        0.90"]
[26,"3311100 (1A 250V 3.6*10 axial)","        2.86"]
[27,"BAT54C NXP","        0.82"]
[28,"BAV70","        0.59"]
{"$rows_left_out":37}
{"sheet":"н15","index":4,"n_rows":65,"n_cols":3,"rows_kept":65,"cut":false,"hidden":false,"merged":[]}
["№","Товар","Цена"]
[1,"0603-0 Ом","        0.05"]
[2,"0603-1,3 кОм-1%","        0.07"]
[3,"0603-2 кОм-5%","        0.05"]
[4,"0603-2 МОм-5%","        0.05"]
[5,"0603-2,4 кОм-1%","        0.06"]
[6,"0603-220 кОм-5%","        0.05"]
[7,"0603-24 кОм-5%","        0.05"]
[8,"0603-3,6 кОм-1%","        0.06"]
[9,"0603-36 кОм-5%","        0.04"]
[10,"0603-43 кОм-1%","        0.07"]
[11,"0603-5,6 кОм-5%","        0.05"]
[12,"0603-NPO-50В-330 пФ-10%","        0.16"]
[13,"0603-X7R-50В-0,1 мкФ-20%","        0.15"]
[14,"0603-X7R-50В-0,22 мкФ-20%","        0.36"]
[15,"0603-X7R-50В-3300 пФ-20%","        0.12"]
[16,"0805-15 Ом-5%","        0.06"]
[17,"0805-X7R-25В-1 мкФ-10%","        0.53"]
[18,"1206-1 МОм-5%","        0.12"]
[19,"1206-1 Ом-1%","        0.24"]
[20,"1206-1 Ом-5%","        0.11"]
[21,"1206-1,8 кОм-5%","        0.12"]
[22,"1206-150 кОм-5%","        0.14"]
[23,"1206-47 кОм-5%","        0.12"]
[24,"1206-X7R-500В-0,01 мкФ-20%","        0.66"]
[25,"1206-X7R-500В-680 пФ-20%","        0.98"]
[26,"3311100 (1A 250V 3.6*10 axial)","        2.86"]
[27,"8N90","       32.30"]
[28,"B32923C3474M (X2 305В 0,47 мкФ)","        6.72"]
[29,"BAT54C NXP","        0.82"]
{"$rows_left_out":36}
{"sheet":"м15","index":5,"n_rows":80,"n_cols":3,"rows_kept":80,"cut":false,"hidden":false,"merged":[]}
["№","Товар","Цена"]
[1,"0603-1,3 кОм-1%","        0.07"]
[2,"0603-1,8 кОм-1%","        0.09"]
[3,"0603-1,87 кОм-1%","        0.07"]
[4,"0603-100 кОм-1%","        0.06"]
[5,"0603-2 МОм-5%","        0.05"]
[6,"0603-2,7 кОм-1%","        0.07"]
[7,"0603-20 кОм-1%","        0.06"]
[8,"0603-24 кОм-5%","        0.05"]
[9,"0603-240 кОм-5%","        0.07"]
[10,"0603-3 кОм-5%","        0.05"]
[11,"0603-3 МОм-1%","        0.22"]
[12,"0603-36 кОм-1%","        0.08"]
[13,"0603-4,99 МОм-1%","        0.12"]
[14,"0603-750 кОм-5%","        0.05"]
[15,"0603-8,25 кОм-1%","        0.07"]
[16,"0603-NPO-50В-330 пФ-10%","        0.16"]
[17,"0603-X7R-50В-0,047 мкФ-10%","        0.17"]
[18,"0603-X7R-50В-0,1 мкФ-20%","        0.15"]
[19,"0603-X7R-50В-0,22 мкФ-20%","        0.36"]
[20,"0805-15 Ом-5%","        0.06"]
[21,"0805-X7R-25В-1 мкФ-10%","        0.53"]
[22,"1206-1 МОм-5%","        0.12"]
[23,"1206-1 Ом-1%","        0.24"]
[24,"1206-130 кОм-5%","        0.13"]
[25,"1206-270 кОм-5%","        0.19"]
[26,"1206-47 кОм-5%","        0.12"]
[27,"1206-560 Ом-5%","        0.12"]
[28,"1206-X7R-1кВ-220 пФ-20%","        1.57"]
[29,"1206-X7R-500В-0,01 мкФ-20%","        0.66"]
{"$rows_left_out":50}