{"text_format":"1","workbook":"xlsx","n_sheets":2,"sheets":["Лист1","Расчет"],"not_rendered":{"charts":0,"images":0,"macros":1,"external_links":0,"defined_names":0,"comments":0,"pivot_tables":0},"unopened":[],"bounds":{"document_bytes":16777216,"sheet_cells":100000,"rows_first":2000,"rows_last":500,"rows_between":2000,"halvings":0,"cell_chars":16384,"cell_head_chars":4096},"cells_cut":0,"cells_raw":0,"read":"whole","date_system":"1900"}

{"sheet":"Лист1","index":0,"n_rows":35,"n_cols":18,"rows_kept":35,"cut":false,"hidden":false,"merged":[[12,6,12,8],[12,10,12,12],[12,15,12,17]]}
[]
[]
[]
[null,null,null,"Материал труб","Качество"]
[null,null,null,"PP-R PN10*","нов."]
[null,null,null,"PP-R PN20*","исп."]
[null,null,null,"СтВГП"," "]
[null,null,null,"СтЭС"]
[null,null,null,"ПЭ100 SDR 17*"]
[null,null,null,"ПЭ100 SDR 11*"]
[null,null,null,"Чугун."]
[null,null,null,"ВЧШГ"]
[null,null,"PP-R","PN 10","PN 20",null,"СтВГП",null,null,null,"СтЭС",null,null,null,null,"ГОСТ 18599-2001* ПЭ 100"]
[null,15,20,1.9,3.4,null,15,21.3,2.8,null,50,70,2.5,null,50,63,3.8,5.8]
[null,20,25,2.2999999999999998,4.2,null,20,26.8,2.8,null,60,76,2.5,null,65,75,4.5,6.8]
[null,25,32,3,5.4,null,25,33.5,3.2,null,"75/65",89,2.5,null,80,90,5.4,8.1999999999999993]
[null,32,40,3.7,6.7,null,32,42.3,3.2,null,80,102,3,null,90,110,6.6,10]
[null,40,50,4.5999999999999996,8.4,null,40,48,3.5,null,100,121,3,null,100,125,7.4,11.4]
[null,50,63,5.8,10.5,null,50,60,3.5,null,125,140,3,null,125,140,8.3000000000000007,12.7]
[null,65,75,6.9,12.5,null,65,75.5,4,null,150,168,4.5,null,150,160,9.5,14.6]
[null,80,90,8.1999999999999993,15,null,80,88.5,4,null,200,219,4.5,null,160,180,10.7,16.399999999999999]
[null,90,110,10,18.399999999999999,null,90,101.3,4,null,250,273,6,null,200,225,13.4,20.5]
[null,null,null,null,null,null,100,114,4.5,null,300,325,7,null,225,250,14.8,22.7]
[null,null,null,null,null,null,null,null,null,null,350,377,7,null,250,280,16.600000000000001,25.4]
[null,null,null,null,null,null,null,null,null,null,null,null,null,null,300,315,18.7,28.6]
[null,null,"Чугун ГОСТ 9583-75*",null,null,"ВЧШГ"]
[null,"75/65",81,6.7,null,80,98,9]
[null,80,98,7.2,null,100,118,9]
[null,100,118,7.5,null,125,144,9]
[null,125,144,7.9,null,150,170,9]
[null,150,170,8.3000000000000007,null,200,222,9.3000000000000007]
[null,200,222,9.1999999999999993,null,250,274,9.8000000000000007]
[null,250,274,10,null,300,326,10.199999999999999]
[null,300,326,10.8]
[null,350,378,12.8]

{"sheet":"Расчет","index":1,"n_rows":31,"n_cols":5,"rows_kept":31,"cut":false,"hidden":false,"merged":[[9,3,11,3],[9,0,11,0],[9,1,11,1],[9,2,11,2],[9,4,11,4]]}
[]
[]
[]
[]
[]
[]
[]
[]
[]
["Материал труб","Качество","Dу, мм","D, мм","t, мм"]
[]
[]
[14,15,17,20,21]
["СтЭС","нов.",60,{"$f":"IF(OR(A14 = Лист1!$D$5,A14 = Лист1!$D$6),VLOOKUP(C14,Лист1!$B$14:$E$22,2,0),IF(A14=Лист1!$D$7,VLOOKUP(C14,Лист1!$G$14:$I$23,2,0),IF(A14=Лист1!$D$8,VLOOKUP(C14,Лист1!$K$14:$M$24,2,0),IF(OR(A14 = Лист1!$D$9,A14 = Лист1!$D$10),VLOOKUP(C14,Лист1!$O$14:$R$25,2,0),\"\"))))","v":76},{"$f":"IF(A14=Лист1!$D$5,VLOOKUP(C14,Лист1!$B$14:$E$22,3,0),IF(A14=Лист1!$D$6,VLOOKUP(C14,Лист1!$B$14:$E$22,4,0),IF(A14=Лист1!$D$7,VLOOKUP(C14,Лист1!$G$14:$I$23,3,0),IF(A14=Лист1!$D$8,VLOOKUP(C14,Лист1!$K$14:$M$24,3,0),IF(A14=Лист1!$D$9,VLOOKUP(C14,Лист1!$O$14:$R$25,3,0),VLOOKUP(C14,Лист1!$O$14:$R$25,4,0))))))","v":2.5}]
["СтВГП","нов.",15,{"$f":"IF(OR(A15 = Лист1!$D$5,A15 = Лист1!$D$6),VLOOKUP(C15,Лист1!$B$14:$E$22,2,0),IF(A15=Лист1!$D$7,VLOOKUP(C15,Лист1!$G$14:$I$23,2,0),IF(A15=Лист1!$D$8,VLOOKUP(C15,Лист1!$K$14:$M$24,2,0),IF(OR(A15 = Лист1!$D$9,A15 = Лист1!$D$10),VLOOKUP(C15,Лист1!$O$14:$R$25,2,0),\"\"))))","v":21.3},{"$f":"IF(A15=Лист1!$D$5,VLOOKUP(C15,Лист1!$B$14:$E$22,3,0),IF(A15=Лист1!$D$6,VLOOKUP(C15,Лист1!$B$14:$E$22,4,0),IF(A15=Лист1!$D$7,VLOOKUP(C15,Лист1!$G$14:$I$23,3,0),IF(A15=Лист1!$D$8,VLOOKUP(C15,Лист1!$K$14:$M$24,3,0),IF(A15=Лист1!$D$9,VLOOKUP(C15,Лист1!$O$14:$R$25,3,0),VLOOKUP(C15,Лист1!$O$14:$R$25,4,0))))))","v":2.8}]
["СтВГП","исп.",25,{"$f":"IF(OR(A16 = Лист1!$D$5,A16 = Лист1!$D$6),VLOOKUP(C16,Лист1!$B$14:$E$22,2,0),IF(A16=Лист1!$D$7,VLOOKUP(C16,Лист1!$G$14:$I$23,2,0),IF(A16=Лист1!$D$8,VLOOKUP(C16,Лист1!$K$14:$M$24,2,0),IF(OR(A16 = Лист1!$D$9,A16 = Лист1!$D$10),VLOOKUP(C16,Лист1!$O$14:$R$25,2,0),\"\"))))","v":33.5},{"$f":"IF(A16=Лист1!$D$5,VLOOKUP(C16,Лист1!$B$14:$E$22,3,0),IF(A16=Лист1!$D$6,VLOOKUP(C16,Лист1!$B$14:$E$22,4,0),IF(A16=Лист1!$D$7,VLOOKUP(C16,Лист1!$G$14:$I$23,3,0),IF(A16=Лист1!$D$8,VLOOKUP(C16,Лист1!$K$14:$M$24,3,0),IF(A16=Лист1!$D$9,VLOOKUP(C16,Лист1!$O$14:$R$25,3,0),VLOOKUP(C16,Лист1!$O$14:$R$25,4,0))))))","v":3.2}]
["СтВГП","исп.",25,{"$f":"IF(OR(A17 = Лист1!$D$5,A17 = Лист1!$D$6),VLOOKUP(C17,Лист1!$B$14:$E$22,2,0),IF(A17=Лист1!$D$7,VLOOKUP(C17,Лист1!$G$14:$I$23,2,0),IF(A17=Лист1!$D$8,VLOOKUP(C17,Лист1!$K$14:$M$24,2,0),IF(OR(A17 = Лист1!$D$9,A17 = Лист1!$D$10),VLOOKUP(C17,Лист1!$O$14:$R$25,2,0),\"\"))))","v":33.5},{"$f":"IF(A17=Лист1!$D$5,VLOOKUP(C17,Лист1!$B$14:$E$22,3,0),IF(A17=Лист1!$D$6,VLOOKUP(C17,Лист1!$B$14:$E$22,4,0),IF(A17=Лист1!$D$7,VLOOKUP(C17,Лист1!$G$14:$I$23,3,0),IF(A17=Лист1!$D$8,VLOOKUP(C17,Лист1!$K$14:$M$24,3,0),IF(A17=Лист1!$D$9,VLOOKUP(C17,Лист1!$O$14:$R$25,3,0),VLOOKUP(C17,Лист1!$O$14:$R$25,4,0))))))","v":3.2}]
["СтВГП","нов.",25,{"$f":"IF(OR(A18 = Лист1!$D$5,A18 = Лист1!$D$6),VLOOKUP(C18,Лист1!$B$14:$E$22,2,0),IF(A18=Лист1!$D$7,VLOOKUP(C18,Лист1!$G$14:$I$23,2,0),IF(A18=Лист1!$D$8,VLOOKUP(C18,Лист1!$K$14:$M$24,2,0),IF(OR(A18 = Лист1!$D$9,A18 = Лист1!$D$10),VLOOKUP(C18,Лист1!$O$14:$R$25,2,0),\"\"))))","v":33.5},{"$f":"IF(A18=Лист1!$D$5,VLOOKUP(C18,Лист1!$B$14:$E$22,3,0),IF(A18=Лист1!$D$6,VLOOKUP(C18,Лист1!$B$14:$E$22,4,0),IF(A18=Лист1!$D$7,VLOOKUP(C18,Лист1!$G$14:$I$23,3,0),IF(A18=Лист1!$D$8,VLOOKUP(C18,Лист1!$K$14:$M$24,3,0),IF(A18=Лист1!$D$9,VLOOKUP(C18,Лист1!$O$14:$R$25,3,0),VLOOKUP(C18,Лист1!$O$14:$R$25,4,0))))))","v":3.2}]
["СтВГП","исп.",25,{"$f":"IF(OR(A19 = Лист1!$D$5,A19 = Лист1!$D$6),VLOOKUP(C19,Лист1!$B$14:$E$22,2,0),IF(A19=Лист1!$D$7,VLOOKUP(C19,Лист1!$G$14:$I$23,2,0),IF(A19=Лист1!$D$8,VLOOKUP(C19,Лист1!$K$14:$M$24,2,0),IF(OR(A19 = Лист1!$D$9,A19 = Лист1!$D$10),VLOOKUP(C19,Лист1!$O$14:$R$25,2,0),\"\"))))","v":33.5},{"$f":"IF(A19=Лист1!$D$5,VLOOKUP(C19,Лист1!$B$14:$E$22,3,0),IF(A19=Лист1!$D$6,VLOOKUP(C19,Лист1!$B$14:$E$22,4,0),IF(A19=Лист1!$D$7,VLOOKUP(C19,Лист1!$G$14:$I$23,3,0),IF(A19=Лист1!$D$8,VLOOKUP(C19,Лист1!$K$14:$M$24,3,0),IF(A19=Лист1!$D$9,VLOOKUP(C19,Лист1!$O$14:$R$25,3,0),VLOOKUP(C19,Лист1!$O$14:$R$25,4,0))))))","v":3.2}]
["СтВГП","исп.",25,{"$f":"IF(OR(A20 = Лист1!$D$5,A20 = Лист1!$D$6),VLOOKUP(C20,Лист1!$B$14:$E$22,2,0),IF(A20=Лист1!$D$7,VLOOKUP(C20,Лист1!$G$14:$I$23,2,0),IF(A20=Лист1!$D$8,VLOOKUP(C20,Лист1!$K$14:$M$24,2,0),IF(OR(A20 = Лист1!$D$9,A20 = Лист1!$D$10),VLOOKUP(C20,Лист1!$O$14:$R$25,2,0),\"\"))))","v":33.5},{"$f":"IF(A20=Лист1!$D$5,VLOOKUP(C20,Лист1!$B$14:$E$22,3,0),IF(A20=Лист1!$D$6,VLOOKUP(C20,Лист1!$B$14:$E$22,4,0),IF(A20=Лист1!$D$7,VLOOKUP(C20,Лист1!$G$14:$I$23,3,0),IF(A20=Лист1!$D$8,VLOOKUP(C20,Лист1!$K$14:$M$24,3,0),IF(A20=Лист1!$D$9,VLOOKUP(C20,Лист1!$O$14:$R$25,3,0),VLOOKUP(C20,Лист1!$O$14:$R$25,4,0))))))","v":3.2}]
["СтВГП","исп.",25,{"$f":"IF(OR(A21 = Лист1!$D$5,A21 = Лист1!$D$6),VLOOKUP(C21,Лист1!$B$14:$E$22,2,0),IF(A21=Лист1!$D$7,VLOOKUP(C21,Лист1!$G$14:$I$23,2,0),IF(A21=Лист1!$D$8,VLOOKUP(C21,Лист1!$K$14:$M$24,2,0),IF(OR(A21 = Лист1!$D$9,A21 = Лист1!$D$10),VLOOKUP(C21,Лист1!$O$14:$R$25,2,0),\"\"))))","v":33.5},{"$f":"IF(A21=Лист1!$D$5,VLOOKUP(C21,Лист1!$B$14:$E$22,3,0),IF(A21=Лист1!$D$6,VLOOKUP(C21,Лист1!$B$14:$E$22,4,0),IF(A21=Лист1!$D$7,VLOOKUP(C21,Лист1!$G$14:$I$23,3,0),IF(A21=Лист1!$D$8,VLOOKUP(C21,Лист1!$K$14:$M$24,3,0),IF(A21=Лист1!$D$9,VLOOKUP(C21,Лист1!$O$14:$R$25,3,0),VLOOKUP(C21,Лист1!$O$14:$R$25,4,0))))))","v":3.2}]
["СтВГП","исп.",25,{"$f":"IF(OR(A22 = Лист1!$D$5,A22 = Лист1!$D$6),VLOOKUP(C22,Лист1!$B$14:$E$22,2,0),IF(A22=Лист1!$D$7,VLOOKUP(C22,Лист1!$G$14:$I$23,2,0),IF(A22=Лист1!$D$8,VLOOKUP(C22,Лист1!$K$14:$M$24,2,0),IF(OR(A22 = Лист1!$D$9,A22 = Лист1!$D$10),VLOOKUP(C22,Лист1!$O$14:$R$25,2,0),\"\"))))","v":33.5},{"$f":"IF(A22=Лист1!$D$5,VLOOKUP(C22,Лист1!$B$14:$E$22,3,0),IF(A22=Лист1!$D$6,VLOOKUP(C22,Лист1!$B$14:$E$22,4,0),IF(A22=Лист1!$D$7,VLOOKUP(C22,Лист1!$G$14:$I$23,3,0),IF(A22=Лист1!$D$8,VLOOKUP(C22,Лист1!$K$14:$M$24,3,0),IF(A22=Лист1!$D$9,VLOOKUP(C22,Лист1!$O$14:$R$25,3,0),VLOOKUP(C22,Лист1!$O$14:$R$25,4,0))))))","v":3.2}]
["СтВГП","исп.",32,{"$f":"IF(OR(A23 = Лист1!$D$5,A23 = Лист1!$D$6),VLOOKUP(C23,Лист1!$B$14:$E$22,2,0),IF(A23=Лист1!$D$7,VLOOKUP(C23,Лист1!$G$14:$I$23,2,0),IF(A23=Лист1!$D$8,VLOOKUP(C23,Лист1!$K$14:$M$24,2,0),IF(OR(A23 = Лист1!$D$9,A23 = Лист1!$D$10),VLOOKUP(C23,Лист1!$O$14:$R$25,2,0),\"\"))))","v":42.3},{"$f":"IF(A23=Лист1!$D$5,VLOOKUP(C23,Лист1!$B$14:$E$22,3,0),IF(A23=Лист1!$D$6,VLOOKUP(C23,Лист1!$B$14:$E$22,4,0),IF(A23=Лист1!$D$7,VLOOKUP(C23,Лист1!$G$14:$I$23,3,0),IF(A23=Лист1!$D$8,VLOOKUP(C23,Лист1!$K$14:$M$24,3,0),IF(A23=Лист1!$D$9,VLOOKUP(C23,Лист1!$O$14:$R$25,3,0),VLOOKUP(C23,Лист1!$O$14:$R$25,4,0))))))","v":3.2}]
["СтВГП","нов.",50,{"$f":"IF(OR(A24 = Лист1!$D$5,A24 = Лист1!$D$6),VLOOKUP(C24,Лист1!$B$14:$E$22,2,0),IF(A24=Лист1!$D$7,VLOOKUP(C24,Лист1!$G$14:$I$23,2,0),IF(A24=Лист1!$D$8,VLOOKUP(C24,Лист1!$K$14:$M$24,2,0),IF(OR(A24 = Лист1!$D$9,A24 = Лист1!$D$10),VLOOKUP(C24,Лист1!$O$14:$R$25,2,0),\"\"))))","v":60},{"$f":"IF(A24=Лист1!$D$5,VLOOKUP(C24,Лист1!$B$14:$E$22,3,0),IF(A24=Лист1!$D$6,VLOOKUP(C24,Лист1!$B$14:$E$22,4,0),IF(A24=Лист1!$D$7,VLOOKUP(C24,Лист1!$G$14:$I$23,3,0),IF(A24=Лист1!$D$8,VLOOKUP(C24,Лист1!$K$14:$M$24,3,0),IF(A24=Лист1!$D$9,VLOOKUP(C24,Лист1!$O$14:$R$25,3,0),VLOOKUP(C24,Лист1!$O$14:$R$25,4,0))))))","v":3.5}]
["СтВГП","исп.",32,{"$f":"IF(OR(A25 = Лист1!$D$5,A25 = Лист1!$D$6),VLOOKUP(C25,Лист1!$B$14:$E$22,2,0),IF(A25=Лист1!$D$7,VLOOKUP(C25,Лист1!$G$14:$I$23,2,0),IF(A25=Лист1!$D$8,VLOOKUP(C25,Лист1!$K$14:$M$24,2,0),IF(OR(A25 = Лист1!$D$9,A25 = Лист1!$D$10),VLOOKUP(C25,Лист1!$O$14:$R$25,2,0),\"\"))))","v":42.3},{"$f":"IF(A25=Лист1!$D$5,VLOOKUP(C25,Лист1!$B$14:$E$22,3,0),IF(A25=Лист1!$D$6,VLOOKUP(C25,Лист1!$B$14:$E$22,4,0),IF(A25=Лист1!$D$7,VLOOKUP(C25,Лист1!$G$14:$I$23,3,0),IF(A25=Лист1!$D$8,VLOOKUP(C25,Лист1!$K$14:$M$24,3,0),IF(A25=Лист1!$D$9,VLOOKUP(C25,Лист1!$O$14:$R$25,3,0),VLOOKUP(C25,Лист1!$O$14:$R$25,4,0))))))","v":3.2}]
["СтВГП","исп.",40,{"$f":"IF(OR(A26 = Лист1!$D$5,A26 = Лист1!$D$6),VLOOKUP(C26,Лист1!$B$14:$E$22,2,0),IF(A26=Лист1!$D$7,VLOOKUP(C26,Лист1!$G$14:$I$23,2,0),IF(A26=Лист1!$D$8,VLOOKUP(C26,Лист1!$K$14:$M$24,2,0),IF(OR(A26 = Лист1!$D$9,A26 = Лист1!$D$10),VLOOKUP(C26,Лист1!$O$14:$R$25,2,0),\"\"))))","v":48},{"$f":"IF(A26=Лист1!$D$5,VLOOKUP(C26,Лист1!$B$14:$E$22,3,0),IF(A26=Лист1!$D$6,VLOOKUP(C26,Лист1!$B$14:$E$22,4,0),IF(A26=Лист1!$D$7,VLOOKUP(C26,Лист1!$G$14:$I$23,3,0),IF(A26=Лист1!$D$8,VLOOKUP(C26,Лист1!$K$14:$M$24,3,0),IF(A26=Лист1!$D$9,VLOOKUP(C26,Лист1!$O$14:$R$25,3,0),VLOOKUP(C26,Лист1!$O$14:$R$25,4,0))))))","v":3.5}]
["СтВГП","исп.",40,{"$f":"IF(OR(A27 = Лист1!$D$5,A27 = Лист1!$D$6),VLOOKUP(C27,Лист1!$B$14:$E$22,2,0),IF(A27=Лист1!$D$7,VLOOKUP(C27,Лист1!$G$14:$I$23,2,0),IF(A27=Лист1!$D$8,VLOOKUP(C27,Лист1!$K$14:$M$24,2,0),IF(OR(A27 = Лист1!$D$9,A27 = Лист1!$D$10),VLOOKUP(C27,Лист1!$O$14:$R$25,2,0),\"\"))))","v":48},{"$f":"IF(A27=Лист1!$D$5,VLOOKUP(C27,Лист1!$B$14:$E$22,3,0),IF(A27=Лист1!$D$6,VLOOKUP(C27,Лист1!$B$14:$E$22,4,0),IF(A27=Лист1!$D$7,VLOOKUP(C27,Лист1!$G$14:$I$23,3,0),IF(A27=Лист1!$D$8,VLOOKUP(C27,Лист1!$K$14:$M$24,3,0),IF(A27=Лист1!$D$9,VLOOKUP(C27,Лист1!$O$14:$R$25,3,0),VLOOKUP(C27,Лист1!$O$14:$R$25,4,0))))))","v":3.5}]
["СтВГП","исп.",50,{"$f":"IF(OR(A28 = Лист1!$D$5,A28 = Лист1!$D$6),VLOOKUP(C28,Лист1!$B$14:$E$22,2,0),IF(A28=Лист1!$D$7,VLOOKUP(C28,Лист1!$G$14:$I$23,2,0),IF(A28=Лист1!$D$8,VLOOKUP(C28,Лист1!$K$14:$M$24,2,0),IF(OR(A28 = Лист1!$D$9,A28 = Лист1!$D$10),VLOOKUP(C28,Лист1!$O$14:$R$25,2,0),\"\"))))","v":60},{"$f":"IF(A28=Лист1!$D$5,VLOOKUP(C28,Лист1!$B$14:$E$22,3,0),IF(A28=Лист1!$D$6,VLOOKUP(C28,Лист1!$B$14:$E$22,4,0),IF(A28=Лист1!$D$7,VLOOKUP(C28,Лист1!$G$14:$I$23,3,0),IF(A28=Лист1!$D$8,VLOOKUP(C28,Лист1!$K$14:$M$24,3,0),IF(A28=Лист1!$D$9,VLOOKUP(C28,Лист1!$O$14:$R$25,3,0),VLOOKUP(C28,Лист1!$O$14:$R$25,4,0))))))","v":3.5}]
["СтВГП","исп.",50,{"$f":"IF(OR(A29 = Лист1!$D$5,A29 = Лист1!$D$6),VLOOKUP(C29,Лист1!$B$14:$E$22,2,0),IF(A29=Лист1!$D$7,VLOOKUP(C29,Лист1!$G$14:$I$23,2,0),IF(A29=Лист1!$D$8,VLOOKUP(C29,Лист1!$K$14:$M$24,2,0),IF(OR(A29 = Лист1!$D$9,A29 = Лист1!$D$10),VLOOKUP(C29,Лист1!$O$14:$R$25,2,0),\"\"))))","v":60},{"$f":"IF(A29=Лист1!$D$5,VLOOKUP(C29,Лист1!$B$14:$E$22,3,0),IF(A29=Лист1!$D$6,VLOOKUP(C29,Лист1!$B$14:$E$22,4,0),IF(A29=Лист1!$D$7,VLOOKUP(C29,Лист1!$G$14:$I$23,3,0),IF(A29=Лист1!$D$8,VLOOKUP(C29,Лист1!$K$14:$M$24,3,0),IF(A29=Лист1!$D$9,VLOOKUP(C29,Лист1!$O$14:$R$25,3,0),VLOOKUP(C29,Лист1!$O$14:$R$25,4,0))))))","v":3.5}]
["СтВГП","исп.",50,{"$f":"IF(OR(A30 = Лист1!$D$5,A30 = Лист1!$D$6),VLOOKUP(C30,Лист1!$B$14:$E$22,2,0),IF(A30=Лист1!$D$7,VLOOKUP(C30,Лист1!$G$14:$I$23,2,0),IF(A30=Лист1!$D$8,VLOOKUP(C30,Лист1!$K$14:$M$24,2,0),IF(OR(A30 = Лист1!$D$9,A30 = Лист1!$D$10),VLOOKUP(C30,Лист1!$O$14:$R$25,2,0),\"\"))))","v":60},{"$f":"IF(A30=Лист1!$D$5,VLOOKUP(C30,Лист1!$B$14:$E$22,3,0),IF(A30=Лист1!$D$6,VLOOKUP(C30,Лист1!$B$14:$E$22,4,0),IF(A30=Лист1!$D$7,VLOOKUP(C30,Лист1!$G$14:$I$23,3,0),IF(A30=Лист1!$D$8,VLOOKUP(C30,Лист1!$K$14:$M$24,3,0),IF(A30=Лист1!$D$9,VLOOKUP(C30,Лист1!$O$14:$R$25,3,0),VLOOKUP(C30,Лист1!$O$14:$R$25,4,0))))))","v":3.5}]
["СтВГП","исп.",50,{"$f":"IF(OR(A31 = Лист1!$D$5,A31 = Лист1!$D$6),VLOOKUP(C31,Лист1!$B$14:$E$22,2,0),IF(A31=Лист1!$D$7,VLOOKUP(C31,Лист1!$G$14:$I$23,2,0),IF(A31=Лист1!$D$8,VLOOKUP(C31,Лист1!$K$14:$M$24,2,0),IF(OR(A31 = Лист1!$D$9,A31 = Лист1!$D$10),VLOOKUP(C31,Лист1!$O$14:$R$25,2,0),\"\"))))","v":60},{"$f":"IF(A31=Лист1!$D$5,VLOOKUP(C31,Лист1!$B$14:$E$22,3,0),IF(A31=Лист1!$D$6,VLOOKUP(C31,Лист1!$B$14:$E$22,4,0),IF(A31=Лист1!$D$7,VLOOKUP(C31,Лист1!$G$14:$I$23,3,0),IF(A31=Лист1!$D$8,VLOOKUP(C31,Лист1!$K$14:$M$24,3,0),IF(A31=Лист1!$D$9,VLOOKUP(C31,Лист1!$O$14:$R$25,3,0),VLOOKUP(C31,Лист1!$O$14:$R$25,4,0))))))","v":3.5}]