{"text_format":"1","workbook":"xlsx","n_sheets":2,"sheets":["Калькуляция","Лист1"],"not_rendered":{"charts":0,"images":0,"macros":1,"external_links":0,"defined_names":13,"comments":0,"pivot_tables":0},"unopened":[],"bounds":{"document_bytes":16777216,"sheet_cells":100000,"rows_first":2000,"rows_last":500,"rows_between":2000,"halvings":0,"cell_chars":16384,"cell_head_chars":4096},"cells_cut":0,"cells_raw":0,"read":"whole","date_system":"1900"}

{"sheet":"Калькуляция","index":0,"n_rows":500,"n_cols":12,"rows_kept":500,"cut":false,"hidden":false,"merged":[[8,0,8,11],[9,0,9,11],[14,0,14,11],[11,0,12,0],[11,1,12,1],[11,2,11,3],[11,4,11,7],[11,8,11,11],[0,0,0,1],[5,0,5,11],[6,0,6,11],[7,0,7,11],[1,0,1,1],[3,0,3,1],[4,0,4,1]]}
[null,null,null,null,"Накл.расх.",0.1,null,null,null,null,null,"УТВЕРЖДАЮ:"]
[null,null,null,null,"Смет. Приб.",0.25,null,null,null,null,null,"Директор"]
[null,null,null,null,"Непредв. Затр.",0.02]
[null,null,null,null,null,null,null,null,null,null,null,"______________И.В. Сидоров"]
[null,null,null,null,null,null,null,null,null,null,null,"\"___\"________________2017г."]
["Ведомость объемов работ (дефектная ведомость)"]
["Ремонт"]
["(категория ремонта)"]
[]
["(наименование объекта, станционный номер, инвентарный номер)"]
[]
["№ п.п.","Наименование работ","Объем работ",null,"Демонтируемый материал",null,null,null,"Потребность в основных материалах"]
[null,null,"Ед. изм.","Кол-во","Стоимость работ (ФОТ)","Стоимость материалов","Сметная прибыль","Накладные расходы","Наименование","Ед. изм.","Кол-во","Стоимость"]
[1,2,3,4,5,6,7,8,9,10,11,12]
["Раздел 1"]
[{"$f":"IF(D16>0,COUNT(D$16:D16,\"\"),\"\")","v":1},"Облицовка стен листами из ГКЛ по металлическим направляющим",{"$f":"IFERROR(VLOOKUP(B16,Лист1!B$2:J$999,3,0),\"\")","v":"м2"},10,{"$f":"IFERROR(D16*VLOOKUP(B16,Лист1!B$1:J$999,5,0),\"\")","v":3000},{"$f":"SUM(L17:L24)","v":0},{"$f":"IFERROR(E16*F$2,\"\")","v":750},{"$f":"IFERROR(E16*F$1,\"\")","v":300}]
[{"$f":"IF(D17>0,COUNT(D$16:D17,\"\"),\"\")","v":""},null,{"$f":"IFERROR(VLOOKUP(B17,Лист1!B$2:J$999,3,0),\"\")","v":""},null,{"$f":"IFERROR(D17*VLOOKUP(B17,Лист1!B$1:J$999,5,0),\"\")","v":""},null,{"$f":"IFERROR(E17*F$2,\"\")","v":""},{"$f":"IFERROR(E17*F$1,\"\")","v":""},"Профиль ПН 27*28",{"$f":"IFERROR(VLOOKUP(I17,Лист1!$N$3:$Q$500,2,0),\"\")","v":"шт"},null,{"$f":"IFERROR(CEILING(VLOOKUP(I17,Лист1!$N$3:$Q$500,4,0)*K17,1),\"\")","v":0}]
[{"$f":"IF(D18>0,COUNT(D$16:D18,\"\"),\"\")","v":""},null,{"$f":"IFERROR(VLOOKUP(B18,Лист1!B$2:J$999,3,0),\"\")","v":""},null,{"$f":"IFERROR(D18*VLOOKUP(B18,Лист1!B$1:J$999,5,0),\"\")","v":""},null,"","","Профиль ПН 27*28",{"$f":"IFERROR(VLOOKUP(I18,Лист1!$N$3:$Q$500,2,0),\"\")","v":"шт"},null,{"$f":"IFERROR(CEILING(VLOOKUP(I18,Лист1!$N$3:$Q$500,4,0)*K18,1),\"\")","v":0}]
[{"$f":"IF(D19>0,COUNT(D$16:D19,\"\"),\"\")","v":""},null,{"$f":"IFERROR(VLOOKUP(B19,Лист1!B$2:J$999,3,0),\"\")","v":""},null,{"$f":"IFERROR(D19*VLOOKUP(B19,Лист1!B$1:J$999,5,0),\"\")","v":""},null,"","","Профиль ПП 60*27",{"$f":"IFERROR(VLOOKUP(I19,Лист1!$N$3:$Q$500,2,0),\"\")","v":"шт"},null,{"$f":"IFERROR(CEILING(VLOOKUP(I19,Лист1!$N$3:$Q$500,4,0)*K19,1),\"\")","v":0}]
[{"$f":"IF(D20>0,COUNT(D$16:D20,\"\"),\"\")","v":""},null,{"$f":"IFERROR(VLOOKUP(B20,Лист1!B$2:J$999,3,0),\"\")","v":""},null,{"$f":"IFERROR(D20*VLOOKUP(B20,Лист1!B$1:J$999,5,0),\"\")","v":""},null,"","","Саморез 3,5*11 (клоп)",{"$f":"IFERROR(VLOOKUP(I20,Лист1!$N$3:$Q$500,2,0),\"\")","v":"шт"},null,{"$f":"IFERROR(CEILING(VLOOKUP(I20,Лист1!$N$3:$Q$500,4,0)*K20,1),\"\")","v":0}]
[{"$f":"IF(D21>0,COUNT(D$16:D21,\"\"),\"\")","v":""},null,{"$f":"IFERROR(VLOOKUP(B21,Лист1!B$2:J$999,3,0),\"\")","v":""},null,{"$f":"IFERROR(D21*VLOOKUP(B21,Лист1!B$1:J$999,5,0),\"\")","v":""},null,"","","Саморез 3,5*25",{"$f":"IFERROR(VLOOKUP(I21,Лист1!$N$3:$Q$500,2,0),\"\")","v":"шт"},null,{"$f":"IFERROR(CEILING(VLOOKUP(I21,Лист1!$N$3:$Q$500,4,0)*K21,1),\"\")","v":0}]
[{"$f":"IF(D22>0,COUNT(D$16:D22,\"\"),\"\")","v":""},null,{"$f":"IFERROR(VLOOKUP(B22,Лист1!B$2:J$999,3,0),\"\")","v":""},null,{"$f":"IFERROR(D22*VLOOKUP(B22,Лист1!B$1:J$999,5,0),\"\")","v":""},null,"","","Соединитель \"Краб\"",{"$f":"IFERROR(VLOOKUP(I22,Лист1!$N$3:$Q$500,2,0),\"\")","v":"шт"},null,{"$f":"IFERROR(CEILING(VLOOKUP(I22,Лист1!$N$3:$Q$500,4,0)*K22,1),\"\")","v":0}]
[{"$f":"IF(D23>0,COUNT(D$16:D23,\"\"),\"\")","v":""},null,{"$f":"IFERROR(VLOOKUP(B23,Лист1!B$2:J$999,3,0),\"\")","v":""},null,{"$f":"IFERROR(D23*VLOOKUP(B23,Лист1!B$1:J$999,5,0),\"\")","v":""},null,"","","Подвес прямой 60*27",{"$f":"IFERROR(VLOOKUP(I23,Лист1!$N$3:$Q$500,2,0),\"\")","v":"шт"},null,{"$f":"IFERROR(CEILING(VLOOKUP(I23,Лист1!$N$3:$Q$500,4,0)*K23,1),\"\")","v":0}]
[{"$f":"IF(D24>0,COUNT(D$16:D24,\"\"),\"\")","v":""},null,{"$f":"IFERROR(VLOOKUP(B24,Лист1!B$2:J$999,3,0),\"\")","v":""},null,{"$f":"IFERROR(D24*VLOOKUP(B24,Лист1!B$1:J$999,5,0),\"\")","v":""},null,"","","Лист ГКЛ 9,5мм",{"$f":"IFERROR(VLOOKUP(I24,Лист1!$N$3:$Q$500,2,0),\"\")","v":"шт"},null,{"$f":"IFERROR(CEILING(VLOOKUP(I24,Лист1!$N$3:$Q$500,4,0)*K24,1),\"\")","v":0}]
[{"$f":"IF(D25>0,COUNT(D$16:D25,\"\"),\"\")","v":""},null,{"$f":"IFERROR(VLOOKUP(B25,Лист1!B$2:J$999,3,0),\"\")","v":""},null,{"$f":"IFERROR(D25*VLOOKUP(B25,Лист1!B$1:J$999,5,0),\"\")","v":""},null,"","","Лента армирующая",{"$f":"IFERROR(VLOOKUP(I25,Лист1!$N$3:$Q$500,2,0),\"\")","v":"м.п."},null,{"$f":"IFERROR(CEILING(VLOOKUP(I25,Лист1!$N$3:$Q$500,4,0)*K25,1),\"\")","v":0}]
[{"$f":"IF(D26>0,COUNT(D$16:D26,\"\"),\"\")","v":2},"Облицовка стен листами из ГВЛ в два слоя по металлическим направляющим",{"$f":"IFERROR(VLOOKUP(B26,Лист1!B$2:J$999,3,0),\"\")","v":"м2"},10,{"$f":"IFERROR(D26*VLOOKUP(B26,Лист1!B$1:J$999,5,0),\"\")","v":3500},{"$f":"SUM(L27:L34)","v":2934},875,350,null,{"$f":"IFERROR(VLOOKUP(I26,Лист1!$N$3:$Q$500,2,0),\"\")","v":""},null,{"$f":"IFERROR(CEILING(VLOOKUP(I26,Лист1!$N$3:$Q$500,4,0)*K26,1),\"\")","v":""}]
[{"$f":"IF(D27>0,COUNT(D$16:D27,\"\"),\"\")","v":""},null,{"$f":"IFERROR(VLOOKUP(B27,Лист1!B$2:J$999,3,0),\"\")","v":""},null,{"$f":"IFERROR(D27*VLOOKUP(B27,Лист1!B$1:J$999,5,0),\"\")","v":""},null,"","","Профиль ПН 27*28",{"$f":"IFERROR(VLOOKUP(I27,Лист1!$N$3:$Q$500,2,0),\"\")","v":"шт"},{"$f":"IFERROR(CEILING(VLOOKUP(I27,Лист1!C$3:F$10,3,0)*$D$16,1),\"\")","v":16},{"$f":"IFERROR(CEILING(VLOOKUP(I27,Лист1!$N$3:$Q$500,4,0)*K27,1),\"\")","v":1264}]
[{"$f":"IF(D28>0,COUNT(D$16:D28,\"\"),\"\")","v":""},null,{"$f":"IFERROR(VLOOKUP(B28,Лист1!B$2:J$999,3,0),\"\")","v":""},null,{"$f":"IFERROR(D28*VLOOKUP(B28,Лист1!B$1:J$999,5,0),\"\")","v":""},null,"","","Профиль ПП 60*27",{"$f":"IFERROR(VLOOKUP(I28,Лист1!$N$3:$Q$500,2,0),\"\")","v":"шт"},{"$f":"IFERROR(CEILING(VLOOKUP(I28,Лист1!C$3:F$10,3,0)*$D$16,1),\"\")","v":10},{"$f":"IFERROR(CEILING(VLOOKUP(I28,Лист1!$N$3:$Q$500,4,0)*K28,1),\"\")","v":1050}]
[{"$f":"IF(D29>0,COUNT(D$16:D29,\"\"),\"\")","v":""},null,{"$f":"IFERROR(VLOOKUP(B29,Лист1!B$2:J$999,3,0),\"\")","v":""},null,{"$f":"IFERROR(D29*VLOOKUP(B29,Лист1!B$1:J$999,5,0),\"\")","v":""},null,"","","Саморез 3,5*11 (клоп)",{"$f":"IFERROR(VLOOKUP(I29,Лист1!$N$3:$Q$500,2,0),\"\")","v":"шт"},{"$f":"IFERROR(CEILING(VLOOKUP(I29,Лист1!C$3:F$10,3,0)*$D$16,1),\"\")","v":476},{"$f":"IFERROR(CEILING(VLOOKUP(I29,Лист1!$N$3:$Q$500,4,0)*K29,1),\"\")","v":167}]
[{"$f":"IF(D30>0,COUNT(D$16:D30,\"\"),\"\")","v":""},null,{"$f":"IFERROR(VLOOKUP(B30,Лист1!B$2:J$999,3,0),\"\")","v":""},null,{"$f":"IFERROR(D30*VLOOKUP(B30,Лист1!B$1:J$999,5,0),\"\")","v":""},null,"","","Саморез 3,5*35 (двузаходной)",{"$f":"IFERROR(VLOOKUP(I30,Лист1!$N$3:$Q$500,2,0),\"\")","v":"шт"},{"$f":"IFERROR(CEILING(VLOOKUP(I30,Лист1!C$3:F$10,3,0)*$D$16,1),\"\")","v":""},{"$f":"IFERROR(CEILING(VLOOKUP(I30,Лист1!$N$3:$Q$500,4,0)*K30,1),\"\")","v":""}]
{"$rows_left_out":471}
{"sheet":"Лист1","index":1,"n_rows":992,"n_cols":17,"rows_kept":992,"cut":false,"hidden":false,"merged":[]}
[null,"Наименование работ","Необходимые материалы","Ед. изм.","Кол-во","Стоимость работ за ед.",null,null,null,null,null,null,null,"Наименование материала","Ед. изм.","Кол-во","Стоимость работ за ед."]
[1,"Облицовка стен листами из ГКЛ по металлическим направляющим",null,"м2",null,300,null,{"$f":"IF(ROW()-ROW(FolowList)+1>ROWS(WorkLisr)-COUNTBLANK(WorkLisr),\"\",INDIRECT(ADDRESS(SMALL((IF(WorkLisr<>\"\",ROW(WorkLisr),ROW()+ROWS(WorkLisr))),ROW()-ROW(FolowList)+1),COLUMN(WorkLisr),4)))","v":"Облицовка стен листами из ГКЛ по металлическим направляющим"}]
[null,null,"Профиль ПН 27*28","шт",1.6,79,null,{"$f":"IF(ROW()-ROW(FolowList)+1>ROWS(WorkLisr)-COUNTBLANK(WorkLisr),\"\",INDIRECT(ADDRESS(SMALL((IF(WorkLisr<>\"\",ROW(WorkLisr),ROW()+ROWS(WorkLisr))),ROW()-ROW(FolowList)+1),COLUMN(WorkLisr),4)))","v":"Облицовка откосов дверных или оконных листами из ГКЛ по металлическим направляющим"},null,null,null,{"$f":"IF(COUNTIF(M3:M$3,M3)=1,MAX(L$2:L2)+1,\"\")","v":1},{"$f":"IF(ISBLANK(C3),\"\",C3)","v":"Профиль ПН 27*28"},{"$f":"IF(MAX(NameCount)<ROW(1:1),\"\",VLOOKUP(ROW(1:1),NameList,2))","v":"Профиль ПН 27*28"},"шт",null,79]
[null,null,"Профиль ПП 60*27","шт",1,105,null,{"$f":"IF(ROW()-ROW(FolowList)+1>ROWS(WorkLisr)-COUNTBLANK(WorkLisr),\"\",INDIRECT(ADDRESS(SMALL((IF(WorkLisr<>\"\",ROW(WorkLisr),ROW()+ROWS(WorkLisr))),ROW()-ROW(FolowList)+1),COLUMN(WorkLisr),4)))","v":"Облицовка стен листами из ГВЛ по металлическим направляющим"},null,null,null,{"$f":"IF(COUNTIF(M$3:M4,M4)=1,MAX(L$2:L3)+1,\"\")","v":2},{"$f":"IF(ISBLANK(C4),\"\",C4)","v":"Профиль ПП 60*27"},"Профиль ПП 60*27","шт",null,105]
[null,null,"Саморез 3,5*11 (клоп)","шт",{"$f":"E6*2+E4*4+E7*8","v":47.6},0.35,null,{"$f":"IF(ROW()-ROW(FolowList)+1>ROWS(WorkLisr)-COUNTBLANK(WorkLisr),\"\",INDIRECT(ADDRESS(SMALL((IF(WorkLisr<>\"\",ROW(WorkLisr),ROW()+ROWS(WorkLisr))),ROW()-ROW(FolowList)+1),COLUMN(WorkLisr),4)))","v":"Облицовка откосов дверных или оконных листами из ГВЛ по металлическим направляющим"},null,null,null,{"$f":"IF(COUNTIF(M$3:M5,M5)=1,MAX(L$2:L4)+1,\"\")","v":3},"Саморез 3,5*11 (клоп)","Саморез 3,5*11 (клоп)","шт",null,0.35]
[null,null,"Саморез 3,5*25","шт",20,0.55000000000000004,null,{"$f":"IF(ROW()-ROW(FolowList)+1>ROWS(WorkLisr)-COUNTBLANK(WorkLisr),\"\",INDIRECT(ADDRESS(SMALL((IF(WorkLisr<>\"\",ROW(WorkLisr),ROW()+ROWS(WorkLisr))),ROW()-ROW(FolowList)+1),COLUMN(WorkLisr),4)))","v":"Облицовка стен листами из ГВЛ в два слоя по металлическим направляющим"},null,null,null,{"$f":"IF(COUNTIF(M$3:M6,M6)=1,MAX(L$2:L5)+1,\"\")","v":4},"Саморез 3,5*25","Саморез 3,5*25","шт",null,0.55000000000000004]
[null,null,"Соединитель \"Краб\"","шт",0.45,10,null,{"$f":"IF(ROW()-ROW(FolowList)+1>ROWS(WorkLisr)-COUNTBLANK(WorkLisr),\"\",INDIRECT(ADDRESS(SMALL((IF(WorkLisr<>\"\",ROW(WorkLisr),ROW()+ROWS(WorkLisr))),ROW()-ROW(FolowList)+1),COLUMN(WorkLisr),4)))","v":""},null,null,null,{"$f":"IF(COUNTIF(M$3:M7,M7)=1,MAX(L$2:L6)+1,\"\")","v":5},"Соединитель \"Краб\"","Соединитель \"Краб\"","шт",null,10]
[null,null,"Подвес прямой 60*27","шт",5,6,null,{"$f":"IF(ROW()-ROW(FolowList)+1>ROWS(WorkLisr)-COUNTBLANK(WorkLisr),\"\",INDIRECT(ADDRESS(SMALL((IF(WorkLisr<>\"\",ROW(WorkLisr),ROW()+ROWS(WorkLisr))),ROW()-ROW(FolowList)+1),COLUMN(WorkLisr),4)))","v":""},null,null,null,{"$f":"IF(COUNTIF(M$3:M8,M8)=1,MAX(L$2:L7)+1,\"\")","v":6},"Подвес прямой 60*27","Подвес прямой 60*27","шт",null,6]
[null,null,"Лист ГКЛ 9,5мм","шт",{"$f":"1/3","v":0.33333333333333331},280,null,{"$f":"IF(ROW()-ROW(FolowList)+1>ROWS(WorkLisr)-COUNTBLANK(WorkLisr),\"\",INDIRECT(ADDRESS(SMALL((IF(WorkLisr<>\"\",ROW(WorkLisr),ROW()+ROWS(WorkLisr))),ROW()-ROW(FolowList)+1),COLUMN(WorkLisr),4)))","v":""},null,null,null,{"$f":"IF(COUNTIF(M$3:M9,M9)=1,MAX(L$2:L8)+1,\"\")","v":7},"Лист ГКЛ 9,5мм","Лист ГКЛ 9,5мм","шт",null,280]
[null,null,"Лента армирующая","м.п.",3.2,1,null,{"$f":"IF(ROW()-ROW(FolowList)+1>ROWS(WorkLisr)-COUNTBLANK(WorkLisr),\"\",INDIRECT(ADDRESS(SMALL((IF(WorkLisr<>\"\",ROW(WorkLisr),ROW()+ROWS(WorkLisr))),ROW()-ROW(FolowList)+1),COLUMN(WorkLisr),4)))","v":""},null,null,null,{"$f":"IF(COUNTIF(M$3:M10,M10)=1,MAX(L$2:L9)+1,\"\")","v":8},"Лента армирующая","Лента армирующая","м.п.",null,3.2]
[2,"Облицовка откосов дверных или оконных листами из ГКЛ по металлическим направляющим",null,"м.п.",null,200,null,{"$f":"IF(ROW()-ROW(FolowList)+1>ROWS(WorkLisr)-COUNTBLANK(WorkLisr),\"\",INDIRECT(ADDRESS(SMALL((IF(WorkLisr<>\"\",ROW(WorkLisr),ROW()+ROWS(WorkLisr))),ROW()-ROW(FolowList)+1),COLUMN(WorkLisr),4)))","v":""},null,null,null,{"$f":"IF(COUNTIF(M$3:M11,M11)=1,MAX(L$2:L10)+1,\"\")","v":9},"",""]
[null,null,"Профиль ПН 27*28","шт",1.6,79,null,{"$f":"IF(ROW()-ROW(FolowList)+1>ROWS(WorkLisr)-COUNTBLANK(WorkLisr),\"\",INDIRECT(ADDRESS(SMALL((IF(WorkLisr<>\"\",ROW(WorkLisr),ROW()+ROWS(WorkLisr))),ROW()-ROW(FolowList)+1),COLUMN(WorkLisr),4)))","v":""},null,null,null,{"$f":"IF(COUNTIF(M$3:M12,M12)=1,MAX(L$2:L11)+1,\"\")","v":""},"Профиль ПН 27*28","Профиль стартовый","м.п.",null,20]
[null,null,"Профиль ПП 60*27","шт",1,105,null,{"$f":"IF(ROW()-ROW(FolowList)+1>ROWS(WorkLisr)-COUNTBLANK(WorkLisr),\"\",INDIRECT(ADDRESS(SMALL((IF(WorkLisr<>\"\",ROW(WorkLisr),ROW()+ROWS(WorkLisr))),ROW()-ROW(FolowList)+1),COLUMN(WorkLisr),4)))","v":""},null,null,null,{"$f":"IF(COUNTIF(M$3:M13,M13)=1,MAX(L$2:L12)+1,\"\")","v":""},"Профиль ПП 60*27","Саморез 3,5*25 (двузаходной)","шт",null,0.5]
[null,null,"Саморез 3,5*11 (клоп)","шт",{"$f":"E15*2+E13*4+E16*8","v":47.6},0.35,null,{"$f":"IF(ROW()-ROW(FolowList)+1>ROWS(WorkLisr)-COUNTBLANK(WorkLisr),\"\",INDIRECT(ADDRESS(SMALL((IF(WorkLisr<>\"\",ROW(WorkLisr),ROW()+ROWS(WorkLisr))),ROW()-ROW(FolowList)+1),COLUMN(WorkLisr),4)))","v":""},null,null,null,{"$f":"IF(COUNTIF(M$3:M14,M14)=1,MAX(L$2:L13)+1,\"\")","v":""},"Саморез 3,5*11 (клоп)","Лист ГВЛ 10мм","шт",null,0.55000000000000004]
[null,null,"Саморез 3,5*25","шт",20,0.55000000000000004,null,{"$f":"IF(ROW()-ROW(FolowList)+1>ROWS(WorkLisr)-COUNTBLANK(WorkLisr),\"\",INDIRECT(ADDRESS(SMALL((IF(WorkLisr<>\"\",ROW(WorkLisr),ROW()+ROWS(WorkLisr))),ROW()-ROW(FolowList)+1),COLUMN(WorkLisr),4)))","v":""},null,null,null,{"$f":"IF(COUNTIF(M$3:M15,M15)=1,MAX(L$2:L14)+1,\"\")","v":""},"Саморез 3,5*25","Саморез 3,5*35 (двузаходной)","шт"]
[null,null,"Соединитель \"Краб\"","шт",0.45,10,null,{"$f":"IF(ROW()-ROW(FolowList)+1>ROWS(WorkLisr)-COUNTBLANK(WorkLisr),\"\",INDIRECT(ADDRESS(SMALL((IF(WorkLisr<>\"\",ROW(WorkLisr),ROW()+ROWS(WorkLisr))),ROW()-ROW(FolowList)+1),COLUMN(WorkLisr),4)))","v":""},null,null,null,{"$f":"IF(COUNTIF(M$3:M16,M16)=1,MAX(L$2:L15)+1,\"\")","v":""},"Соединитель \"Краб\"",""]
[null,null,"Подвес прямой 60*27","шт",5,6,null,{"$f":"IF(ROW()-ROW(FolowList)+1>ROWS(WorkLisr)-COUNTBLANK(WorkLisr),\"\",INDIRECT(ADDRESS(SMALL((IF(WorkLisr<>\"\",ROW(WorkLisr),ROW()+ROWS(WorkLisr))),ROW()-ROW(FolowList)+1),COLUMN(WorkLisr),4)))","v":""},null,null,null,{"$f":"IF(COUNTIF(M$3:M17,M17)=1,MAX(L$2:L16)+1,\"\")","v":""},"Подвес прямой 60*27",""]
[null,null,"Профиль стартовый","м.п.",1,20,null,{"$f":"IF(ROW()-ROW(FolowList)+1>ROWS(WorkLisr)-COUNTBLANK(WorkLisr),\"\",INDIRECT(ADDRESS(SMALL((IF(WorkLisr<>\"\",ROW(WorkLisr),ROW()+ROWS(WorkLisr))),ROW()-ROW(FolowList)+1),COLUMN(WorkLisr),4)))","v":""},null,null,null,{"$f":"IF(COUNTIF(M$3:M18,M18)=1,MAX(L$2:L17)+1,\"\")","v":10},"Профиль стартовый",""]
[null,null,"Лист ГКЛ 9,5мм","шт",{"$f":"1/3","v":0.33333333333333331},280,null,{"$f":"IF(ROW()-ROW(FolowList)+1>ROWS(WorkLisr)-COUNTBLANK(WorkLisr),\"\",INDIRECT(ADDRESS(SMALL((IF(WorkLisr<>\"\",ROW(WorkLisr),ROW()+ROWS(WorkLisr))),ROW()-ROW(FolowList)+1),COLUMN(WorkLisr),4)))","v":""},null,null,null,{"$f":"IF(COUNTIF(M$3:M19,M19)=1,MAX(L$2:L18)+1,\"\")","v":""},"Лист ГКЛ 9,5мм",""]
[null,null,"Лента армирующая","м.п.",3.2,1,null,{"$f":"IF(ROW()-ROW(FolowList)+1>ROWS(WorkLisr)-COUNTBLANK(WorkLisr),\"\",INDIRECT(ADDRESS(SMALL((IF(WorkLisr<>\"\",ROW(WorkLisr),ROW()+ROWS(WorkLisr))),ROW()-ROW(FolowList)+1),COLUMN(WorkLisr),4)))","v":""},null,null,null,{"$f":"IF(COUNTIF(M$3:M20,M20)=1,MAX(L$2:L19)+1,\"\")","v":""},"Лента армирующая",""]
[3,"Облицовка стен листами из ГВЛ по металлическим направляющим",null,"м2",null,350,null,{"$f":"IF(ROW()-ROW(FolowList)+1>ROWS(WorkLisr)-COUNTBLANK(WorkLisr),\"\",INDIRECT(ADDRESS(SMALL((IF(WorkLisr<>\"\",ROW(WorkLisr),ROW()+ROWS(WorkLisr))),ROW()-ROW(FolowList)+1),COLUMN(WorkLisr),4)))","v":""},null,null,null,{"$f":"IF(COUNTIF(M$3:M21,M21)=1,MAX(L$2:L20)+1,\"\")","v":""},"",""]
[null,null,"Профиль ПН 27*28","шт",1.6,79,null,{"$f":"IF(ROW()-ROW(FolowList)+1>ROWS(WorkLisr)-COUNTBLANK(WorkLisr),\"\",INDIRECT(ADDRESS(SMALL((IF(WorkLisr<>\"\",ROW(WorkLisr),ROW()+ROWS(WorkLisr))),ROW()-ROW(FolowList)+1),COLUMN(WorkLisr),4)))","v":""},null,null,null,{"$f":"IF(COUNTIF(M$3:M22,M22)=1,MAX(L$2:L21)+1,\"\")","v":""},"Профиль ПН 27*28",""]
[null,null,"Профиль ПП 60*27","шт",1,105,null,{"$f":"IF(ROW()-ROW(FolowList)+1>ROWS(WorkLisr)-COUNTBLANK(WorkLisr),\"\",INDIRECT(ADDRESS(SMALL((IF(WorkLisr<>\"\",ROW(WorkLisr),ROW()+ROWS(WorkLisr))),ROW()-ROW(FolowList)+1),COLUMN(WorkLisr),4)))","v":""},null,null,null,{"$f":"IF(COUNTIF(M$3:M23,M23)=1,MAX(L$2:L22)+1,\"\")","v":""},"Профиль ПП 60*27",""]
[null,null,"Саморез 3,5*11 (клоп)","шт",{"$f":"E25*2+E23*4+E26*8","v":47.6},0.35,null,{"$f":"IF(ROW()-ROW(FolowList)+1>ROWS(WorkLisr)-COUNTBLANK(WorkLisr),\"\",INDIRECT(ADDRESS(SMALL((IF(WorkLisr<>\"\",ROW(WorkLisr),ROW()+ROWS(WorkLisr))),ROW()-ROW(FolowList)+1),COLUMN(WorkLisr),4)))","v":""},null,null,null,{"$f":"IF(COUNTIF(M$3:M24,M24)=1,MAX(L$2:L23)+1,\"\")","v":""},"Саморез 3,5*11 (клоп)",""]
[null,null,"Саморез 3,5*25 (двузаходной)","шт",20,0.55000000000000004,null,{"$f":"IF(ROW()-ROW(FolowList)+1>ROWS(WorkLisr)-COUNTBLANK(WorkLisr),\"\",INDIRECT(ADDRESS(SMALL((IF(WorkLisr<>\"\",ROW(WorkLisr),ROW()+ROWS(WorkLisr))),ROW()-ROW(FolowList)+1),COLUMN(WorkLisr),4)))","v":""},null,null,null,{"$f":"IF(COUNTIF(M$3:M25,M25)=1,MAX(L$2:L24)+1,\"\")","v":11},"Саморез 3,5*25 (двузаходной)",""]
[null,null,"Соединитель \"Краб\"","шт",0.45,10,null,{"$f":"IF(ROW()-ROW(FolowList)+1>ROWS(WorkLisr)-COUNTBLANK(WorkLisr),\"\",INDIRECT(ADDRESS(SMALL((IF(WorkLisr<>\"\",ROW(WorkLisr),ROW()+ROWS(WorkLisr))),ROW()-ROW(FolowList)+1),COLUMN(WorkLisr),4)))","v":""},null,null,null,{"$f":"IF(COUNTIF(M$3:M26,M26)=1,MAX(L$2:L25)+1,\"\")","v":""},"Соединитель \"Краб\"",""]
[null,null,"Подвес прямой 60*27","шт",5,6,null,{"$f":"IF(ROW()-ROW(FolowList)+1>ROWS(WorkLisr)-COUNTBLANK(WorkLisr),\"\",INDIRECT(ADDRESS(SMALL((IF(WorkLisr<>\"\",ROW(WorkLisr),ROW()+ROWS(WorkLisr))),ROW()-ROW(FolowList)+1),COLUMN(WorkLisr),4)))","v":""},null,null,null,{"$f":"IF(COUNTIF(M$3:M27,M27)=1,MAX(L$2:L26)+1,\"\")","v":""},"Подвес прямой 60*27",""]
[null,null,"Лист ГВЛ 10мм","шт",{"$f":"1/3","v":0.33333333333333331},500,null,{"$f":"IF(ROW()-ROW(FolowList)+1>ROWS(WorkLisr)-COUNTBLANK(WorkLisr),\"\",INDIRECT(ADDRESS(SMALL((IF(WorkLisr<>\"\",ROW(WorkLisr),ROW()+ROWS(WorkLisr))),ROW()-ROW(FolowList)+1),COLUMN(WorkLisr),4)))","v":""},null,null,null,{"$f":"IF(COUNTIF(M$3:M28,M28)=1,MAX(L$2:L27)+1,\"\")","v":12},"Лист ГВЛ 10мм",""]
[null,null,"Лента армирующая","м.п.",3.2,1,null,{"$f":"IF(ROW()-ROW(FolowList)+1>ROWS(WorkLisr)-COUNTBLANK(WorkLisr),\"\",INDIRECT(ADDRESS(SMALL((IF(WorkLisr<>\"\",ROW(WorkLisr),ROW()+ROWS(WorkLisr))),ROW()-ROW(FolowList)+1),COLUMN(WorkLisr),4)))","v":""},null,null,null,{"$f":"IF(COUNTIF(M$3:M29,M29)=1,MAX(L$2:L28)+1,\"\")","v":""},"Лента армирующая",""]
[4,"Облицовка откосов дверных или оконных листами из ГВЛ по металлическим направляющим",null,"м.п.",null,200,null,{"$f":"IF(ROW()-ROW(FolowList)+1>ROWS(WorkLisr)-COUNTBLANK(WorkLisr),\"\",INDIRECT(ADDRESS(SMALL((IF(WorkLisr<>\"\",ROW(WorkLisr),ROW()+ROWS(WorkLisr))),ROW()-ROW(FolowList)+1),COLUMN(WorkLisr),4)))","v":""},null,null,null,{"$f":"IF(COUNTIF(M$3:M30,M30)=1,MAX(L$2:L29)+1,\"\")","v":""},"",""]
{"$rows_left_out":962}