{"text_format":"1","workbook":"xlsx","n_sheets":4,"sheets":["Номенклатура","Приход","Расход","Оборотная ведомость"],"not_rendered":{"charts":0,"images":1,"macros":1,"external_links":0,"defined_names":1,"comments":0,"pivot_tables":0},"unopened":[],"bounds":{"document_bytes":16777216,"sheet_cells":100000,"rows_first":2000,"rows_last":500,"rows_between":2000,"halvings":0,"cell_chars":16384,"cell_head_chars":4096},"cells_cut":0,"cells_raw":0,"read":"whole","date_system":"1900"}

{"sheet":"Номенклатура","index":0,"n_rows":99,"n_cols":6,"rows_kept":99,"cut":false,"hidden":false,"merged":[]}
[]
["Артикул","Название","Артикул",null,"Количество","Цена, отпускная"]
[2303299,"Декор на палочке \"Коняшка\"",2303299,null,3]
[2303298,"Декор на палочке \"Резная снежинка\"",2303298,null,3]
[1392732,"Декор на палочке \"Санта\"",1392732,null,6]
[1392734,"Декор на палочке \"Праздничный олень\"",1392734,null,6]
[2534194,"Топпер \"2018\"",2534194,null,7]
[2804396,"Декоративные наклейки \"Новогодние\" новогодние игрушки",2804396,null,2]
[2366421,"Наклейка для окон \"С Новым Годом и Рождеством!\" , 33 х 50,5 см",2366421,null,3]
[2366433,"Наклейка для окон \"Сладкого прадника\" , 33 х 50,5 см",2366433,null,3]
[2366435,"Наклейка для окон \"Новогодний венок\" , 33 х 50,5 см",2366435,null,3]
[2366440,"Наклейка для окон \"Новый год к нам мчится\" , 33 х 50,5 см",2366440,null,3]
[2313523,"Наклейка декоративная светящаяся в темноте \"Радости и счастья\", 21 х29.7 см",2313523,null,3]
[2313528,"Наклейка декоративная светящаяся в темноте \"Имбирные радости\", 21 х29.7 см",2313528,null,3]
[2400461,"Наклейки декоративные голография \"Снежинки\", 21х29,7 см",2400461,null,5]
[1064940,"Пневмохлопушка поворотная \"С Новым годом!\", 30 см, фольга + бумажные вложения с пожеланиями",1064940,null,36]
[2354783,"Мягкая игрушка \"Собачка Лапуська: Ранняя пташка\", 30см",2354783,null,1]
[2391201,"Пакет крафтовый \"Уютный дом\", 64 х 32 х 16 см",2391201,null,5]
[2391203,"Пакет крафтовый \"Яркий праздник\", 64 х 32 х 16 см",2391203,null,5]
[2624448,"Пакет подарочный \"Новогодние игрушки\", люкс, 31 х 12 х 44 см",2624448,null,36]
[2726786,"Пакет подарочный \"Елочные огни\" люкс, 32 х 26 х 12 см",2726786,null,24]
[2726791,"Пакет подарочный \"Дерево пожеланий\" люкс, 32 х 26 х 12 см",2726791,null,18]
[2726792,"Пакет подарочный  \"Снегопад\" люкс, 32 х 26 х 12 см",2726792,null,24]
[2490184,"Пакет подарочный \"Ёлочка\", люкс, 26 х 10 х 32 см",2490184,null,24]
[2478308,"Пакет подарочный \"Подарки\", 32 х 11 х 26 см",2478308,null,12]
[1606280,"Пакет подарочный под бутылку \"Красно-золотые ёлки\" люкс, 36 х 12 х 8.5 см",1606280,null,36]
[1606282,"Пакет подарочный под бутылку \"Снежный\" люкс, 36 х 12 х 8.5 см",1606282,null,36]
[2726800,"Пакет подарочный \"Хвойный лес\" люкс, 23 х 17.8 х 9.8 см",2726800,null,12]
[1405256,"Набор по декорированию подарочного пакета \"Пряности и радости\", 16 х 28 см",1405256,null,10]
[2477856,"Пакет подарочный полиэтиленовый \"Вязанный узор\", 23х29,5",2477856,null,60]
[2477862,"Пакет подарочный полиэтиленовый \"Золотая елка\", 23х29,5",2477862,null,60]
[1386321,"Набор для декорирования шильдика \"Пряности и радости\" (3 шт), 11,5 х 14 см",1386321,null,4]
[1760182,"Набор коробок 3в1 \"Елочка\" 19 х 12 х 7,5 - 15 х 10 х 5 см",1760182,null,2]
[2786148,"Набор конвертов \"Новогодние\"",2786148,null,5]
[2327164,"Подвеска световая \"Фонарик серебряный\" (батарейки в комплекте), 7 см, 1 LED, RGB",2327164,null,10]
[2327168,"Подвеска световая \"Звезда серебряная\" (батарейки в комплекте), 8 см, 1 LED, RGB",2327168,null,10]
[2361550,"Игрушка световая \"Елочный шар узоры краской\" 5 см, 1 LED, RGB, ЖЕЛТЫЙ",2361550,null,10]
[2361546,"Игрушка световая \"Елочный шар узоры краской\" 5 см, 1LED, RGB, ГОЛУБОЙ",2361546,null,10]
[2361543,"Игрушка световая \"Елочный шар узоры краской\" 5 см, 1 LED, RGB, РОЗОВЫЙ",2361543,null,10]
[2433885,"Гирлянда \"Роса\" 3 м, 30 LED, (батарейки в комплекте), БЕЛЫЙ",2433885,null,10]
{"$rows_left_out":60}
{"sheet":"Приход","index":1,"n_rows":99,"n_cols":7,"rows_kept":99,"cut":false,"hidden":true,"merged":[[0,0,0,1]]}
[null,null,"2017-11-20"]
["Артикул","Название","Количество",null,null,null,"Итого"]
[2303299,"Декор на палочке \"Коняшка\"",3,null,null,null,{"$f":"SUM(D3:F3)","v":0}]
[2303298,"Декор на палочке \"Резная снежинка\"",3,null,null,null,{"$f":"SUM(D4:F4)","v":0}]
[1392732,"Декор на палочке \"Санта\"",6,null,null,null,0]
[1392734,"Декор на палочке \"Праздничный олень\"",6,null,null,null,0]
[2534194,"Топпер \"2018\"",7,null,null,null,0]
[2804396,"Декоративные наклейки \"Новогодние\" новогодние игрушки",2,null,null,null,0]
[2366421,"Наклейка для окон \"С Новым Годом и Рождеством!\" , 33 х 50,5 см",3,null,null,null,0]
[2366433,"Наклейка для окон \"Сладкого прадника\" , 33 х 50,5 см",3,null,null,null,0]
[2366435,"Наклейка для окон \"Новогодний венок\" , 33 х 50,5 см",3,null,null,null,0]
[2366440,"Наклейка для окон \"Новый год к нам мчится\" , 33 х 50,5 см",3,null,null,null,0]
[2313523,"Наклейка декоративная светящаяся в темноте \"Радости и счастья\", 21 х29.7 см",3,null,null,null,0]
[2313528,"Наклейка декоративная светящаяся в темноте \"Имбирные радости\", 21 х29.7 см",3,null,null,null,0]
[2400461,"Наклейки декоративные голография \"Снежинки\", 21х29,7 см",5,null,null,null,0]
[1064940,"Пневмохлопушка поворотная \"С Новым годом!\", 30 см, фольга + бумажные вложения с пожеланиями",36,null,null,null,0]
[2354783,"Мягкая игрушка \"Собачка Лапуська: Ранняя пташка\", 30см",1,null,null,null,0]
[2391201,"Пакет крафтовый \"Уютный дом\", 64 х 32 х 16 см",5,null,null,null,0]
[2391203,"Пакет крафтовый \"Яркий праздник\", 64 х 32 х 16 см",5,null,null,null,0]
[2624448,"Пакет подарочный \"Новогодние игрушки\", люкс, 31 х 12 х 44 см",36,null,null,null,0]
[2726786,"Пакет подарочный \"Елочные огни\" люкс, 32 х 26 х 12 см",24,null,null,null,0]
[2726791,"Пакет подарочный \"Дерево пожеланий\" люкс, 32 х 26 х 12 см",18,null,null,null,0]
[2726792,"Пакет подарочный  \"Снегопад\" люкс, 32 х 26 х 12 см",24,null,null,null,0]
[2490184,"Пакет подарочный \"Ёлочка\", люкс, 26 х 10 х 32 см",24,null,null,null,0]
[2478308,"Пакет подарочный \"Подарки\", 32 х 11 х 26 см",12,null,null,null,0]
[1606280,"Пакет подарочный под бутылку \"Красно-золотые ёлки\" люкс, 36 х 12 х 8.5 см",36,null,null,null,0]
[1606282,"Пакет подарочный под бутылку \"Снежный\" люкс, 36 х 12 х 8.5 см",36,null,null,null,0]
[2726800,"Пакет подарочный \"Хвойный лес\" люкс, 23 х 17.8 х 9.8 см",12,null,null,null,0]
[1405256,"Набор по декорированию подарочного пакета \"Пряности и радости\", 16 х 28 см",10,null,null,null,0]
[2477856,"Пакет подарочный полиэтиленовый \"Вязанный узор\", 23х29,5",60,null,null,null,0]
[2477862,"Пакет подарочный полиэтиленовый \"Золотая елка\", 23х29,5",60,null,null,null,0]
[1386321,"Набор для декорирования шильдика \"Пряности и радости\" (3 шт), 11,5 х 14 см",4,null,null,null,0]
[1760182,"Набор коробок 3в1 \"Елочка\" 19 х 12 х 7,5 - 15 х 10 х 5 см",2,null,null,null,0]
[2786148,"Набор конвертов \"Новогодние\"",5,null,null,null,0]
[2327164,"Подвеска световая \"Фонарик серебряный\" (батарейки в комплекте), 7 см, 1 LED, RGB",10,null,null,null,0]
[2327168,"Подвеска световая \"Звезда серебряная\" (батарейки в комплекте), 8 см, 1 LED, RGB",10,null,null,null,0]
[2361550,"Игрушка световая \"Елочный шар узоры краской\" 5 см, 1 LED, RGB, ЖЕЛТЫЙ",10,null,null,null,0]
[2361546,"Игрушка световая \"Елочный шар узоры краской\" 5 см, 1LED, RGB, ГОЛУБОЙ",10,null,null,null,0]
[2361543,"Игрушка световая \"Елочный шар узоры краской\" 5 см, 1 LED, RGB, РОЗОВЫЙ",10,null,null,null,0]
[2433885,"Гирлянда \"Роса\" 3 м, 30 LED, (батарейки в комплекте), БЕЛЫЙ",10,null,null,null,0]
{"$rows_left_out":60}
{"sheet":"Расход","index":2,"n_rows":707,"n_cols":6,"rows_kept":707,"cut":false,"hidden":false,"merged":[[0,0,0,4]]}
[]
["Дата продажи","Артикул","Название","Цена, отпускная","Количество","Сумма"]
[null,{"$f":"VLOOKUP(C3,Номенклатура!$B$3:$F$284,2,0)","v":2366440},"Наклейка для окон \"Новый год к нам мчится\" , 33 х 50,5 см",{"$f":"VLOOKUP(C3,Номенклатура!$B$3:$F$284,5,0)","v":0},100,{"$f":"E3*D3","v":0}]
[null,{"$f":"VLOOKUP(C4,Номенклатура!$B$3:$F$284,2,0)","v":2303299},"Декор на палочке \"Коняшка\"",{"$f":"VLOOKUP(C4,Номенклатура!$B$3:$F$284,5,0)","v":0},100,{"$f":"E4*D4","v":0}]
[null,{"$f":"VLOOKUP(C5,Номенклатура!$B$3:$F$284,2,0)","v":1392732},"Декор на палочке \"Санта\"",{"$f":"VLOOKUP(C5,Номенклатура!$B$3:$F$284,5,0)","v":0},100,0]
[null,{"$f":"VLOOKUP(C6,Номенклатура!$B$3:$F$284,2,0)","v":2303298},"Декор на палочке \"Резная снежинка\"",{"$f":"VLOOKUP(C6,Номенклатура!$B$3:$F$284,5,0)","v":0},100,0]
[null,{"$f":"VLOOKUP(C7,Номенклатура!$B$3:$F$284,2,0)","v":2534194},"Топпер \"2018\"",{"$f":"VLOOKUP(C7,Номенклатура!$B$3:$F$284,5,0)","v":0},100,0]
[null,{"$f":"VLOOKUP(C8,Номенклатура!$B$3:$F$284,2,0)","v":2366433},"Наклейка для окон \"Сладкого прадника\" , 33 х 50,5 см",{"$f":"VLOOKUP(C8,Номенклатура!$B$3:$F$284,5,0)","v":0},100,0]
[null,{"$f":"VLOOKUP(C9,Номенклатура!$B$3:$F$284,2,0)","v":2804396},"Декоративные наклейки \"Новогодние\" новогодние игрушки",{"$f":"VLOOKUP(C9,Номенклатура!$B$3:$F$284,5,0)","v":0},100,0]
[null,{"$f":"VLOOKUP(C10,Номенклатура!$B$3:$F$284,2,0)","v":2804396},"Декоративные наклейки \"Новогодние\" новогодние игрушки",{"$f":"VLOOKUP(C10,Номенклатура!$B$3:$F$284,5,0)","v":0},100,0]
[null,{"$f":"VLOOKUP(C11,Номенклатура!$B$3:$F$284,2,0)","v":1392732},"Декор на палочке \"Санта\"",{"$f":"VLOOKUP(C11,Номенклатура!$B$3:$F$284,5,0)","v":0},100,0]
[null,{"$f":"VLOOKUP(C12,Номенклатура!$B$3:$F$284,2,0)","v":1392732},"Декор на палочке \"Санта\"",{"$f":"VLOOKUP(C12,Номенклатура!$B$3:$F$284,5,0)","v":0},100,0]
[null,{"$f":"VLOOKUP(C13,Номенклатура!$B$3:$F$284,2,0)","v":{"$error":"#N/A"}},null,{"$f":"VLOOKUP(C13,Номенклатура!$B$3:$F$284,5,0)","v":{"$error":"#N/A"}},100,{"$error":"#N/A"}]
[null,{"$f":"VLOOKUP(C14,Номенклатура!$B$3:$F$284,2,0)","v":2391201},"Пакет крафтовый \"Уютный дом\", 64 х 32 х 16 см",{"$f":"VLOOKUP(C14,Номенклатура!$B$3:$F$284,5,0)","v":0},100,0]
[null,{"$f":"VLOOKUP(C15,Номенклатура!$B$3:$F$284,2,0)","v":{"$error":"#N/A"}},null,{"$f":"VLOOKUP(C15,Номенклатура!$B$3:$F$284,5,0)","v":{"$error":"#N/A"}},100,{"$error":"#N/A"}]
[null,{"$f":"VLOOKUP(C16,Номенклатура!$B$3:$F$284,2,0)","v":2366440},"Наклейка для окон \"Новый год к нам мчится\" , 33 х 50,5 см",{"$f":"VLOOKUP(C16,Номенклатура!$B$3:$F$284,5,0)","v":0},100,0]
[null,{"$f":"VLOOKUP(C17,Номенклатура!$B$3:$F$284,2,0)","v":{"$error":"#N/A"}},null,{"$f":"VLOOKUP(C17,Номенклатура!$B$3:$F$284,5,0)","v":{"$error":"#N/A"}},100,{"$error":"#N/A"}]
[null,{"$f":"VLOOKUP(C18,Номенклатура!$B$3:$F$284,2,0)","v":{"$error":"#N/A"}},null,{"$f":"VLOOKUP(C18,Номенклатура!$B$3:$F$284,5,0)","v":{"$error":"#N/A"}},100,{"$error":"#N/A"}]
[null,{"$f":"VLOOKUP(C19,Номенклатура!$B$3:$F$284,2,0)","v":1064940},"Пневмохлопушка поворотная \"С Новым годом!\", 30 см, фольга + бумажные вложения с пожеланиями",{"$f":"VLOOKUP(C19,Номенклатура!$B$3:$F$284,5,0)","v":0},100,0]
[null,{"$f":"VLOOKUP(C20,Номенклатура!$B$3:$F$284,2,0)","v":2303298},"Декор на палочке \"Резная снежинка\"",{"$f":"VLOOKUP(C20,Номенклатура!$B$3:$F$284,5,0)","v":0},100,0]
[null,{"$f":"VLOOKUP(C21,Номенклатура!$B$3:$F$284,2,0)","v":{"$error":"#N/A"}},null,{"$f":"VLOOKUP(C21,Номенклатура!$B$3:$F$284,5,0)","v":{"$error":"#N/A"}},null,{"$error":"#N/A"}]
[null,{"$f":"VLOOKUP(C22,Номенклатура!$B$3:$F$284,2,0)","v":2366433},"Наклейка для окон \"Сладкого прадника\" , 33 х 50,5 см",{"$f":"VLOOKUP(C22,Номенклатура!$B$3:$F$284,5,0)","v":0},null,0]
[null,{"$f":"VLOOKUP(C23,Номенклатура!$B$3:$F$284,2,0)","v":1392734},"Декор на палочке \"Праздничный олень\"",{"$f":"VLOOKUP(C23,Номенклатура!$B$3:$F$284,5,0)","v":0},null,0]
[null,{"$f":"VLOOKUP(C24,Номенклатура!$B$3:$F$284,2,0)","v":{"$error":"#N/A"}},null,{"$f":"VLOOKUP(C24,Номенклатура!$B$3:$F$284,5,0)","v":{"$error":"#N/A"}},null,{"$error":"#N/A"}]
[null,{"$f":"VLOOKUP(C25,Номенклатура!$B$3:$F$284,2,0)","v":{"$error":"#N/A"}},null,{"$f":"VLOOKUP(C25,Номенклатура!$B$3:$F$284,5,0)","v":{"$error":"#N/A"}},null,{"$error":"#N/A"}]
[null,{"$f":"VLOOKUP(C26,Номенклатура!$B$3:$F$284,2,0)","v":{"$error":"#N/A"}},null,{"$f":"VLOOKUP(C26,Номенклатура!$B$3:$F$284,5,0)","v":{"$error":"#N/A"}},null,{"$error":"#N/A"}]
[null,{"$f":"VLOOKUP(C27,Номенклатура!$B$3:$F$284,2,0)","v":1392732},"Декор на палочке \"Санта\"",{"$f":"VLOOKUP(C27,Номенклатура!$B$3:$F$284,5,0)","v":0},null,0]
[null,{"$f":"VLOOKUP(C28,Номенклатура!$B$3:$F$284,2,0)","v":{"$error":"#N/A"}},null,{"$f":"VLOOKUP(C28,Номенклатура!$B$3:$F$284,5,0)","v":{"$error":"#N/A"}},null,{"$error":"#N/A"}]
[null,{"$f":"VLOOKUP(C29,Номенклатура!$B$3:$F$284,2,0)","v":{"$error":"#N/A"}},null,{"$f":"VLOOKUP(C29,Номенклатура!$B$3:$F$284,5,0)","v":{"$error":"#N/A"}},null,{"$error":"#N/A"}]
[null,{"$f":"VLOOKUP(C30,Номенклатура!$B$3:$F$284,2,0)","v":{"$error":"#N/A"}},null,{"$f":"VLOOKUP(C30,Номенклатура!$B$3:$F$284,5,0)","v":{"$error":"#N/A"}},null,{"$error":"#N/A"}]
[null,{"$f":"VLOOKUP(C31,Номенклатура!$B$3:$F$284,2,0)","v":{"$error":"#N/A"}},null,{"$f":"VLOOKUP(C31,Номенклатура!$B$3:$F$284,5,0)","v":{"$error":"#N/A"}},null,{"$error":"#N/A"}]
[null,{"$f":"VLOOKUP(C32,Номенклатура!$B$3:$F$284,2,0)","v":{"$error":"#N/A"}},null,{"$f":"VLOOKUP(C32,Номенклатура!$B$3:$F$284,5,0)","v":{"$error":"#N/A"}},null,{"$error":"#N/A"}]
[null,{"$f":"VLOOKUP(C33,Номенклатура!$B$3:$F$284,2,0)","v":{"$error":"#N/A"}},null,{"$f":"VLOOKUP(C33,Номенклатура!$B$3:$F$284,5,0)","v":{"$error":"#N/A"}},null,{"$error":"#N/A"}]
[null,{"$f":"VLOOKUP(C34,Номенклатура!$B$3:$F$284,2,0)","v":{"$error":"#N/A"}},null,{"$f":"VLOOKUP(C34,Номенклатура!$B$3:$F$284,5,0)","v":{"$error":"#N/A"}},null,{"$error":"#N/A"}]
[null,{"$f":"VLOOKUP(C35,Номенклатура!$B$3:$F$284,2,0)","v":{"$error":"#N/A"}},null,{"$f":"VLOOKUP(C35,Номенклатура!$B$3:$F$284,5,0)","v":{"$error":"#N/A"}},null,{"$error":"#N/A"}]
[null,{"$f":"VLOOKUP(C36,Номенклатура!$B$3:$F$284,2,0)","v":{"$error":"#N/A"}},null,{"$f":"VLOOKUP(C36,Номенклатура!$B$3:$F$284,5,0)","v":{"$error":"#N/A"}},null,{"$error":"#N/A"}]
[null,{"$f":"VLOOKUP(C37,Номенклатура!$B$3:$F$284,2,0)","v":{"$error":"#N/A"}},null,{"$f":"VLOOKUP(C37,Номенклатура!$B$3:$F$284,5,0)","v":{"$error":"#N/A"}},null,{"$error":"#N/A"}]
[null,{"$f":"VLOOKUP(C38,Номенклатура!$B$3:$F$284,2,0)","v":{"$error":"#N/A"}},null,{"$f":"VLOOKUP(C38,Номенклатура!$B$3:$F$284,5,0)","v":{"$error":"#N/A"}},null,{"$error":"#N/A"}]
[null,{"$f":"VLOOKUP(C39,Номенклатура!$B$3:$F$284,2,0)","v":{"$error":"#N/A"}},null,{"$f":"VLOOKUP(C39,Номенклатура!$B$3:$F$284,5,0)","v":{"$error":"#N/A"}},null,{"$error":"#N/A"}]
[null,{"$f":"VLOOKUP(C40,Номенклатура!$B$3:$F$284,2,0)","v":{"$error":"#N/A"}},null,{"$f":"VLOOKUP(C40,Номенклатура!$B$3:$F$284,5,0)","v":{"$error":"#N/A"}},null,{"$error":"#N/A"}]
{"$rows_left_out":668}
{"sheet":"Оборотная ведомость","index":3,"n_rows":99,"n_cols":6,"rows_kept":99,"cut":false,"hidden":true,"merged":[]}
[]
["Артикул","Название","Остаток на начало","Приход","Расход","Остаток"]
[2303299,"Декор на палочке \"Коняшка\"",3,{"$f":"VLOOKUP(B3,Приход!$B$3:$G$105,6,0)","v":0},{"$f":"SUMIFS(Расход!$E$3:$E$707,Расход!$C$3:$C$707,B3)","v":100},{"$f":"(C3+D3)-E3","v":-97}]
[2303298,"Декор на палочке \"Резная снежинка\"",3,{"$f":"VLOOKUP(B4,Приход!$B$3:$G$105,6,0)","v":0},{"$f":"SUMIFS(Расход!$E$3:$E$707,Расход!$C$3:$C$707,B4)","v":200},{"$f":"(C4+D4)-E4","v":-197}]
[1392732,"Декор на палочке \"Санта\"",6,{"$f":"VLOOKUP(B5,Приход!$B$3:$G$105,6,0)","v":0},{"$f":"SUMIFS(Расход!$E$3:$E$707,Расход!$C$3:$C$707,B5)","v":300},-294]
[1392734,"Декор на палочке \"Праздничный олень\"",6,{"$f":"VLOOKUP(B6,Приход!$B$3:$G$105,6,0)","v":0},{"$f":"SUMIFS(Расход!$E$3:$E$707,Расход!$C$3:$C$707,B6)","v":0},6]
[2534194,"Топпер \"2018\"",7,{"$f":"VLOOKUP(B7,Приход!$B$3:$G$105,6,0)","v":0},{"$f":"SUMIFS(Расход!$E$3:$E$707,Расход!$C$3:$C$707,B7)","v":100},-93]
[2804396,"Декоративные наклейки \"Новогодние\" новогодние игрушки",2,{"$f":"VLOOKUP(B8,Приход!$B$3:$G$105,6,0)","v":0},{"$f":"SUMIFS(Расход!$E$3:$E$707,Расход!$C$3:$C$707,B8)","v":200},-198]
[2366421,"Наклейка для окон \"С Новым Годом и Рождеством!\" , 33 х 50,5 см",3,{"$f":"VLOOKUP(B9,Приход!$B$3:$G$105,6,0)","v":0},{"$f":"SUMIFS(Расход!$E$3:$E$707,Расход!$C$3:$C$707,B9)","v":0},3]
[2366433,"Наклейка для окон \"Сладкого прадника\" , 33 х 50,5 см",3,{"$f":"VLOOKUP(B10,Приход!$B$3:$G$105,6,0)","v":0},{"$f":"SUMIFS(Расход!$E$3:$E$707,Расход!$C$3:$C$707,B10)","v":100},-97]
[2366435,"Наклейка для окон \"Новогодний венок\" , 33 х 50,5 см",3,{"$f":"VLOOKUP(B11,Приход!$B$3:$G$105,6,0)","v":0},{"$f":"SUMIFS(Расход!$E$3:$E$707,Расход!$C$3:$C$707,B11)","v":0},3]
[2366440,"Наклейка для окон \"Новый год к нам мчится\" , 33 х 50,5 см",3,{"$f":"VLOOKUP(B12,Приход!$B$3:$G$105,6,0)","v":0},{"$f":"SUMIFS(Расход!$E$3:$E$707,Расход!$C$3:$C$707,B12)","v":200},-197]
[2313523,"Наклейка декоративная светящаяся в темноте \"Радости и счастья\", 21 х29.7 см",3,{"$f":"VLOOKUP(B13,Приход!$B$3:$G$105,6,0)","v":0},{"$f":"SUMIFS(Расход!$E$3:$E$707,Расход!$C$3:$C$707,B13)","v":0},3]
[2313528,"Наклейка декоративная светящаяся в темноте \"Имбирные радости\", 21 х29.7 см",3,{"$f":"VLOOKUP(B14,Приход!$B$3:$G$105,6,0)","v":0},{"$f":"SUMIFS(Расход!$E$3:$E$707,Расход!$C$3:$C$707,B14)","v":0},3]
[2400461,"Наклейки декоративные голография \"Снежинки\", 21х29,7 см",5,{"$f":"VLOOKUP(B15,Приход!$B$3:$G$105,6,0)","v":0},{"$f":"SUMIFS(Расход!$E$3:$E$707,Расход!$C$3:$C$707,B15)","v":0},5]
[1064940,"Пневмохлопушка поворотная \"С Новым годом!\", 30 см, фольга + бумажные вложения с пожеланиями",36,{"$f":"VLOOKUP(B16,Приход!$B$3:$G$105,6,0)","v":0},{"$f":"SUMIFS(Расход!$E$3:$E$707,Расход!$C$3:$C$707,B16)","v":100},-64]
[2354783,"Мягкая игрушка \"Собачка Лапуська: Ранняя пташка\", 30см",1,{"$f":"VLOOKUP(B17,Приход!$B$3:$G$105,6,0)","v":0},{"$f":"SUMIFS(Расход!$E$3:$E$707,Расход!$C$3:$C$707,B17)","v":0},1]
[2391201,"Пакет крафтовый \"Уютный дом\", 64 х 32 х 16 см",5,{"$f":"VLOOKUP(B18,Приход!$B$3:$G$105,6,0)","v":0},{"$f":"SUMIFS(Расход!$E$3:$E$707,Расход!$C$3:$C$707,B18)","v":100},-95]
[2391203,"Пакет крафтовый \"Яркий праздник\", 64 х 32 х 16 см",5,{"$f":"VLOOKUP(B19,Приход!$B$3:$G$105,6,0)","v":0},{"$f":"SUMIFS(Расход!$E$3:$E$707,Расход!$C$3:$C$707,B19)","v":0},5]
[2624448,"Пакет подарочный \"Новогодние игрушки\", люкс, 31 х 12 х 44 см",36,{"$f":"VLOOKUP(B20,Приход!$B$3:$G$105,6,0)","v":0},{"$f":"SUMIFS(Расход!$E$3:$E$707,Расход!$C$3:$C$707,B20)","v":0},36]
[2726786,"Пакет подарочный \"Елочные огни\" люкс, 32 х 26 х 12 см",24,{"$f":"VLOOKUP(B21,Приход!$B$3:$G$105,6,0)","v":0},{"$f":"SUMIFS(Расход!$E$3:$E$707,Расход!$C$3:$C$707,B21)","v":0},24]
[2726791,"Пакет подарочный \"Дерево пожеланий\" люкс, 32 х 26 х 12 см",18,{"$f":"VLOOKUP(B22,Приход!$B$3:$G$105,6,0)","v":0},{"$f":"SUMIFS(Расход!$E$3:$E$707,Расход!$C$3:$C$707,B22)","v":0},18]
[2726792,"Пакет подарочный  \"Снегопад\" люкс, 32 х 26 х 12 см",24,{"$f":"VLOOKUP(B23,Приход!$B$3:$G$105,6,0)","v":0},{"$f":"SUMIFS(Расход!$E$3:$E$707,Расход!$C$3:$C$707,B23)","v":0},24]
[2490184,"Пакет подарочный \"Ёлочка\", люкс, 26 х 10 х 32 см",24,{"$f":"VLOOKUP(B24,Приход!$B$3:$G$105,6,0)","v":0},{"$f":"SUMIFS(Расход!$E$3:$E$707,Расход!$C$3:$C$707,B24)","v":0},24]
[2478308,"Пакет подарочный \"Подарки\", 32 х 11 х 26 см",12,{"$f":"VLOOKUP(B25,Приход!$B$3:$G$105,6,0)","v":0},{"$f":"SUMIFS(Расход!$E$3:$E$707,Расход!$C$3:$C$707,B25)","v":0},12]
[1606280,"Пакет подарочный под бутылку \"Красно-золотые ёлки\" люкс, 36 х 12 х 8.5 см",36,{"$f":"VLOOKUP(B26,Приход!$B$3:$G$105,6,0)","v":0},{"$f":"SUMIFS(Расход!$E$3:$E$707,Расход!$C$3:$C$707,B26)","v":0},36]
[1606282,"Пакет подарочный под бутылку \"Снежный\" люкс, 36 х 12 х 8.5 см",36,{"$f":"VLOOKUP(B27,Приход!$B$3:$G$105,6,0)","v":0},{"$f":"SUMIFS(Расход!$E$3:$E$707,Расход!$C$3:$C$707,B27)","v":0},36]
[2726800,"Пакет подарочный \"Хвойный лес\" люкс, 23 х 17.8 х 9.8 см",12,{"$f":"VLOOKUP(B28,Приход!$B$3:$G$105,6,0)","v":0},{"$f":"SUMIFS(Расход!$E$3:$E$707,Расход!$C$3:$C$707,B28)","v":0},12]
[1405256,"Набор по декорированию подарочного пакета \"Пряности и радости\", 16 х 28 см",10,{"$f":"VLOOKUP(B29,Приход!$B$3:$G$105,6,0)","v":0},{"$f":"SUMIFS(Расход!$E$3:$E$707,Расход!$C$3:$C$707,B29)","v":0},10]
[2477856,"Пакет подарочный полиэтиленовый \"Вязанный узор\", 23х29,5",60,{"$f":"VLOOKUP(B30,Приход!$B$3:$G$105,6,0)","v":0},{"$f":"SUMIFS(Расход!$E$3:$E$707,Расход!$C$3:$C$707,B30)","v":0},60]
[2477862,"Пакет подарочный полиэтиленовый \"Золотая елка\", 23х29,5",60,{"$f":"VLOOKUP(B31,Приход!$B$3:$G$105,6,0)","v":0},{"$f":"SUMIFS(Расход!$E$3:$E$707,Расход!$C$3:$C$707,B31)","v":0},60]
[1386321,"Набор для декорирования шильдика \"Пряности и радости\" (3 шт), 11,5 х 14 см",4,{"$f":"VLOOKUP(B32,Приход!$B$3:$G$105,6,0)","v":0},{"$f":"SUMIFS(Расход!$E$3:$E$707,Расход!$C$3:$C$707,B32)","v":0},4]
[1760182,"Набор коробок 3в1 \"Елочка\" 19 х 12 х 7,5 - 15 х 10 х 5 см",2,{"$f":"VLOOKUP(B33,Приход!$B$3:$G$105,6,0)","v":0},{"$f":"SUMIFS(Расход!$E$3:$E$707,Расход!$C$3:$C$707,B33)","v":0},2]
[2786148,"Набор конвертов \"Новогодние\"",5,{"$f":"VLOOKUP(B34,Приход!$B$3:$G$105,6,0)","v":0},{"$f":"SUMIFS(Расход!$E$3:$E$707,Расход!$C$3:$C$707,B34)","v":0},5]
[2327164,"Подвеска световая \"Фонарик серебряный\" (батарейки в комплекте), 7 см, 1 LED, RGB",10,{"$f":"VLOOKUP(B35,Приход!$B$3:$G$105,6,0)","v":0},{"$f":"SUMIFS(Расход!$E$3:$E$707,Расход!$C$3:$C$707,B35)","v":0},10]
[2327168,"Подвеска световая \"Звезда серебряная\" (батарейки в комплекте), 8 см, 1 LED, RGB",10,{"$f":"VLOOKUP(B36,Приход!$B$3:$G$105,6,0)","v":0},{"$f":"SUMIFS(Расход!$E$3:$E$707,Расход!$C$3:$C$707,B36)","v":0},10]
[2361550,"Игрушка световая \"Елочный шар узоры краской\" 5 см, 1 LED, RGB, ЖЕЛТЫЙ",10,{"$f":"VLOOKUP(B37,Приход!$B$3:$G$105,6,0)","v":0},{"$f":"SUMIFS(Расход!$E$3:$E$707,Расход!$C$3:$C$707,B37)","v":0},10]
[2361546,"Игрушка световая \"Елочный шар узоры краской\" 5 см, 1LED, RGB, ГОЛУБОЙ",10,{"$f":"VLOOKUP(B38,Приход!$B$3:$G$105,6,0)","v":0},{"$f":"SUMIFS(Расход!$E$3:$E$707,Расход!$C$3:$C$707,B38)","v":0},10]
[2361543,"Игрушка световая \"Елочный шар узоры краской\" 5 см, 1 LED, RGB, РОЗОВЫЙ",10,{"$f":"VLOOKUP(B39,Приход!$B$3:$G$105,6,0)","v":0},{"$f":"SUMIFS(Расход!$E$3:$E$707,Расход!$C$3:$C$707,B39)","v":0},10]
[2433885,"Гирлянда \"Роса\" 3 м, 30 LED, (батарейки в комплекте), БЕЛЫЙ",10,{"$f":"VLOOKUP(B40,Приход!$B$3:$G$105,6,0)","v":0},{"$f":"SUMIFS(Расход!$E$3:$E$707,Расход!$C$3:$C$707,B40)","v":0},10]
{"$rows_left_out":59}