{"text_format":"1","workbook":"xlsx","n_sheets":3,"sheets":["Svod","src","Лист3"],"not_rendered":{"charts":1,"images":0,"macros":1,"external_links":0,"defined_names":10,"comments":0,"pivot_tables":0},"unopened":[],"bounds":{"document_bytes":16777216,"sheet_cells":100000,"rows_first":2000,"rows_last":500,"rows_between":2000,"halvings":0,"cell_chars":16384,"cell_head_chars":4096},"cells_cut":0,"cells_raw":0,"read":"whole","date_system":"1900"}

{"sheet":"Svod","index":0,"n_rows":8,"n_cols":6,"rows_kept":8,"cut":false,"hidden":false,"merged":[]}
[null,-1,0,1,2,3]
["Вид","2017-09-01","2017-09-24"]
["Данные","Пар_1","Пар_2","Пар_3","Пар_4","Пар_5"]
["Ан-1",{"$f":"OFFSET(src!$C$1,MATCH($A4,src!$B:$B,0)+B$1,Svod!$C$2-src!$C$1,1,1)","v":54},{"$f":"OFFSET(src!$C$1,MATCH($A4,src!$B:$B,0)+C$1,Svod!$C$2-src!$C$1,1,1)","v":56},{"$f":"OFFSET(src!$C$1,MATCH($A4,src!$B:$B,0)+D$1,Svod!$C$2-src!$C$1,1,1)","v":50},{"$f":"OFFSET(src!$C$1,MATCH($A4,src!$B:$B,0)+E$1,Svod!$C$2-src!$C$1,1,1)","v":69},{"$f":"OFFSET(src!$C$1,MATCH($A4,src!$B:$B,0)+F$1,Svod!$C$2-src!$C$1,1,1)","v":84}]
["Ан-2",{"$f":"OFFSET(src!$C$1,MATCH($A5,src!$B:$B,0)+B$1,Svod!$C$2-src!$C$1,1,1)","v":18},{"$f":"OFFSET(src!$C$1,MATCH($A5,src!$B:$B,0)+C$1,Svod!$C$2-src!$C$1,1,1)","v":79},{"$f":"OFFSET(src!$C$1,MATCH($A5,src!$B:$B,0)+D$1,Svod!$C$2-src!$C$1,1,1)","v":55},{"$f":"OFFSET(src!$C$1,MATCH($A5,src!$B:$B,0)+E$1,Svod!$C$2-src!$C$1,1,1)","v":33},{"$f":"OFFSET(src!$C$1,MATCH($A5,src!$B:$B,0)+F$1,Svod!$C$2-src!$C$1,1,1)","v":37}]
["Ан-3",{"$f":"OFFSET(src!$C$1,MATCH($A6,src!$B:$B,0)+B$1,Svod!$C$2-src!$C$1,1,1)","v":11},{"$f":"OFFSET(src!$C$1,MATCH($A6,src!$B:$B,0)+C$1,Svod!$C$2-src!$C$1,1,1)","v":63},{"$f":"OFFSET(src!$C$1,MATCH($A6,src!$B:$B,0)+D$1,Svod!$C$2-src!$C$1,1,1)","v":9},{"$f":"OFFSET(src!$C$1,MATCH($A6,src!$B:$B,0)+E$1,Svod!$C$2-src!$C$1,1,1)","v":74},{"$f":"OFFSET(src!$C$1,MATCH($A6,src!$B:$B,0)+F$1,Svod!$C$2-src!$C$1,1,1)","v":97}]
["Ан-4",{"$f":"OFFSET(src!$C$1,MATCH($A7,src!$B:$B,0)+B$1,Svod!$C$2-src!$C$1,1,1)","v":98},{"$f":"OFFSET(src!$C$1,MATCH($A7,src!$B:$B,0)+C$1,Svod!$C$2-src!$C$1,1,1)","v":51},{"$f":"OFFSET(src!$C$1,MATCH($A7,src!$B:$B,0)+D$1,Svod!$C$2-src!$C$1,1,1)","v":18},{"$f":"OFFSET(src!$C$1,MATCH($A7,src!$B:$B,0)+E$1,Svod!$C$2-src!$C$1,1,1)","v":77},{"$f":"OFFSET(src!$C$1,MATCH($A7,src!$B:$B,0)+F$1,Svod!$C$2-src!$C$1,1,1)","v":30}]
["Ан-5",{"$f":"OFFSET(src!$C$1,MATCH($A8,src!$B:$B,0)+B$1,Svod!$C$2-src!$C$1,1,1)","v":54},{"$f":"OFFSET(src!$C$1,MATCH($A8,src!$B:$B,0)+C$1,Svod!$C$2-src!$C$1,1,1)","v":9},{"$f":"OFFSET(src!$C$1,MATCH($A8,src!$B:$B,0)+D$1,Svod!$C$2-src!$C$1,1,1)","v":55},{"$f":"OFFSET(src!$C$1,MATCH($A8,src!$B:$B,0)+E$1,Svod!$C$2-src!$C$1,1,1)","v":54},{"$f":"OFFSET(src!$C$1,MATCH($A8,src!$B:$B,0)+F$1,Svod!$C$2-src!$C$1,1,1)","v":"ГГ"}]

{"sheet":"src","index":1,"n_rows":32,"n_cols":26,"rows_kept":32,"cut":false,"hidden":false,"merged":[[1,1,5,1],[6,1,10,1],[11,1,15,1],[16,1,20,1],[21,1,25,1]]}
["Параметры","Данные","2017-09-01",{"$f":"C1+1","v":"2017-09-02"},{"$f":"D1+1","v":"2017-09-03"},"2017-09-04","2017-09-05","2017-09-06","2017-09-07","2017-09-08","2017-09-09","2017-09-10","2017-09-11","2017-09-12","2017-09-13","2017-09-14","2017-09-15","2017-09-16","2017-09-17","2017-09-18","2017-09-19","2017-09-20","2017-09-21","2017-09-22","2017-09-23","2017-09-24"]
["Пар_1","Ан-1",30,33,26,63,95,60,23,59,72,37,18,15,99,72,82,75,10,88,80,88,22,75,35,54]
["Пар_2",null,45,66,86,77,64,81,85,68,10,99,58,76,37,92,78,19,93,9,55,8,80,28,17,56]
["Пар_3",null,81,47,45,44,27,63,56,44,97,89,88,60,51,32,36,61,31,36,59,96,93,85,71,50]
["Пар_4",null,47,26,33,29,1,98,22,13,85,40,99,27,100,38,80,66,65,83,16,13,69,85,51,69]
["Пар_5",null,10,27,51,45,81,55,89,97,43,77,2,12,63,51,16,33,80,48,45,85,59,2,26,84]
["Пар_1","Ан-2",33,92,70,3,44,38,89,95,64,36,85,62,38,5,10,69,21,38,15,83,52,26,92,18]
["Пар_2",null,49,15,48,36,36,66,91,62,91,34,53,31,90,16,24,72,1,95,24,88,22,55,37,79]
["Пар_3",null,26,42,77,10,96,74,44,42,88,99,40,95,68,86,39,47,28,9,83,86,31,74,58,55]
["Пар_4",null,64,53,5,69,2,64,92,19,81,19,38,12,26,3,40,85,90,44,73,10,84,73,41,33]
["Пар_5",null,64,32,22,26,87,42,98,32,54,46,82,82,55,10,91,62,27,45,81,60,61,22,52,37]
["Пар_1","Ан-3",44,11,12,4,68,1,90,6,71,8,22,41,93,29,70,45,19,35,24,69,33,4,9,11]
["Пар_2",null,32,56,49,44,47,28,68,91,44,95,10,97,62,25,64,31,10,54,27,9,38,94,70,63]
["Пар_3",null,6,44,41,14,23,84,89,31,45,82,84,100,12,72,25,72,41,71,4,74,87,9,39,9]
["Пар_4",null,17,61,70,61,47,5,63,99,100,69,5,93,43,32,79,14,31,35,75,11,78,13,70,74]
["Пар_5",null,32,30,84,16,21,87,38,37,98,94,16,55,5,83,56,87,24,17,5,61,26,47,20,97]
["Пар_1","Ан-4",33,85,30,27,88,17,38,55,25,2,8,45,45,81,74,71,93,28,65,98,75,66,51,98]
["Пар_2",null,52,84,6,17,78,84,23,29,58,82,49,24,28,13,3,96,68,82,74,12,5,96,93,51]
["Пар_3",null,14,51,69,77,34,37,55,95,86,41,71,22,68,55,33,83,36,63,50,43,12,80,76,18]
["Пар_4",null,81,23,37,33,46,5,44,63,17,82,76,76,29,7,100,77,25,71,24,91,64,63,12,77]
["Пар_5",null,10,89,66,88,86,97,7,76,43,96,48,29,68,7,72,55,36,48,53,1,73,91,61,30]
["Пар_1","Ан-5",18,33,3,38,84,96,22,90,91,10,12,37,89,69,100,70,78,94,6,27,96,37,45,54]
["Пар_2",null,52,28,73,49,6,88,90,23,71,87,22,88,49,32,15,97,83,53,63,97,73,51,38,9]
["Пар_3",null,4,33,69,49,84,8,95,64,42,58,13,16,55,23,41,72,29,37,25,30,95,67,18,55]
["Пар_4",null,39,8,65,31,12,49,46,34,82,87,66,1,21,40,94,64,97,82,42,53,74,43,91,54]
["Пар_5",null,"ГГ","ГГ","ГГ","ГГ","ГГ","ГГ","ГГ","ГГ","ГГ","ГГ","ГГ","ГГ","ГГ","ГГ","ГГ","ГГ","ГГ","ГГ","ГГ","ГГ","ГГ","ГГ","ГГ","ГГ"]
[]
["Пар_1",null,{"$f":"IF((C$1>=Svod!$B$2)*(C$1<=Svod!$C$2),SUMPRODUCT(($A$2:$A$26=$A2)*TEXT(C$2:C$26,\"0;;0;\\0\")*ISNUMBER(MATCH(LOOKUP(ROW($2:$26),ROW($2:$26)/($B$2:$B$26<>\"\"),$B$2:$B$26),IF(SUBTOTAL(3,INDIRECT(\"Svod!A\"&ROW(Svod!$4:$8))),Svod!$A$4:$A$8),))),\"\")","v":51},{"$f":"IF((D$1>=Svod!$B$2)*(D$1<=Svod!$C$2),SUMPRODUCT(($A$2:$A$26=$A2)*TEXT(D$2:D$26,\"0;;0;\\0\")*ISNUMBER(MATCH(LOOKUP(ROW($2:$26),ROW($2:$26)/($B$2:$B$26<>\"\"),$B$2:$B$26),IF(SUBTOTAL(3,INDIRECT(\"Svod!A\"&ROW(Svod!$4:$8))),Svod!$A$4:$A$8),))),\"\")","v":125},{"$f":"IF((E$1>=Svod!$B$2)*(E$1<=Svod!$C$2),SUMPRODUCT(($A$2:$A$26=$A2)*TEXT(E$2:E$26,\"0;;0;\\0\")*ISNUMBER(MATCH(LOOKUP(ROW($2:$26),ROW($2:$26)/($B$2:$B$26<>\"\"),$B$2:$B$26),IF(SUBTOTAL(3,INDIRECT(\"Svod!A\"&ROW(Svod!$4:$8))),Svod!$A$4:$A$8),))),\"\")","v":73},{"$f":"IF((F$1>=Svod!$B$2)*(F$1<=Svod!$C$2),SUMPRODUCT(($A$2:$A$26=$A2)*TEXT(F$2:F$26,\"0;;0;\\0\")*ISNUMBER(MATCH(LOOKUP(ROW($2:$26),ROW($2:$26)/($B$2:$B$26<>\"\"),$B$2:$B$26),IF(SUBTOTAL(3,INDIRECT(\"Svod!A\"&ROW(Svod!$4:$8))),Svod!$A$4:$A$8),))),\"\")","v":41},{"$f":"IF((G$1>=Svod!$B$2)*(G$1<=Svod!$C$2),SUMPRODUCT(($A$2:$A$26=$A2)*TEXT(G$2:G$26,\"0;;0;\\0\")*ISNUMBER(MATCH(LOOKUP(ROW($2:$26),ROW($2:$26)/($B$2:$B$26<>\"\"),$B$2:$B$26),IF(SUBTOTAL(3,INDIRECT(\"Svod!A\"&ROW(Svod!$4:$8))),Svod!$A$4:$A$8),))),\"\")","v":128},{"$f":"IF((H$1>=Svod!$B$2)*(H$1<=Svod!$C$2),SUMPRODUCT(($A$2:$A$26=$A2)*TEXT(H$2:H$26,\"0;;0;\\0\")*ISNUMBER(MATCH(LOOKUP(ROW($2:$26),ROW($2:$26)/($B$2:$B$26<>\"\"),$B$2:$B$26),IF(SUBTOTAL(3,INDIRECT(\"Svod!A\"&ROW(Svod!$4:$8))),Svod!$A$4:$A$8),))),\"\")","v":134},{"$f":"IF((I$1>=Svod!$B$2)*(I$1<=Svod!$C$2),SUMPRODUCT(($A$2:$A$26=$A2)*TEXT(I$2:I$26,\"0;;0;\\0\")*ISNUMBER(MATCH(LOOKUP(ROW($2:$26),ROW($2:$26)/($B$2:$B$26<>\"\"),$B$2:$B$26),IF(SUBTOTAL(3,INDIRECT(\"Svod!A\"&ROW(Svod!$4:$8))),Svod!$A$4:$A$8),))),\"\")","v":111},{"$f":"IF((J$1>=Svod!$B$2)*(J$1<=Svod!$C$2),SUMPRODUCT(($A$2:$A$26=$A2)*TEXT(J$2:J$26,\"0;;0;\\0\")*ISNUMBER(MATCH(LOOKUP(ROW($2:$26),ROW($2:$26)/($B$2:$B$26<>\"\"),$B$2:$B$26),IF(SUBTOTAL(3,INDIRECT(\"Svod!A\"&ROW(Svod!$4:$8))),Svod!$A$4:$A$8),))),\"\")","v":185},{"$f":"IF((K$1>=Svod!$B$2)*(K$1<=Svod!$C$2),SUMPRODUCT(($A$2:$A$26=$A2)*TEXT(K$2:K$26,\"0;;0;\\0\")*ISNUMBER(MATCH(LOOKUP(ROW($2:$26),ROW($2:$26)/($B$2:$B$26<>\"\"),$B$2:$B$26),IF(SUBTOTAL(3,INDIRECT(\"Svod!A\"&ROW(Svod!$4:$8))),Svod!$A$4:$A$8),))),\"\")","v":155},{"$f":"IF((L$1>=Svod!$B$2)*(L$1<=Svod!$C$2),SUMPRODUCT(($A$2:$A$26=$A2)*TEXT(L$2:L$26,\"0;;0;\\0\")*ISNUMBER(MATCH(LOOKUP(ROW($2:$26),ROW($2:$26)/($B$2:$B$26<>\"\"),$B$2:$B$26),IF(SUBTOTAL(3,INDIRECT(\"Svod!A\"&ROW(Svod!$4:$8))),Svod!$A$4:$A$8),))),\"\")","v":46},{"$f":"IF((M$1>=Svod!$B$2)*(M$1<=Svod!$C$2),SUMPRODUCT(($A$2:$A$26=$A2)*TEXT(M$2:M$26,\"0;;0;\\0\")*ISNUMBER(MATCH(LOOKUP(ROW($2:$26),ROW($2:$26)/($B$2:$B$26<>\"\"),$B$2:$B$26),IF(SUBTOTAL(3,INDIRECT(\"Svod!A\"&ROW(Svod!$4:$8))),Svod!$A$4:$A$8),))),\"\")","v":97},{"$f":"IF((N$1>=Svod!$B$2)*(N$1<=Svod!$C$2),SUMPRODUCT(($A$2:$A$26=$A2)*TEXT(N$2:N$26,\"0;;0;\\0\")*ISNUMBER(MATCH(LOOKUP(ROW($2:$26),ROW($2:$26)/($B$2:$B$26<>\"\"),$B$2:$B$26),IF(SUBTOTAL(3,INDIRECT(\"Svod!A\"&ROW(Svod!$4:$8))),Svod!$A$4:$A$8),))),\"\")","v":99},{"$f":"IF((O$1>=Svod!$B$2)*(O$1<=Svod!$C$2),SUMPRODUCT(($A$2:$A$26=$A2)*TEXT(O$2:O$26,\"0;;0;\\0\")*ISNUMBER(MATCH(LOOKUP(ROW($2:$26),ROW($2:$26)/($B$2:$B$26<>\"\"),$B$2:$B$26),IF(SUBTOTAL(3,INDIRECT(\"Svod!A\"&ROW(Svod!$4:$8))),Svod!$A$4:$A$8),))),\"\")","v":127},{"$f":"IF((P$1>=Svod!$B$2)*(P$1<=Svod!$C$2),SUMPRODUCT(($A$2:$A$26=$A2)*TEXT(P$2:P$26,\"0;;0;\\0\")*ISNUMBER(MATCH(LOOKUP(ROW($2:$26),ROW($2:$26)/($B$2:$B$26<>\"\"),$B$2:$B$26),IF(SUBTOTAL(3,INDIRECT(\"Svod!A\"&ROW(Svod!$4:$8))),Svod!$A$4:$A$8),))),\"\")","v":74},{"$f":"IF((Q$1>=Svod!$B$2)*(Q$1<=Svod!$C$2),SUMPRODUCT(($A$2:$A$26=$A2)*TEXT(Q$2:Q$26,\"0;;0;\\0\")*ISNUMBER(MATCH(LOOKUP(ROW($2:$26),ROW($2:$26)/($B$2:$B$26<>\"\"),$B$2:$B$26),IF(SUBTOTAL(3,INDIRECT(\"Svod!A\"&ROW(Svod!$4:$8))),Svod!$A$4:$A$8),))),\"\")","v":110},{"$f":"IF((R$1>=Svod!$B$2)*(R$1<=Svod!$C$2),SUMPRODUCT(($A$2:$A$26=$A2)*TEXT(R$2:R$26,\"0;;0;\\0\")*ISNUMBER(MATCH(LOOKUP(ROW($2:$26),ROW($2:$26)/($B$2:$B$26<>\"\"),$B$2:$B$26),IF(SUBTOTAL(3,INDIRECT(\"Svod!A\"&ROW(Svod!$4:$8))),Svod!$A$4:$A$8),))),\"\")","v":139},{"$f":"IF((S$1>=Svod!$B$2)*(S$1<=Svod!$C$2),SUMPRODUCT(($A$2:$A$26=$A2)*TEXT(S$2:S$26,\"0;;0;\\0\")*ISNUMBER(MATCH(LOOKUP(ROW($2:$26),ROW($2:$26)/($B$2:$B$26<>\"\"),$B$2:$B$26),IF(SUBTOTAL(3,INDIRECT(\"Svod!A\"&ROW(Svod!$4:$8))),Svod!$A$4:$A$8),))),\"\")","v":99},{"$f":"IF((T$1>=Svod!$B$2)*(T$1<=Svod!$C$2),SUMPRODUCT(($A$2:$A$26=$A2)*TEXT(T$2:T$26,\"0;;0;\\0\")*ISNUMBER(MATCH(LOOKUP(ROW($2:$26),ROW($2:$26)/($B$2:$B$26<>\"\"),$B$2:$B$26),IF(SUBTOTAL(3,INDIRECT(\"Svod!A\"&ROW(Svod!$4:$8))),Svod!$A$4:$A$8),))),\"\")","v":132},{"$f":"IF((U$1>=Svod!$B$2)*(U$1<=Svod!$C$2),SUMPRODUCT(($A$2:$A$26=$A2)*TEXT(U$2:U$26,\"0;;0;\\0\")*ISNUMBER(MATCH(LOOKUP(ROW($2:$26),ROW($2:$26)/($B$2:$B$26<>\"\"),$B$2:$B$26),IF(SUBTOTAL(3,INDIRECT(\"Svod!A\"&ROW(Svod!$4:$8))),Svod!$A$4:$A$8),))),\"\")","v":21},{"$f":"IF((V$1>=Svod!$B$2)*(V$1<=Svod!$C$2),SUMPRODUCT(($A$2:$A$26=$A2)*TEXT(V$2:V$26,\"0;;0;\\0\")*ISNUMBER(MATCH(LOOKUP(ROW($2:$26),ROW($2:$26)/($B$2:$B$26<>\"\"),$B$2:$B$26),IF(SUBTOTAL(3,INDIRECT(\"Svod!A\"&ROW(Svod!$4:$8))),Svod!$A$4:$A$8),))),\"\")","v":110},{"$f":"IF((W$1>=Svod!$B$2)*(W$1<=Svod!$C$2),SUMPRODUCT(($A$2:$A$26=$A2)*TEXT(W$2:W$26,\"0;;0;\\0\")*ISNUMBER(MATCH(LOOKUP(ROW($2:$26),ROW($2:$26)/($B$2:$B$26<>\"\"),$B$2:$B$26),IF(SUBTOTAL(3,INDIRECT(\"Svod!A\"&ROW(Svod!$4:$8))),Svod!$A$4:$A$8),))),\"\")","v":148},{"$f":"IF((X$1>=Svod!$B$2)*(X$1<=Svod!$C$2),SUMPRODUCT(($A$2:$A$26=$A2)*TEXT(X$2:X$26,\"0;;0;\\0\")*ISNUMBER(MATCH(LOOKUP(ROW($2:$26),ROW($2:$26)/($B$2:$B$26<>\"\"),$B$2:$B$26),IF(SUBTOTAL(3,INDIRECT(\"Svod!A\"&ROW(Svod!$4:$8))),Svod!$A$4:$A$8),))),\"\")","v":63},{"$f":"IF((Y$1>=Svod!$B$2)*(Y$1<=Svod!$C$2),SUMPRODUCT(($A$2:$A$26=$A2)*TEXT(Y$2:Y$26,\"0;;0;\\0\")*ISNUMBER(MATCH(LOOKUP(ROW($2:$26),ROW($2:$26)/($B$2:$B$26<>\"\"),$B$2:$B$26),IF(SUBTOTAL(3,INDIRECT(\"Svod!A\"&ROW(Svod!$4:$8))),Svod!$A$4:$A$8),))),\"\")","v":137},{"$f":"IF((Z$1>=Svod!$B$2)*(Z$1<=Svod!$C$2),SUMPRODUCT(($A$2:$A$26=$A2)*TEXT(Z$2:Z$26,\"0;;0;\\0\")*ISNUMBER(MATCH(LOOKUP(ROW($2:$26),ROW($2:$26)/($B$2:$B$26<>\"\"),$B$2:$B$26),IF(SUBTOTAL(3,INDIRECT(\"Svod!A\"&ROW(Svod!$4:$8))),Svod!$A$4:$A$8),))),\"\")","v":72}]
["Пар_2",null,{"$f":"IF((C$1>=Svod!$B$2)*(C$1<=Svod!$C$2),SUMPRODUCT(($A$2:$A$26=$A3)*TEXT(C$2:C$26,\"0;;0;\\0\")*ISNUMBER(MATCH(LOOKUP(ROW($2:$26),ROW($2:$26)/($B$2:$B$26<>\"\"),$B$2:$B$26),IF(SUBTOTAL(3,INDIRECT(\"Svod!A\"&ROW(Svod!$4:$8))),Svod!$A$4:$A$8),))),\"\")","v":101},{"$f":"IF((D$1>=Svod!$B$2)*(D$1<=Svod!$C$2),SUMPRODUCT(($A$2:$A$26=$A3)*TEXT(D$2:D$26,\"0;;0;\\0\")*ISNUMBER(MATCH(LOOKUP(ROW($2:$26),ROW($2:$26)/($B$2:$B$26<>\"\"),$B$2:$B$26),IF(SUBTOTAL(3,INDIRECT(\"Svod!A\"&ROW(Svod!$4:$8))),Svod!$A$4:$A$8),))),\"\")","v":43},{"$f":"IF((E$1>=Svod!$B$2)*(E$1<=Svod!$C$2),SUMPRODUCT(($A$2:$A$26=$A3)*TEXT(E$2:E$26,\"0;;0;\\0\")*ISNUMBER(MATCH(LOOKUP(ROW($2:$26),ROW($2:$26)/($B$2:$B$26<>\"\"),$B$2:$B$26),IF(SUBTOTAL(3,INDIRECT(\"Svod!A\"&ROW(Svod!$4:$8))),Svod!$A$4:$A$8),))),\"\")","v":121},{"$f":"IF((F$1>=Svod!$B$2)*(F$1<=Svod!$C$2),SUMPRODUCT(($A$2:$A$26=$A3)*TEXT(F$2:F$26,\"0;;0;\\0\")*ISNUMBER(MATCH(LOOKUP(ROW($2:$26),ROW($2:$26)/($B$2:$B$26<>\"\"),$B$2:$B$26),IF(SUBTOTAL(3,INDIRECT(\"Svod!A\"&ROW(Svod!$4:$8))),Svod!$A$4:$A$8),))),\"\")","v":85},{"$f":"IF((G$1>=Svod!$B$2)*(G$1<=Svod!$C$2),SUMPRODUCT(($A$2:$A$26=$A3)*TEXT(G$2:G$26,\"0;;0;\\0\")*ISNUMBER(MATCH(LOOKUP(ROW($2:$26),ROW($2:$26)/($B$2:$B$26<>\"\"),$B$2:$B$26),IF(SUBTOTAL(3,INDIRECT(\"Svod!A\"&ROW(Svod!$4:$8))),Svod!$A$4:$A$8),))),\"\")","v":42},{"$f":"IF((H$1>=Svod!$B$2)*(H$1<=Svod!$C$2),SUMPRODUCT(($A$2:$A$26=$A3)*TEXT(H$2:H$26,\"0;;0;\\0\")*ISNUMBER(MATCH(LOOKUP(ROW($2:$26),ROW($2:$26)/($B$2:$B$26<>\"\"),$B$2:$B$26),IF(SUBTOTAL(3,INDIRECT(\"Svod!A\"&ROW(Svod!$4:$8))),Svod!$A$4:$A$8),))),\"\")","v":154},{"$f":"IF((I$1>=Svod!$B$2)*(I$1<=Svod!$C$2),SUMPRODUCT(($A$2:$A$26=$A3)*TEXT(I$2:I$26,\"0;;0;\\0\")*ISNUMBER(MATCH(LOOKUP(ROW($2:$26),ROW($2:$26)/($B$2:$B$26<>\"\"),$B$2:$B$26),IF(SUBTOTAL(3,INDIRECT(\"Svod!A\"&ROW(Svod!$4:$8))),Svod!$A$4:$A$8),))),\"\")","v":181},{"$f":"IF((J$1>=Svod!$B$2)*(J$1<=Svod!$C$2),SUMPRODUCT(($A$2:$A$26=$A3)*TEXT(J$2:J$26,\"0;;0;\\0\")*ISNUMBER(MATCH(LOOKUP(ROW($2:$26),ROW($2:$26)/($B$2:$B$26<>\"\"),$B$2:$B$26),IF(SUBTOTAL(3,INDIRECT(\"Svod!A\"&ROW(Svod!$4:$8))),Svod!$A$4:$A$8),))),\"\")","v":85},{"$f":"IF((K$1>=Svod!$B$2)*(K$1<=Svod!$C$2),SUMPRODUCT(($A$2:$A$26=$A3)*TEXT(K$2:K$26,\"0;;0;\\0\")*ISNUMBER(MATCH(LOOKUP(ROW($2:$26),ROW($2:$26)/($B$2:$B$26<>\"\"),$B$2:$B$26),IF(SUBTOTAL(3,INDIRECT(\"Svod!A\"&ROW(Svod!$4:$8))),Svod!$A$4:$A$8),))),\"\")","v":162},{"$f":"IF((L$1>=Svod!$B$2)*(L$1<=Svod!$C$2),SUMPRODUCT(($A$2:$A$26=$A3)*TEXT(L$2:L$26,\"0;;0;\\0\")*ISNUMBER(MATCH(LOOKUP(ROW($2:$26),ROW($2:$26)/($B$2:$B$26<>\"\"),$B$2:$B$26),IF(SUBTOTAL(3,INDIRECT(\"Svod!A\"&ROW(Svod!$4:$8))),Svod!$A$4:$A$8),))),\"\")","v":121},{"$f":"IF((M$1>=Svod!$B$2)*(M$1<=Svod!$C$2),SUMPRODUCT(($A$2:$A$26=$A3)*TEXT(M$2:M$26,\"0;;0;\\0\")*ISNUMBER(MATCH(LOOKUP(ROW($2:$26),ROW($2:$26)/($B$2:$B$26<>\"\"),$B$2:$B$26),IF(SUBTOTAL(3,INDIRECT(\"Svod!A\"&ROW(Svod!$4:$8))),Svod!$A$4:$A$8),))),\"\")","v":75},{"$f":"IF((N$1>=Svod!$B$2)*(N$1<=Svod!$C$2),SUMPRODUCT(($A$2:$A$26=$A3)*TEXT(N$2:N$26,\"0;;0;\\0\")*ISNUMBER(MATCH(LOOKUP(ROW($2:$26),ROW($2:$26)/($B$2:$B$26<>\"\"),$B$2:$B$26),IF(SUBTOTAL(3,INDIRECT(\"Svod!A\"&ROW(Svod!$4:$8))),Svod!$A$4:$A$8),))),\"\")","v":119},{"$f":"IF((O$1>=Svod!$B$2)*(O$1<=Svod!$C$2),SUMPRODUCT(($A$2:$A$26=$A3)*TEXT(O$2:O$26,\"0;;0;\\0\")*ISNUMBER(MATCH(LOOKUP(ROW($2:$26),ROW($2:$26)/($B$2:$B$26<>\"\"),$B$2:$B$26),IF(SUBTOTAL(3,INDIRECT(\"Svod!A\"&ROW(Svod!$4:$8))),Svod!$A$4:$A$8),))),\"\")","v":139},{"$f":"IF((P$1>=Svod!$B$2)*(P$1<=Svod!$C$2),SUMPRODUCT(($A$2:$A$26=$A3)*TEXT(P$2:P$26,\"0;;0;\\0\")*ISNUMBER(MATCH(LOOKUP(ROW($2:$26),ROW($2:$26)/($B$2:$B$26<>\"\"),$B$2:$B$26),IF(SUBTOTAL(3,INDIRECT(\"Svod!A\"&ROW(Svod!$4:$8))),Svod!$A$4:$A$8),))),\"\")","v":48},{"$f":"IF((Q$1>=Svod!$B$2)*(Q$1<=Svod!$C$2),SUMPRODUCT(($A$2:$A$26=$A3)*TEXT(Q$2:Q$26,\"0;;0;\\0\")*ISNUMBER(MATCH(LOOKUP(ROW($2:$26),ROW($2:$26)/($B$2:$B$26<>\"\"),$B$2:$B$26),IF(SUBTOTAL(3,INDIRECT(\"Svod!A\"&ROW(Svod!$4:$8))),Svod!$A$4:$A$8),))),\"\")","v":39},{"$f":"IF((R$1>=Svod!$B$2)*(R$1<=Svod!$C$2),SUMPRODUCT(($A$2:$A$26=$A3)*TEXT(R$2:R$26,\"0;;0;\\0\")*ISNUMBER(MATCH(LOOKUP(ROW($2:$26),ROW($2:$26)/($B$2:$B$26<>\"\"),$B$2:$B$26),IF(SUBTOTAL(3,INDIRECT(\"Svod!A\"&ROW(Svod!$4:$8))),Svod!$A$4:$A$8),))),\"\")","v":169},{"$f":"IF((S$1>=Svod!$B$2)*(S$1<=Svod!$C$2),SUMPRODUCT(($A$2:$A$26=$A3)*TEXT(S$2:S$26,\"0;;0;\\0\")*ISNUMBER(MATCH(LOOKUP(ROW($2:$26),ROW($2:$26)/($B$2:$B$26<>\"\"),$B$2:$B$26),IF(SUBTOTAL(3,INDIRECT(\"Svod!A\"&ROW(Svod!$4:$8))),Svod!$A$4:$A$8),))),\"\")","v":84},{"$f":"IF((T$1>=Svod!$B$2)*(T$1<=Svod!$C$2),SUMPRODUCT(($A$2:$A$26=$A3)*TEXT(T$2:T$26,\"0;;0;\\0\")*ISNUMBER(MATCH(LOOKUP(ROW($2:$26),ROW($2:$26)/($B$2:$B$26<>\"\"),$B$2:$B$26),IF(SUBTOTAL(3,INDIRECT(\"Svod!A\"&ROW(Svod!$4:$8))),Svod!$A$4:$A$8),))),\"\")","v":148},{"$f":"IF((U$1>=Svod!$B$2)*(U$1<=Svod!$C$2),SUMPRODUCT(($A$2:$A$26=$A3)*TEXT(U$2:U$26,\"0;;0;\\0\")*ISNUMBER(MATCH(LOOKUP(ROW($2:$26),ROW($2:$26)/($B$2:$B$26<>\"\"),$B$2:$B$26),IF(SUBTOTAL(3,INDIRECT(\"Svod!A\"&ROW(Svod!$4:$8))),Svod!$A$4:$A$8),))),\"\")","v":87},{"$f":"IF((V$1>=Svod!$B$2)*(V$1<=Svod!$C$2),SUMPRODUCT(($A$2:$A$26=$A3)*TEXT(V$2:V$26,\"0;;0;\\0\")*ISNUMBER(MATCH(LOOKUP(ROW($2:$26),ROW($2:$26)/($B$2:$B$26<>\"\"),$B$2:$B$26),IF(SUBTOTAL(3,INDIRECT(\"Svod!A\"&ROW(Svod!$4:$8))),Svod!$A$4:$A$8),))),\"\")","v":185},{"$f":"IF((W$1>=Svod!$B$2)*(W$1<=Svod!$C$2),SUMPRODUCT(($A$2:$A$26=$A3)*TEXT(W$2:W$26,\"0;;0;\\0\")*ISNUMBER(MATCH(LOOKUP(ROW($2:$26),ROW($2:$26)/($B$2:$B$26<>\"\"),$B$2:$B$26),IF(SUBTOTAL(3,INDIRECT(\"Svod!A\"&ROW(Svod!$4:$8))),Svod!$A$4:$A$8),))),\"\")","v":95},{"$f":"IF((X$1>=Svod!$B$2)*(X$1<=Svod!$C$2),SUMPRODUCT(($A$2:$A$26=$A3)*TEXT(X$2:X$26,\"0;;0;\\0\")*ISNUMBER(MATCH(LOOKUP(ROW($2:$26),ROW($2:$26)/($B$2:$B$26<>\"\"),$B$2:$B$26),IF(SUBTOTAL(3,INDIRECT(\"Svod!A\"&ROW(Svod!$4:$8))),Svod!$A$4:$A$8),))),\"\")","v":106},{"$f":"IF((Y$1>=Svod!$B$2)*(Y$1<=Svod!$C$2),SUMPRODUCT(($A$2:$A$26=$A3)*TEXT(Y$2:Y$26,\"0;;0;\\0\")*ISNUMBER(MATCH(LOOKUP(ROW($2:$26),ROW($2:$26)/($B$2:$B$26<>\"\"),$B$2:$B$26),IF(SUBTOTAL(3,INDIRECT(\"Svod!A\"&ROW(Svod!$4:$8))),Svod!$A$4:$A$8),))),\"\")","v":75},{"$f":"IF((Z$1>=Svod!$B$2)*(Z$1<=Svod!$C$2),SUMPRODUCT(($A$2:$A$26=$A3)*TEXT(Z$2:Z$26,\"0;;0;\\0\")*ISNUMBER(MATCH(LOOKUP(ROW($2:$26),ROW($2:$26)/($B$2:$B$26<>\"\"),$B$2:$B$26),IF(SUBTOTAL(3,INDIRECT(\"Svod!A\"&ROW(Svod!$4:$8))),Svod!$A$4:$A$8),))),\"\")","v":88}]
["Пар_3",null,{"$f":"IF((C$1>=Svod!$B$2)*(C$1<=Svod!$C$2),SUMPRODUCT(($A$2:$A$26=$A4)*TEXT(C$2:C$26,\"0;;0;\\0\")*ISNUMBER(MATCH(LOOKUP(ROW($2:$26),ROW($2:$26)/($B$2:$B$26<>\"\"),$B$2:$B$26),IF(SUBTOTAL(3,INDIRECT(\"Svod!A\"&ROW(Svod!$4:$8))),Svod!$A$4:$A$8),))),\"\")","v":30},{"$f":"IF((D$1>=Svod!$B$2)*(D$1<=Svod!$C$2),SUMPRODUCT(($A$2:$A$26=$A4)*TEXT(D$2:D$26,\"0;;0;\\0\")*ISNUMBER(MATCH(LOOKUP(ROW($2:$26),ROW($2:$26)/($B$2:$B$26<>\"\"),$B$2:$B$26),IF(SUBTOTAL(3,INDIRECT(\"Svod!A\"&ROW(Svod!$4:$8))),Svod!$A$4:$A$8),))),\"\")","v":75},{"$f":"IF((E$1>=Svod!$B$2)*(E$1<=Svod!$C$2),SUMPRODUCT(($A$2:$A$26=$A4)*TEXT(E$2:E$26,\"0;;0;\\0\")*ISNUMBER(MATCH(LOOKUP(ROW($2:$26),ROW($2:$26)/($B$2:$B$26<>\"\"),$B$2:$B$26),IF(SUBTOTAL(3,INDIRECT(\"Svod!A\"&ROW(Svod!$4:$8))),Svod!$A$4:$A$8),))),\"\")","v":146},{"$f":"IF((F$1>=Svod!$B$2)*(F$1<=Svod!$C$2),SUMPRODUCT(($A$2:$A$26=$A4)*TEXT(F$2:F$26,\"0;;0;\\0\")*ISNUMBER(MATCH(LOOKUP(ROW($2:$26),ROW($2:$26)/($B$2:$B$26<>\"\"),$B$2:$B$26),IF(SUBTOTAL(3,INDIRECT(\"Svod!A\"&ROW(Svod!$4:$8))),Svod!$A$4:$A$8),))),\"\")","v":59},{"$f":"IF((G$1>=Svod!$B$2)*(G$1<=Svod!$C$2),SUMPRODUCT(($A$2:$A$26=$A4)*TEXT(G$2:G$26,\"0;;0;\\0\")*ISNUMBER(MATCH(LOOKUP(ROW($2:$26),ROW($2:$26)/($B$2:$B$26<>\"\"),$B$2:$B$26),IF(SUBTOTAL(3,INDIRECT(\"Svod!A\"&ROW(Svod!$4:$8))),Svod!$A$4:$A$8),))),\"\")","v":180},{"$f":"IF((H$1>=Svod!$B$2)*(H$1<=Svod!$C$2),SUMPRODUCT(($A$2:$A$26=$A4)*TEXT(H$2:H$26,\"0;;0;\\0\")*ISNUMBER(MATCH(LOOKUP(ROW($2:$26),ROW($2:$26)/($B$2:$B$26<>\"\"),$B$2:$B$26),IF(SUBTOTAL(3,INDIRECT(\"Svod!A\"&ROW(Svod!$4:$8))),Svod!$A$4:$A$8),))),\"\")","v":82},{"$f":"IF((I$1>=Svod!$B$2)*(I$1<=Svod!$C$2),SUMPRODUCT(($A$2:$A$26=$A4)*TEXT(I$2:I$26,\"0;;0;\\0\")*ISNUMBER(MATCH(LOOKUP(ROW($2:$26),ROW($2:$26)/($B$2:$B$26<>\"\"),$B$2:$B$26),IF(SUBTOTAL(3,INDIRECT(\"Svod!A\"&ROW(Svod!$4:$8))),Svod!$A$4:$A$8),))),\"\")","v":139},{"$f":"IF((J$1>=Svod!$B$2)*(J$1<=Svod!$C$2),SUMPRODUCT(($A$2:$A$26=$A4)*TEXT(J$2:J$26,\"0;;0;\\0\")*ISNUMBER(MATCH(LOOKUP(ROW($2:$26),ROW($2:$26)/($B$2:$B$26<>\"\"),$B$2:$B$26),IF(SUBTOTAL(3,INDIRECT(\"Svod!A\"&ROW(Svod!$4:$8))),Svod!$A$4:$A$8),))),\"\")","v":106},{"$f":"IF((K$1>=Svod!$B$2)*(K$1<=Svod!$C$2),SUMPRODUCT(($A$2:$A$26=$A4)*TEXT(K$2:K$26,\"0;;0;\\0\")*ISNUMBER(MATCH(LOOKUP(ROW($2:$26),ROW($2:$26)/($B$2:$B$26<>\"\"),$B$2:$B$26),IF(SUBTOTAL(3,INDIRECT(\"Svod!A\"&ROW(Svod!$4:$8))),Svod!$A$4:$A$8),))),\"\")","v":130},{"$f":"IF((L$1>=Svod!$B$2)*(L$1<=Svod!$C$2),SUMPRODUCT(($A$2:$A$26=$A4)*TEXT(L$2:L$26,\"0;;0;\\0\")*ISNUMBER(MATCH(LOOKUP(ROW($2:$26),ROW($2:$26)/($B$2:$B$26<>\"\"),$B$2:$B$26),IF(SUBTOTAL(3,INDIRECT(\"Svod!A\"&ROW(Svod!$4:$8))),Svod!$A$4:$A$8),))),\"\")","v":157},{"$f":"IF((M$1>=Svod!$B$2)*(M$1<=Svod!$C$2),SUMPRODUCT(($A$2:$A$26=$A4)*TEXT(M$2:M$26,\"0;;0;\\0\")*ISNUMBER(MATCH(LOOKUP(ROW($2:$26),ROW($2:$26)/($B$2:$B$26<>\"\"),$B$2:$B$26),IF(SUBTOTAL(3,INDIRECT(\"Svod!A\"&ROW(Svod!$4:$8))),Svod!$A$4:$A$8),))),\"\")","v":53},{"$f":"IF((N$1>=Svod!$B$2)*(N$1<=Svod!$C$2),SUMPRODUCT(($A$2:$A$26=$A4)*TEXT(N$2:N$26,\"0;;0;\\0\")*ISNUMBER(MATCH(LOOKUP(ROW($2:$26),ROW($2:$26)/($B$2:$B$26<>\"\"),$B$2:$B$26),IF(SUBTOTAL(3,INDIRECT(\"Svod!A\"&ROW(Svod!$4:$8))),Svod!$A$4:$A$8),))),\"\")","v":111},{"$f":"IF((O$1>=Svod!$B$2)*(O$1<=Svod!$C$2),SUMPRODUCT(($A$2:$A$26=$A4)*TEXT(O$2:O$26,\"0;;0;\\0\")*ISNUMBER(MATCH(LOOKUP(ROW($2:$26),ROW($2:$26)/($B$2:$B$26<>\"\"),$B$2:$B$26),IF(SUBTOTAL(3,INDIRECT(\"Svod!A\"&ROW(Svod!$4:$8))),Svod!$A$4:$A$8),))),\"\")","v":123},{"$f":"IF((P$1>=Svod!$B$2)*(P$1<=Svod!$C$2),SUMPRODUCT(($A$2:$A$26=$A4)*TEXT(P$2:P$26,\"0;;0;\\0\")*ISNUMBER(MATCH(LOOKUP(ROW($2:$26),ROW($2:$26)/($B$2:$B$26<>\"\"),$B$2:$B$26),IF(SUBTOTAL(3,INDIRECT(\"Svod!A\"&ROW(Svod!$4:$8))),Svod!$A$4:$A$8),))),\"\")","v":109},{"$f":"IF((Q$1>=Svod!$B$2)*(Q$1<=Svod!$C$2),SUMPRODUCT(($A$2:$A$26=$A4)*TEXT(Q$2:Q$26,\"0;;0;\\0\")*ISNUMBER(MATCH(LOOKUP(ROW($2:$26),ROW($2:$26)/($B$2:$B$26<>\"\"),$B$2:$B$26),IF(SUBTOTAL(3,INDIRECT(\"Svod!A\"&ROW(Svod!$4:$8))),Svod!$A$4:$A$8),))),\"\")","v":80},{"$f":"IF((R$1>=Svod!$B$2)*(R$1<=Svod!$C$2),SUMPRODUCT(($A$2:$A$26=$A4)*TEXT(R$2:R$26,\"0;;0;\\0\")*ISNUMBER(MATCH(LOOKUP(ROW($2:$26),ROW($2:$26)/($B$2:$B$26<>\"\"),$B$2:$B$26),IF(SUBTOTAL(3,INDIRECT(\"Svod!A\"&ROW(Svod!$4:$8))),Svod!$A$4:$A$8),))),\"\")","v":119},{"$f":"IF((S$1>=Svod!$B$2)*(S$1<=Svod!$C$2),SUMPRODUCT(($A$2:$A$26=$A4)*TEXT(S$2:S$26,\"0;;0;\\0\")*ISNUMBER(MATCH(LOOKUP(ROW($2:$26),ROW($2:$26)/($B$2:$B$26<>\"\"),$B$2:$B$26),IF(SUBTOTAL(3,INDIRECT(\"Svod!A\"&ROW(Svod!$4:$8))),Svod!$A$4:$A$8),))),\"\")","v":57},{"$f":"IF((T$1>=Svod!$B$2)*(T$1<=Svod!$C$2),SUMPRODUCT(($A$2:$A$26=$A4)*TEXT(T$2:T$26,\"0;;0;\\0\")*ISNUMBER(MATCH(LOOKUP(ROW($2:$26),ROW($2:$26)/($B$2:$B$26<>\"\"),$B$2:$B$26),IF(SUBTOTAL(3,INDIRECT(\"Svod!A\"&ROW(Svod!$4:$8))),Svod!$A$4:$A$8),))),\"\")","v":46},{"$f":"IF((U$1>=Svod!$B$2)*(U$1<=Svod!$C$2),SUMPRODUCT(($A$2:$A$26=$A4)*TEXT(U$2:U$26,\"0;;0;\\0\")*ISNUMBER(MATCH(LOOKUP(ROW($2:$26),ROW($2:$26)/($B$2:$B$26<>\"\"),$B$2:$B$26),IF(SUBTOTAL(3,INDIRECT(\"Svod!A\"&ROW(Svod!$4:$8))),Svod!$A$4:$A$8),))),\"\")","v":108},{"$f":"IF((V$1>=Svod!$B$2)*(V$1<=Svod!$C$2),SUMPRODUCT(($A$2:$A$26=$A4)*TEXT(V$2:V$26,\"0;;0;\\0\")*ISNUMBER(MATCH(LOOKUP(ROW($2:$26),ROW($2:$26)/($B$2:$B$26<>\"\"),$B$2:$B$26),IF(SUBTOTAL(3,INDIRECT(\"Svod!A\"&ROW(Svod!$4:$8))),Svod!$A$4:$A$8),))),\"\")","v":116},{"$f":"IF((W$1>=Svod!$B$2)*(W$1<=Svod!$C$2),SUMPRODUCT(($A$2:$A$26=$A4)*TEXT(W$2:W$26,\"0;;0;\\0\")*ISNUMBER(MATCH(LOOKUP(ROW($2:$26),ROW($2:$26)/($B$2:$B$26<>\"\"),$B$2:$B$26),IF(SUBTOTAL(3,INDIRECT(\"Svod!A\"&ROW(Svod!$4:$8))),Svod!$A$4:$A$8),))),\"\")","v":126},{"$f":"IF((X$1>=Svod!$B$2)*(X$1<=Svod!$C$2),SUMPRODUCT(($A$2:$A$26=$A4)*TEXT(X$2:X$26,\"0;;0;\\0\")*ISNUMBER(MATCH(LOOKUP(ROW($2:$26),ROW($2:$26)/($B$2:$B$26<>\"\"),$B$2:$B$26),IF(SUBTOTAL(3,INDIRECT(\"Svod!A\"&ROW(Svod!$4:$8))),Svod!$A$4:$A$8),))),\"\")","v":141},{"$f":"IF((Y$1>=Svod!$B$2)*(Y$1<=Svod!$C$2),SUMPRODUCT(($A$2:$A$26=$A4)*TEXT(Y$2:Y$26,\"0;;0;\\0\")*ISNUMBER(MATCH(LOOKUP(ROW($2:$26),ROW($2:$26)/($B$2:$B$26<>\"\"),$B$2:$B$26),IF(SUBTOTAL(3,INDIRECT(\"Svod!A\"&ROW(Svod!$4:$8))),Svod!$A$4:$A$8),))),\"\")","v":76},{"$f":"IF((Z$1>=Svod!$B$2)*(Z$1<=Svod!$C$2),SUMPRODUCT(($A$2:$A$26=$A4)*TEXT(Z$2:Z$26,\"0;;0;\\0\")*ISNUMBER(MATCH(LOOKUP(ROW($2:$26),ROW($2:$26)/($B$2:$B$26<>\"\"),$B$2:$B$26),IF(SUBTOTAL(3,INDIRECT(\"Svod!A\"&ROW(Svod!$4:$8))),Svod!$A$4:$A$8),))),\"\")","v":110}]
{"$rows_left_out":3}
{"sheet":"Лист3","index":2,"n_rows":0,"n_cols":0,"rows_kept":0,"cut":false,"hidden":false,"merged":[]}