{"text_format":"1","workbook":"xlsx","n_sheets":2,"sheets":["Калькулятор","К1"],"not_rendered":{"charts":0,"images":0,"macros":1,"external_links":0,"defined_names":46,"comments":1,"pivot_tables":0},"unopened":[],"bounds":{"document_bytes":16777216,"sheet_cells":100000,"rows_first":2000,"rows_last":500,"rows_between":2000,"halvings":0,"cell_chars":16384,"cell_head_chars":4096},"cells_cut":0,"cells_raw":0,"read":"whole","date_system":"1900"}

{"sheet":"Калькулятор","index":0,"n_rows":17,"n_cols":10,"rows_kept":17,"cut":false,"hidden":false,"merged":[[1,1,1,2],[18,2,19,4]]}
[null,"Показатель","Фактор","ПК, ОДО","ПК, ФР"]
[null,"ПК - К1 (наибольший из всех факторов):",null,{"$f":"MAX(D3:D17)","v":2.5},{"$f":"MAX(E3:E17)","v":3}]
[null,{"$f":"К1!M2","v":"Срок регистрации"},"более 5 лет",1,1,null,{"$f":"CONCATENATE(B3,\"+\",C3,\"+\",$D$1)","v":"Срок регистрации+более 5 лет+ПК, ОДО"},{"$f":"CONCATENATE(B3,\"+\",C3,\"+\",$E$1)","v":"Срок регистрации+более 5 лет+ПК, ФР"},{"$f":"VLOOKUP(G3,К1!$C$2:$D$85,2,0)","v":"ОДО_1.1"},{"$f":"VLOOKUP(H3,К1!$F$2:$G$85,2,0)","v":"ФР_1.1"}]
[null,{"$f":"К1!M4","v":"Наличие, количество и статус исполнения контрактов"},"контракты ранее заключались, часть из них исполнена раньше срока",null,null,null,{"$f":"CONCATENATE(B4,\"+\",C4,\"+\",$D$1)","v":"Наличие, количество и статус исполнения контрактов+контракты ранее заключались, часть из них исполнена раньше срока+ПК, ОДО"},"Наличие, количество и статус исполнения контрактов+контракты ранее заключались, часть из них исполнена раньше срока+ПК, ФР",{"$f":"VLOOKUP(G4,К1!$C$2:$D$85,2,0)","v":"ОДО_1.4"},{"$f":"VLOOKUP(H4,К1!$F$2:$G$85,2,0)","v":"ФР_1.4"}]
[null,{"$f":"К1!M6","v":"Срок регистрации"},"менее 2-лет",2.5,3,null,{"$f":"CONCATENATE(B5,\"+\",C5,\"+\",$D$1)","v":"Срок регистрации+менее 2-лет+ПК, ОДО"},"Срок регистрации+менее 2-лет+ПК, ФР",{"$f":"VLOOKUP(G5,К1!$C$2:$D$85,2,0)","v":"ОДО_1.5"},{"$f":"VLOOKUP(H5,К1!$F$2:$G$85,2,0)","v":"ФР_1.5"}]
[null,{"$f":"К1!M7","v":"Реорганизация организации"},"реорганизация была произведена ранее",null,null,null,{"$f":"CONCATENATE(B6,\"+\",C6,\"+\",$D$1)","v":"Реорганизация организации+реорганизация была произведена ранее+ПК, ОДО"},"Реорганизация организации+реорганизация была произведена ранее+ПК, ФР",{"$f":"VLOOKUP(G6,К1!$C$2:$D$85,2,0)","v":"ОДО_1.6"},{"$f":"VLOOKUP(H6,К1!$F$2:$G$85,2,0)","v":"ФР_1.6"}]
[null,{"$f":"К1!M9","v":"Заблокированные банковские счета"},"есть",1,1,null,{"$f":"CONCATENATE(B7,\"+\",C7,\"+\",$D$1)","v":"Заблокированные банковские счета+есть+ПК, ОДО"},"Заблокированные банковские счета+есть+ПК, ФР",{"$f":"VLOOKUP(G7,К1!$C$2:$D$85,2,0)","v":"ОДО_1.8"},{"$f":"VLOOKUP(H7,К1!$F$2:$G$85,2,0)","v":"ФР_1.8"}]
[null,{"$f":"К1!M10","v":"Информация о Генеральном директоре"},"массовый директор",1,{"$f":"D8","v":1},null,{"$f":"CONCATENATE(B8,\"+\",C8,\"+\",$D$1)","v":"Информация о Генеральном директоре+массовый директор+ПК, ОДО"},{"$f":"CONCATENATE(B8,\"+\",C8,\"+\",$E$1)","v":"Информация о Генеральном директоре+массовый директор+ПК, ФР"},{"$f":"VLOOKUP(G8,К1!$C$2:$D$85,2,0)","v":"ОДО_1.9"},{"$f":"VLOOKUP(H8,К1!$F$2:$G$85,2,0)","v":"ФР_1.9"}]
[null,{"$f":"К1!M12","v":"Информация о собственнике"},"массовый совладелец",1,1,null,"Информация о собственнике+массовый совладелец+ПК, ОДО","Информация о собственнике+массовый совладелец+ПК, ФР",{"$f":"VLOOKUP(G9,К1!$C$2:$D$85,2,0)","v":"ОДО_1.11"},{"$f":"VLOOKUP(H9,К1!$F$2:$G$85,2,0)","v":"ФР_1.11"}]
[null,{"$f":"К1!M14","v":"Несвоевременная сдача финансовой или бухгалтерской отчетности"},"да",1.5,1.5,null,"Несвоевременная сдача финансовой или бухгалтерской отчетности+да+ПК, ОДО","Несвоевременная сдача финансовой или бухгалтерской отчетности+да+ПК, ФР",{"$f":"VLOOKUP(G10,К1!$C$2:$D$85,2,0)","v":"ОДО_1.13"},{"$f":"VLOOKUP(H10,К1!$F$2:$G$85,2,0)","v":"ФР_1.13"}]
[null,{"$f":"К1!M15","v":"Наличие, количество и статус исполнения контрактов"},"контракты ранее не заключались",null,null,null,"Наличие, количество и статус исполнения контрактов+контракты ранее не заключались+ПК, ОДО","Наличие, количество и статус исполнения контрактов+контракты ранее не заключались+ПК, ФР",{"$f":"VLOOKUP(G11,К1!$C$2:$D$85,2,0)","v":"ОДО_1.14"},{"$f":"VLOOKUP(H11,К1!$F$2:$G$85,2,0)","v":"ФР_1.14"}]
[null,{"$f":"К1!M19","v":"Судебные иски"},"завершенные дела по искам в качестве ответчика по делам, связанным с неисполнением контрактов",2,2.5,null,"Судебные иски+завершенные дела по искам в качестве ответчика по делам, связанным с неисполнением контрактов+ПК, ОДО","Судебные иски+завершенные дела по искам в качестве ответчика по делам, связанным с неисполнением контрактов+ПК, ФР",{"$f":"VLOOKUP(G12,К1!$C$2:$D$85,2,0)","v":"ОДО_1.18"},{"$f":"VLOOKUP(H12,К1!$F$2:$G$85,2,0)","v":"ФР_1.18"}]
[null,{"$f":"К1!M20","v":"Исполнительные производства"},"есть незакрытые",1.1000000000000001,1.1000000000000001,null,"Исполнительные производства+есть незакрытые+ПК, ОДО","Исполнительные производства+есть незакрытые+ПК, ФР",{"$f":"VLOOKUP(G13,К1!$C$2:$D$85,2,0)","v":"ОДО_1.19"},{"$f":"VLOOKUP(H13,К1!$F$2:$G$85,2,0)","v":"ФР_1.19"}]
[null,{"$f":"К1!M21","v":"Регион местонахождения контрагента"},"Регионы Северного Кавказа, г. Казань",1,{"$f":"D14","v":1},null,"Регион местонахождения контрагента+Регионы Северного Кавказа, г. Казань+ПК, ОДО","Регион местонахождения контрагента+Регионы Северного Кавказа, г. Казань+ПК, ФР",{"$f":"VLOOKUP(G14,К1!$C$2:$D$85,2,0)","v":"ОДО_1.20"},{"$f":"VLOOKUP(H14,К1!$F$2:$G$85,2,0)","v":"ФР_1.20"}]
[null,{"$f":"К1!M22","v":"Регулярное снижение стоимости заключаемых контрактов по сравнению с их первоначальной стоимостью"},"да",1,1,null,"Регулярное снижение стоимости заключаемых контрактов по сравнению с их первоначальной стоимостью+да+ПК, ОДО","Регулярное снижение стоимости заключаемых контрактов по сравнению с их первоначальной стоимостью+да+ПК, ФР",{"$f":"VLOOKUP(G15,К1!$C$2:$D$85,2,0)","v":"ОДО_1.21"},{"$f":"VLOOKUP(H15,К1!$F$2:$G$85,2,0)","v":"ФР_1.21"}]
[null,{"$f":"К1!M23","v":"Заключение Контракта по результатам конкурса, признанного несостоявшимся"},"да",1,1,null,"Заключение Контракта по результатам конкурса, признанного несостоявшимся+да+ПК, ОДО","Заключение Контракта по результатам конкурса, признанного несостоявшимся+да+ПК, ФР",{"$f":"VLOOKUP(G16,К1!$C$2:$D$85,2,0)","v":"ОДО_1.22"},{"$f":"VLOOKUP(H16,К1!$F$2:$G$85,2,0)","v":"ФР_1.22"}]
[null,{"$f":"К1!M24","v":"Количество действующих (незавершенных) контрактов"},"более 5",1,1,null,"Количество действующих (незавершенных) контрактов+более 5+ПК, ОДО","Количество действующих (незавершенных) контрактов+более 5+ПК, ФР",{"$f":"VLOOKUP(G17,К1!$C$2:$D$85,2,0)","v":"ОДО_1.23"},{"$f":"VLOOKUP(H17,К1!$F$2:$G$85,2,0)","v":"ФР_1.23"}]

{"sheet":"К1","index":1,"n_rows":85,"n_cols":15,"rows_kept":85,"cut":false,"hidden":false,"merged":[]}
["Показатель","Фактор страхового риска","СЦЕП+ОДО","Имя ОДО","ПК, ОДО","СЦЕП+ФР","Имя ФР","ПК, ФР",null,null,null,null,"Показатель","Фактор страхового риска","Имя ОДО"]
["Срок регистрации","более 5 лет",{"$f":"CONCATENATE(A2,\"+\",B2,\"+\",$E$1)","v":"Срок регистрации+более 5 лет+ПК, ОДО"},"ОДО_1.1",0.8,{"$f":"CONCATENATE(A2,\"+\",B2,\"+\",$H$1)","v":"Срок регистрации+более 5 лет+ПК, ФР"},"ФР_1.1",0.8,null,null,null,null,"Срок регистрации","более 5 лет","ОДО_1.1"]
["Срок регистрации","более 5 лет",{"$f":"CONCATENATE(A3,\"+\",B3,\"+\",$E$1)","v":"Срок регистрации+более 5 лет+ПК, ОДО"},"ОДО_1.1",0.9,{"$f":"CONCATENATE(A3,\"+\",B3,\"+\",$H$1)","v":"Срок регистрации+более 5 лет+ПК, ФР"},"ФР_1.1",0.9,null,null,null,null,"Срок регистрации","более 10 лет","ОДО_1.2"]
["Срок регистрации","более 5 лет","Срок регистрации+более 5 лет+ПК, ОДО","ОДО_1.1",1,"Срок регистрации+более 5 лет+ПК, ФР","ФР_1.1",1,null,null,null,null,"Наличие, количество и статус исполнения контрактов","контракты ранее заключались и все были исполнены в срок","ОДО_1.3"]
["Срок регистрации","более 10 лет","Срок регистрации+более 10 лет+ПК, ОДО","ОДО_1.2",0.7,"Срок регистрации+более 10 лет+ПК, ФР","ФР_1.2",0.7,null,null,null,null,"Наличие, количество и статус исполнения контрактов","контракты ранее заключались, часть из них исполнена раньше срока","ОДО_1.4"]
["Срок регистрации","более 10 лет","Срок регистрации+более 10 лет+ПК, ОДО","ОДО_1.2",0.8,"Срок регистрации+более 10 лет+ПК, ФР","ФР_1.2",0.8,null,null,null,null,"Срок регистрации","менее 2-лет","ОДО_1.5"]
["Срок регистрации","более 10 лет","Срок регистрации+более 10 лет+ПК, ОДО","ОДО_1.2",0.9,"Срок регистрации+более 10 лет+ПК, ФР","ФР_1.2",0.9,null,null,null,null,"Реорганизация организации","реорганизация была произведена ранее","ОДО_1.6"]
["Срок регистрации","более 10 лет","Срок регистрации+более 10 лет+ПК, ОДО","ОДО_1.2",1,"Срок регистрации+более 10 лет+ПК, ФР","ФР_1.2",1,null,null,null,null,"Реорганизация организации","в процессе реорганизации","ОДО_1.7"]
["Наличие, количество и статус исполнения контрактов","контракты ранее заключались и все были исполнены в срок","Наличие, количество и статус исполнения контрактов+контракты ранее заключались и все были исполнены в срок+ПК, ОДО","ОДО_1.3",0.8,"Наличие, количество и статус исполнения контрактов+контракты ранее заключались и все были исполнены в срок+ПК, ФР","ФР_1.3",0.8,null,null,null,null,"Заблокированные банковские счета","есть","ОДО_1.8"]
["Наличие, количество и статус исполнения контрактов","контракты ранее заключались и все были исполнены в срок","Наличие, количество и статус исполнения контрактов+контракты ранее заключались и все были исполнены в срок+ПК, ОДО","ОДО_1.3",0.9,"Наличие, количество и статус исполнения контрактов+контракты ранее заключались и все были исполнены в срок+ПК, ФР","ФР_1.3",0.9,null,null,null,null,"Информация о Генеральном директоре","массовый директор","ОДО_1.9"]
["Наличие, количество и статус исполнения контрактов","контракты ранее заключались и все были исполнены в срок","Наличие, количество и статус исполнения контрактов+контракты ранее заключались и все были исполнены в срок+ПК, ОДО","ОДО_1.3",1,"Наличие, количество и статус исполнения контрактов+контракты ранее заключались и все были исполнены в срок+ПК, ФР","ФР_1.3",1,null,null,null,null,"Информация о Генеральном директоре","входит в список дисквалифицированных лиц","ОДО_1.10"]
["Наличие, количество и статус исполнения контрактов","контракты ранее заключались, часть из них исполнена раньше срока","Наличие, количество и статус исполнения контрактов+контракты ранее заключались, часть из них исполнена раньше срока+ПК, ОДО","ОДО_1.4",0.75,"Наличие, количество и статус исполнения контрактов+контракты ранее заключались, часть из них исполнена раньше срока+ПК, ФР","ФР_1.4",0.75,null,null,null,null,"Информация о собственнике","массовый совладелец","ОДО_1.11"]
["Наличие, количество и статус исполнения контрактов","контракты ранее заключались, часть из них исполнена раньше срока","Наличие, количество и статус исполнения контрактов+контракты ранее заключались, часть из них исполнена раньше срока+ПК, ОДО","ОДО_1.4",0.8,"Наличие, количество и статус исполнения контрактов+контракты ранее заключались, часть из них исполнена раньше срока+ПК, ФР","ФР_1.4",0.8,null,null,null,null,"Информация о собственнике","входит в список дисквалифицированных лиц","ОДО_1.12"]
["Наличие, количество и статус исполнения контрактов","контракты ранее заключались, часть из них исполнена раньше срока","Наличие, количество и статус исполнения контрактов+контракты ранее заключались, часть из них исполнена раньше срока+ПК, ОДО","ОДО_1.4",0.85,"Наличие, количество и статус исполнения контрактов+контракты ранее заключались, часть из них исполнена раньше срока+ПК, ФР","ФР_1.4",0.85,null,null,null,null,"Несвоевременная сдача финансовой или бухгалтерской отчетности","да","ОДО_1.13"]
["Наличие, количество и статус исполнения контрактов","контракты ранее заключались, часть из них исполнена раньше срока","Наличие, количество и статус исполнения контрактов+контракты ранее заключались, часть из них исполнена раньше срока+ПК, ОДО","ОДО_1.4",0.9,"Наличие, количество и статус исполнения контрактов+контракты ранее заключались, часть из них исполнена раньше срока+ПК, ФР","ФР_1.4",0.9,null,null,null,null,"Наличие, количество и статус исполнения контрактов","контракты ранее не заключались","ОДО_1.14"]
["Наличие, количество и статус исполнения контрактов","контракты ранее заключались, часть из них исполнена раньше срока","Наличие, количество и статус исполнения контрактов+контракты ранее заключались, часть из них исполнена раньше срока+ПК, ОДО","ОДО_1.4",0.95,"Наличие, количество и статус исполнения контрактов+контракты ранее заключались, часть из них исполнена раньше срока+ПК, ФР","ФР_1.4",0.95,null,null,null,null,"Наличие, количество и статус исполнения контрактов","ранее были контракты, неисполненные в срок","ОДО_1.15"]
["Наличие, количество и статус исполнения контрактов","контракты ранее заключались, часть из них исполнена раньше срока","Наличие, количество и статус исполнения контрактов+контракты ранее заключались, часть из них исполнена раньше срока+ПК, ОДО","ОДО_1.4",1,"Наличие, количество и статус исполнения контрактов+контракты ранее заключались, часть из них исполнена раньше срока+ПК, ФР","ФР_1.4",1,null,null,null,null,"Наличие, количество и статус исполнения контрактов","основная часть контрактов заключена с одним заказчиком","ОДО_1.16"]
["Срок регистрации","менее 2-лет","Срок регистрации+менее 2-лет+ПК, ОДО","ОДО_1.5",1,"Срок регистрации+менее 2-лет+ПК, ФР","ФР_1.5",1,null,null,null,null,"Наличие, количество и статус исполнения контрактов","контракт заключен с данным заказчиком впервые","ОДО_1.17"]
["Срок регистрации","менее 2-лет","Срок регистрации+менее 2-лет+ПК, ОДО","ОДО_1.5",1.5,"Срок регистрации+менее 2-лет+ПК, ФР","ФР_1.5",1.5,null,null,null,null,"Судебные иски","завершенные дела по искам в качестве ответчика по делам, связанным с неисполнением контрактов","ОДО_1.18"]
["Срок регистрации","менее 2-лет","Срок регистрации+менее 2-лет+ПК, ОДО","ОДО_1.5",2,"Срок регистрации+менее 2-лет+ПК, ФР","ФР_1.5",2,null,null,null,null,"Исполнительные производства","есть незакрытые","ОДО_1.19"]
["Срок регистрации","менее 2-лет","Срок регистрации+менее 2-лет+ПК, ОДО","ОДО_1.5",2.5,"Срок регистрации+менее 2-лет+ПК, ФР","ФР_1.5",2.5,null,null,null,null,"Регион местонахождения контрагента","Регионы Северного Кавказа, г. Казань","ОДО_1.20"]
["Срок регистрации","менее 2-лет","Срок регистрации+менее 2-лет+ПК, ОДО","ОДО_1.5",3,"Срок регистрации+менее 2-лет+ПК, ФР","ФР_1.5",3,null,null,null,null,"Регулярное снижение стоимости заключаемых контрактов по сравнению с их первоначальной стоимостью","да","ОДО_1.21"]
["Реорганизация организации","реорганизация была произведена ранее","Реорганизация организации+реорганизация была произведена ранее+ПК, ОДО","ОДО_1.6",1,"Реорганизация организации+реорганизация была произведена ранее+ПК, ФР","ФР_1.6",1,null,null,null,null,"Заключение Контракта по результатам конкурса, признанного несостоявшимся","да","ОДО_1.22"]
["Реорганизация организации","реорганизация была произведена ранее","Реорганизация организации+реорганизация была произведена ранее+ПК, ОДО","ОДО_1.6",1.5,"Реорганизация организации+реорганизация была произведена ранее+ПК, ФР","ФР_1.6",1.5,null,null,null,null,"Количество действующих (незавершенных) контрактов","более 5","ОДО_1.23"]
["Реорганизация организации","реорганизация была произведена ранее","Реорганизация организации+реорганизация была произведена ранее+ПК, ОДО","ОДО_1.6",2,"Реорганизация организации+реорганизация была произведена ранее+ПК, ФР","ФР_1.6",2]
["Реорганизация организации","в процессе реорганизации","Реорганизация организации+в процессе реорганизации+ПК, ОДО","ОДО_1.7",1,"Реорганизация организации+в процессе реорганизации+ПК, ФР","ФР_1.7",1]
["Реорганизация организации","в процессе реорганизации","Реорганизация организации+в процессе реорганизации+ПК, ОДО","ОДО_1.7",1.5,"Реорганизация организации+в процессе реорганизации+ПК, ФР","ФР_1.7",1.5]
["Реорганизация организации","в процессе реорганизации","Реорганизация организации+в процессе реорганизации+ПК, ОДО","ОДО_1.7",2,"Реорганизация организации+в процессе реорганизации+ПК, ФР","ФР_1.7",2]
["Заблокированные банковские счета","есть","Заблокированные банковские счета+есть+ПК, ОДО","ОДО_1.8",1,"Заблокированные банковские счета+есть+ПК, ФР","ФР_1.8",1]
["Заблокированные банковские счета","есть","Заблокированные банковские счета+есть+ПК, ОДО","ОДО_1.8",1.5,"Заблокированные банковские счета+есть+ПК, ФР","ФР_1.8",1.5]
["Заблокированные банковские счета","есть","Заблокированные банковские счета+есть+ПК, ОДО","ОДО_1.8",2,"Заблокированные банковские счета+есть+ПК, ФР","ФР_1.8",2]
["Информация о Генеральном директоре","массовый директор","Информация о Генеральном директоре+массовый директор+ПК, ОДО","ОДО_1.9",1,"Информация о Генеральном директоре+массовый директор+ПК, ФР","ФР_1.9",1]
["Информация о Генеральном директоре","массовый директор","Информация о Генеральном директоре+массовый директор+ПК, ОДО","ОДО_1.9",1.5,"Информация о Генеральном директоре+массовый директор+ПК, ФР","ФР_1.9",1.5]
["Информация о Генеральном директоре","массовый директор","Информация о Генеральном директоре+массовый директор+ПК, ОДО","ОДО_1.9",2,"Информация о Генеральном директоре+массовый директор+ПК, ФР","ФР_1.9",2]
["Информация о Генеральном директоре","входит в список дисквалифицированных лиц","Информация о Генеральном директоре+входит в список дисквалифицированных лиц+ПК, ОДО","ОДО_1.10",1.5,"Информация о Генеральном директоре+входит в список дисквалифицированных лиц+ПК, ФР","ФР_1.10",1.5]
["Информация о Генеральном директоре","входит в список дисквалифицированных лиц","Информация о Генеральном директоре+входит в список дисквалифицированных лиц+ПК, ОДО","ОДО_1.10",2,"Информация о Генеральном директоре+входит в список дисквалифицированных лиц+ПК, ФР","ФР_1.10",2]
["Информация о Генеральном директоре","входит в список дисквалифицированных лиц","Информация о Генеральном директоре+входит в список дисквалифицированных лиц+ПК, ОДО","ОДО_1.10",2.5,"Информация о Генеральном директоре+входит в список дисквалифицированных лиц+ПК, ФР","ФР_1.10",2.5]
["Информация о собственнике","массовый совладелец","Информация о собственнике+массовый совладелец+ПК, ОДО","ОДО_1.11",1,"Информация о собственнике+массовый совладелец+ПК, ФР","ФР_1.11",1]
["Информация о собственнике","массовый совладелец","Информация о собственнике+массовый совладелец+ПК, ОДО","ОДО_1.11",1.5,"Информация о собственнике+массовый совладелец+ПК, ФР","ФР_1.11",1.5]
["Информация о собственнике","массовый совладелец","Информация о собственнике+массовый совладелец+ПК, ОДО","ОДО_1.11",2,"Информация о собственнике+массовый совладелец+ПК, ФР","ФР_1.11",2]
["Информация о собственнике","входит в список дисквалифицированных лиц","Информация о собственнике+входит в список дисквалифицированных лиц+ПК, ОДО","ОДО_1.12",1.5,"Информация о собственнике+входит в список дисквалифицированных лиц+ПК, ФР","ФР_1.12",1.5]
["Информация о собственнике","входит в список дисквалифицированных лиц","Информация о собственнике+входит в список дисквалифицированных лиц+ПК, ОДО","ОДО_1.12",2,"Информация о собственнике+входит в список дисквалифицированных лиц+ПК, ФР","ФР_1.12",2]
["Информация о собственнике","входит в список дисквалифицированных лиц","Информация о собственнике+входит в список дисквалифицированных лиц+ПК, ОДО","ОДО_1.12",2.5,"Информация о собственнике+входит в список дисквалифицированных лиц+ПК, ФР","ФР_1.12",2.5]
["Несвоевременная сдача финансовой или бухгалтерской отчетности","да","Несвоевременная сдача финансовой или бухгалтерской отчетности+да+ПК, ОДО","ОДО_1.13",1,"Несвоевременная сдача финансовой или бухгалтерской отчетности+да+ПК, ФР","ФР_1.13",1]
["Несвоевременная сдача финансовой или бухгалтерской отчетности","да","Несвоевременная сдача финансовой или бухгалтерской отчетности+да+ПК, ОДО","ОДО_1.13",1.5,"Несвоевременная сдача финансовой или бухгалтерской отчетности+да+ПК, ФР","ФР_1.13",1.5]
["Несвоевременная сдача финансовой или бухгалтерской отчетности","да","Несвоевременная сдача финансовой или бухгалтерской отчетности+да+ПК, ОДО","ОДО_1.13",2,"Несвоевременная сдача финансовой или бухгалтерской отчетности+да+ПК, ФР","ФР_1.13",2]
["Наличие, количество и статус исполнения контрактов","контракты ранее не заключались","Наличие, количество и статус исполнения контрактов+контракты ранее не заключались+ПК, ОДО","ОДО_1.14",1,"Наличие, количество и статус исполнения контрактов+контракты ранее не заключались+ПК, ФР","ФР_1.14",1]
["Наличие, количество и статус исполнения контрактов","контракты ранее не заключались","Наличие, количество и статус исполнения контрактов+контракты ранее не заключались+ПК, ОДО","ОДО_1.14",1.5,"Наличие, количество и статус исполнения контрактов+контракты ранее не заключались+ПК, ФР","ФР_1.14",1.5]
["Наличие, количество и статус исполнения контрактов","контракты ранее не заключались","Наличие, количество и статус исполнения контрактов+контракты ранее не заключались+ПК, ОДО","ОДО_1.14",2,"Наличие, количество и статус исполнения контрактов+контракты ранее не заключались+ПК, ФР","ФР_1.14",2]
["Наличие, количество и статус исполнения контрактов","ранее были контракты, неисполненные в срок","Наличие, количество и статус исполнения контрактов+ранее были контракты, неисполненные в срок+ПК, ОДО","ОДО_1.15",1.1000000000000001,"Наличие, количество и статус исполнения контрактов+ранее были контракты, неисполненные в срок+ПК, ФР","ФР_1.15",1.1000000000000001]
["Наличие, количество и статус исполнения контрактов","ранее были контракты, неисполненные в срок","Наличие, количество и статус исполнения контрактов+ранее были контракты, неисполненные в срок+ПК, ОДО","ОДО_1.15",1.5,"Наличие, количество и статус исполнения контрактов+ранее были контракты, неисполненные в срок+ПК, ФР","ФР_1.15",1.5]
["Наличие, количество и статус исполнения контрактов","ранее были контракты, неисполненные в срок","Наличие, количество и статус исполнения контрактов+ранее были контракты, неисполненные в срок+ПК, ОДО","ОДО_1.15",2,"Наличие, количество и статус исполнения контрактов+ранее были контракты, неисполненные в срок+ПК, ФР","ФР_1.15",2]
["Наличие, количество и статус исполнения контрактов","ранее были контракты, неисполненные в срок","Наличие, количество и статус исполнения контрактов+ранее были контракты, неисполненные в срок+ПК, ОДО","ОДО_1.15",2.5,"Наличие, количество и статус исполнения контрактов+ранее были контракты, неисполненные в срок+ПК, ФР","ФР_1.15",2.5]
["Наличие, количество и статус исполнения контрактов","ранее были контракты, неисполненные в срок","Наличие, количество и статус исполнения контрактов+ранее были контракты, неисполненные в срок+ПК, ОДО","ОДО_1.15",3,"Наличие, количество и статус исполнения контрактов+ранее были контракты, неисполненные в срок+ПК, ФР","ФР_1.15",3]
["Наличие, количество и статус исполнения контрактов","основная часть контрактов заключена с одним заказчиком","Наличие, количество и статус исполнения контрактов+основная часть контрактов заключена с одним заказчиком+ПК, ОДО","ОДО_1.16",1,"Наличие, количество и статус исполнения контрактов+основная часть контрактов заключена с одним заказчиком+ПК, ФР","ФР_1.16",1]
["Наличие, количество и статус исполнения контрактов","основная часть контрактов заключена с одним заказчиком","Наличие, количество и статус исполнения контрактов+основная часть контрактов заключена с одним заказчиком+ПК, ОДО","ОДО_1.16",1.5,"Наличие, количество и статус исполнения контрактов+основная часть контрактов заключена с одним заказчиком+ПК, ФР","ФР_1.16",1.5]
["Наличие, количество и статус исполнения контрактов","основная часть контрактов заключена с одним заказчиком","Наличие, количество и статус исполнения контрактов+основная часть контрактов заключена с одним заказчиком+ПК, ОДО","ОДО_1.16",2,"Наличие, количество и статус исполнения контрактов+основная часть контрактов заключена с одним заказчиком+ПК, ФР","ФР_1.16",2]
["Наличие, количество и статус исполнения контрактов","контракт заключен с данным заказчиком впервые","Наличие, количество и статус исполнения контрактов+контракт заключен с данным заказчиком впервые+ПК, ОДО","ОДО_1.17",1,"Наличие, количество и статус исполнения контрактов+контракт заключен с данным заказчиком впервые+ПК, ФР","ФР_1.17",1]
["Наличие, количество и статус исполнения контрактов","контракт заключен с данным заказчиком впервые","Наличие, количество и статус исполнения контрактов+контракт заключен с данным заказчиком впервые+ПК, ОДО","ОДО_1.17",1.5,"Наличие, количество и статус исполнения контрактов+контракт заключен с данным заказчиком впервые+ПК, ФР","ФР_1.17",1.5]
["Наличие, количество и статус исполнения контрактов","контракт заключен с данным заказчиком впервые","Наличие, количество и статус исполнения контрактов+контракт заключен с данным заказчиком впервые+ПК, ОДО","ОДО_1.17",2,"Наличие, количество и статус исполнения контрактов+контракт заключен с данным заказчиком впервые+ПК, ФР","ФР_1.17",2]
{"$rows_left_out":25}