{"text_format":"1","workbook":"xlsx","n_sheets":2,"sheets":["НКУ","остальные сборочки"],"not_rendered":{"charts":0,"images":0,"macros":1,"external_links":0,"defined_names":2,"comments":0,"pivot_tables":0},"unopened":[],"bounds":{"document_bytes":16777216,"sheet_cells":100000,"rows_first":2000,"rows_last":500,"rows_between":2000,"halvings":0,"cell_chars":16384,"cell_head_chars":4096},"cells_cut":0,"cells_raw":0,"read":"whole","date_system":"1900"}

{"sheet":"НКУ","index":0,"n_rows":1113,"n_cols":30,"rows_kept":1113,"cut":false,"hidden":false,"merged":[]}
["КодKKS",null,null,null,null,null,null,null,null,null,null,null,null,null,null,null,null,null,null,null,null,null,"здесь в реальной таблице текстовые данные большой длины (до 100-200 символов)"]
[1,2,3,4,5,6,7,8,9,10,11,12,13,14,15,16,17,18,19,20,21,22,23,24,25,26,27,28,29,30]
["Яхрома",null,null,null,null,null,null,null,null,null,null,null,null,null,null,null,null,null,null,null,null,null,null,{"$f":"MATCH(W3,'остальные сборочки'!W$3:W$1113,0)","v":{"$error":"#N/A"}}]
["Ясный",null,null,null,null,null,null,null,null,null,null,null,null,null,null,null,null,null,null,null,null,null,null,{"$f":"MATCH(W4,'остальные сборочки'!W$3:W$1113,0)","v":{"$error":"#N/A"}}]
["Ясногорск",null,null,null,null,null,null,null,null,null,null,null,null,null,null,null,null,null,null,null,null,null,null,{"$f":"MATCH(W5,'остальные сборочки'!W$3:W$1113,0)","v":{"$error":"#N/A"}}]
["Ярцево",null,null,null,null,null,null,null,null,null,null,null,null,null,null,null,null,null,null,null,null,null,null,{"$f":"MATCH(W6,'остальные сборочки'!W$3:W$1113,0)","v":{"$error":"#N/A"}}]
["Ярославль",null,null,null,null,null,null,null,null,null,null,null,null,null,null,null,null,null,null,null,null,null,null,{"$f":"MATCH(W7,'остальные сборочки'!W$3:W$1113,0)","v":{"$error":"#N/A"}}]
["Яровое",null,null,null,null,null,null,null,null,null,null,null,null,null,null,null,null,null,null,null,null,null,null,{"$f":"MATCH(W8,'остальные сборочки'!W$3:W$1113,0)","v":{"$error":"#N/A"}}]
["Яранск",null,null,null,null,null,null,null,null,null,null,null,null,null,null,null,null,null,null,null,null,null,null,{"$f":"MATCH(W9,'остальные сборочки'!W$3:W$1113,0)","v":{"$error":"#N/A"}}]
["Янаул",null,null,null,null,null,null,null,null,null,null,null,null,null,null,null,null,null,null,null,null,null,null,{"$f":"MATCH(W10,'остальные сборочки'!W$3:W$1113,0)","v":{"$error":"#N/A"}}]
["Ялуторовск",null,null,null,null,null,null,null,null,null,null,null,null,null,null,null,null,null,null,null,null,null,null,{"$f":"MATCH(W11,'остальные сборочки'!W$3:W$1113,0)","v":{"$error":"#N/A"}}]
["Ялта",null,null,null,null,null,null,null,null,null,null,null,null,null,null,null,null,null,null,null,null,null,null,{"$f":"MATCH(W12,'остальные сборочки'!W$3:W$1113,0)","v":{"$error":"#N/A"}}]
["Якутск",null,null,null,null,null,null,null,null,null,null,null,null,null,null,null,null,null,null,null,null,null,null,{"$f":"MATCH(W13,'остальные сборочки'!W$3:W$1113,0)","v":{"$error":"#N/A"}}]
["Ядрин",null,null,null,null,null,null,null,null,null,null,null,null,null,null,null,null,null,null,null,null,null,null,{"$f":"MATCH(W14,'остальные сборочки'!W$3:W$1113,0)","v":{"$error":"#N/A"}}]
["Юхнов",null,null,null,null,null,null,null,null,null,null,null,null,null,null,null,null,null,null,null,null,null,null,{"$f":"MATCH(W15,'остальные сборочки'!W$3:W$1113,0)","v":{"$error":"#N/A"}}]
["Юрюзань",null,null,null,null,null,null,null,null,null,null,null,null,null,null,null,null,null,null,null,null,null,null,{"$f":"MATCH(W16,'остальные сборочки'!W$3:W$1113,0)","v":{"$error":"#N/A"}}]
["Юрьев-Польский",null,null,null,null,null,null,null,null,null,null,null,null,null,null,null,null,null,null,null,null,null,null,{"$f":"MATCH(W17,'остальные сборочки'!W$3:W$1113,0)","v":{"$error":"#N/A"}}]
["Юрьевец",null,null,null,null,null,null,null,null,null,null,null,null,null,null,null,null,null,null,null,null,null,null,{"$f":"MATCH(W18,'остальные сборочки'!W$3:W$1113,0)","v":{"$error":"#N/A"}}]
["Юрга",null,null,null,null,null,null,null,null,null,null,null,null,null,null,null,null,null,null,null,null,null,null,{"$f":"MATCH(W19,'остальные сборочки'!W$3:W$1113,0)","v":{"$error":"#N/A"}}]
["Южноуральск",null,null,null,null,null,null,null,null,null,null,null,null,null,null,null,null,null,null,null,null,null,null,{"$f":"MATCH(W20,'остальные сборочки'!W$3:W$1113,0)","v":{"$error":"#N/A"}}]
["Южно-Сухокумск",null,null,null,null,null,null,null,null,null,null,null,null,null,null,null,null,null,null,null,null,null,null,{"$f":"MATCH(W21,'остальные сборочки'!W$3:W$1113,0)","v":{"$error":"#N/A"}}]
["Южно-Сахалинск",null,null,null,null,null,null,null,null,null,null,null,null,null,null,null,null,null,null,null,null,null,null,{"$f":"MATCH(W22,'остальные сборочки'!W$3:W$1113,0)","v":{"$error":"#N/A"}}]
["Южа",null,null,null,null,null,null,null,null,null,null,null,null,null,null,null,null,null,null,null,null,null,null,{"$f":"MATCH(W23,'остальные сборочки'!W$3:W$1113,0)","v":{"$error":"#N/A"}}]
["Югорск",null,null,null,null,null,null,null,null,null,null,null,null,null,null,null,null,null,null,null,null,null,null,{"$f":"MATCH(W24,'остальные сборочки'!W$3:W$1113,0)","v":{"$error":"#N/A"}}]
["Эртиль",null,null,null,null,null,null,null,null,null,null,null,null,null,null,null,null,null,null,null,null,null,null,{"$f":"MATCH(W25,'остальные сборочки'!W$3:W$1113,0)","v":{"$error":"#N/A"}}]
["Энгельс",null,null,null,null,null,null,null,null,null,null,null,null,null,null,null,null,null,null,null,null,null,null,{"$f":"MATCH(W26,'остальные сборочки'!W$3:W$1113,0)","v":{"$error":"#N/A"}}]
["Элиста",null,null,null,null,null,null,null,null,null,null,null,null,null,null,null,null,null,null,null,null,null,null,{"$f":"MATCH(W27,'остальные сборочки'!W$3:W$1113,0)","v":{"$error":"#N/A"}}]
["Электроугли",null,null,null,null,null,null,null,null,null,null,null,null,null,null,null,null,null,null,null,null,null,null,{"$f":"MATCH(W28,'остальные сборочки'!W$3:W$1113,0)","v":{"$error":"#N/A"}}]
["Электросталь",null,null,null,null,null,null,null,null,null,null,null,null,null,null,null,null,null,null,null,null,null,null,{"$f":"MATCH(W29,'остальные сборочки'!W$3:W$1113,0)","v":{"$error":"#N/A"}}]
["Электрогорск",null,null,null,null,null,null,null,null,null,null,null,null,null,null,null,null,null,null,null,null,null,null,{"$f":"MATCH(W30,'остальные сборочки'!W$3:W$1113,0)","v":{"$error":"#N/A"}}]
["Щучье",null,null,null,null,null,null,null,null,null,null,null,null,null,null,null,null,null,null,null,null,null,null,{"$f":"MATCH(W31,'остальные сборочки'!W$3:W$1113,0)","v":{"$error":"#N/A"}}]
["Щигры",null,null,null,null,null,null,null,null,null,null,null,null,null,null,null,null,null,null,null,null,null,null,{"$f":"MATCH(W32,'остальные сборочки'!W$3:W$1113,0)","v":{"$error":"#N/A"}}]
["Щёлково",null,null,null,null,null,null,null,null,null,null,null,null,null,null,null,null,null,null,null,null,null,null,{"$f":"MATCH(W33,'остальные сборочки'!W$3:W$1113,0)","v":{"$error":"#N/A"}}]
["Щёлкино",null,null,null,null,null,null,null,null,null,null,null,null,null,null,null,null,null,null,null,null,null,null,{"$f":"MATCH(W34,'остальные сборочки'!W$3:W$1113,0)","v":{"$error":"#N/A"}}]
["Щёкино",null,null,null,null,null,null,null,null,null,null,null,null,null,null,null,null,null,null,null,null,null,null,{"$f":"MATCH(W35,'остальные сборочки'!W$3:W$1113,0)","v":{"$error":"#N/A"}}]
["Шуя",null,null,null,null,null,null,null,null,null,null,null,null,null,null,null,null,null,null,null,null,null,null,{"$f":"MATCH(W36,'остальные сборочки'!W$3:W$1113,0)","v":{"$error":"#N/A"}}]
["Шумиха",null,null,null,null,null,null,null,null,null,null,null,null,null,null,null,null,null,null,null,null,null,null,{"$f":"MATCH(W37,'остальные сборочки'!W$3:W$1113,0)","v":{"$error":"#N/A"}}]
["Шумерля",null,null,null,null,null,null,null,null,null,null,null,null,null,null,null,null,null,null,null,null,null,null,{"$f":"MATCH(W38,'остальные сборочки'!W$3:W$1113,0)","v":{"$error":"#N/A"}}]
["Шлиссельбург",null,null,null,null,null,null,null,null,null,null,null,null,null,null,null,null,null,null,null,null,null,null,{"$f":"MATCH(W39,'остальные сборочки'!W$3:W$1113,0)","v":{"$error":"#N/A"}}]
["Шиханы",null,null,null,null,null,null,null,null,null,null,null,null,null,null,null,null,null,null,null,null,null,null,{"$f":"MATCH(W40,'остальные сборочки'!W$3:W$1113,0)","v":{"$error":"#N/A"}}]
["Шимановск",null,null,null,null,null,null,null,null,null,null,null,null,null,null,null,null,null,null,null,null,null,null,{"$f":"MATCH(W41,'остальные сборочки'!W$3:W$1113,0)","v":{"$error":"#N/A"}}]
["Шилка",null,null,null,null,null,null,null,null,null,null,null,null,null,null,null,null,null,null,null,null,null,null,{"$f":"MATCH(W42,'остальные сборочки'!W$3:W$1113,0)","v":{"$error":"#N/A"}}]
["Шенкурск",null,null,null,null,null,null,null,null,null,null,null,null,null,null,null,null,null,null,null,null,null,null,{"$f":"MATCH(W43,'остальные сборочки'!W$3:W$1113,0)","v":{"$error":"#N/A"}}]
["Шелехов",null,null,null,null,null,null,null,null,null,null,null,null,null,null,null,null,null,null,null,null,null,null,{"$f":"MATCH(W44,'остальные сборочки'!W$3:W$1113,0)","v":{"$error":"#N/A"}}]
["Шебекино",null,null,null,null,null,null,null,null,null,null,null,null,null,null,null,null,null,null,null,null,null,null,{"$f":"MATCH(W45,'остальные сборочки'!W$3:W$1113,0)","v":{"$error":"#N/A"}}]
["Шацк",null,null,null,null,null,null,null,null,null,null,null,null,null,null,null,null,null,null,null,null,null,null,{"$f":"MATCH(W46,'остальные сборочки'!W$3:W$1113,0)","v":{"$error":"#N/A"}}]
["Шахунья",null,null,null,null,null,null,null,null,null,null,null,null,null,null,null,null,null,null,null,null,null,null,{"$f":"MATCH(W47,'остальные сборочки'!W$3:W$1113,0)","v":{"$error":"#N/A"}}]
["Шахты",null,null,null,null,null,null,null,null,null,null,null,null,null,null,null,null,null,null,null,null,null,null,{"$f":"MATCH(W48,'остальные сборочки'!W$3:W$1113,0)","v":{"$error":"#N/A"}}]
["Шахтёрск",null,null,null,null,null,null,null,null,null,null,null,null,null,null,null,null,null,null,null,null,null,null,{"$f":"MATCH(W49,'остальные сборочки'!W$3:W$1113,0)","v":{"$error":"#N/A"}}]
["Шатура",null,null,null,null,null,null,null,null,null,null,null,null,null,null,null,null,null,null,null,null,null,null,{"$f":"MATCH(W50,'остальные сборочки'!W$3:W$1113,0)","v":{"$error":"#N/A"}}]
["Шарья",null,null,null,null,null,null,null,null,null,null,null,null,null,null,null,null,null,null,null,null,null,null,{"$f":"MATCH(W51,'остальные сборочки'!W$3:W$1113,0)","v":{"$error":"#N/A"}}]
["Шарыпово",null,null,null,null,null,null,null,null,null,null,null,null,null,null,null,null,null,null,null,null,null,null,{"$f":"MATCH(W52,'остальные сборочки'!W$3:W$1113,0)","v":{"$error":"#N/A"}}]
["Шали",null,null,null,null,null,null,null,null,null,null,null,null,null,null,null,null,null,null,null,null,null,null,{"$f":"MATCH(W53,'остальные сборочки'!W$3:W$1113,0)","v":{"$error":"#N/A"}}]
["Шадринск",null,null,null,null,null,null,null,null,null,null,null,null,null,null,null,null,null,null,null,null,null,null,{"$f":"MATCH(W54,'остальные сборочки'!W$3:W$1113,0)","v":{"$error":"#N/A"}}]
["Шагонар",null,null,null,null,null,null,null,null,null,null,null,null,null,null,null,null,null,null,null,null,null,null,{"$f":"MATCH(W55,'остальные сборочки'!W$3:W$1113,0)","v":{"$error":"#N/A"}}]
["Чухлома",null,null,null,null,null,null,null,null,null,null,null,null,null,null,null,null,null,null,null,null,null,null,{"$f":"MATCH(W56,'остальные сборочки'!W$3:W$1113,0)","v":{"$error":"#N/A"}}]
["Чусовой",null,null,null,null,null,null,null,null,null,null,null,null,null,null,null,null,null,null,null,null,null,null,{"$f":"MATCH(W57,'остальные сборочки'!W$3:W$1113,0)","v":{"$error":"#N/A"}}]
["Чулым",null,null,null,null,null,null,null,null,null,null,null,null,null,null,null,null,null,null,null,null,null,null,{"$f":"MATCH(W58,'остальные сборочки'!W$3:W$1113,0)","v":{"$error":"#N/A"}}]
["Чудово",null,null,null,null,null,null,null,null,null,null,null,null,null,null,null,null,null,null,null,null,null,null,{"$f":"MATCH(W59,'остальные сборочки'!W$3:W$1113,0)","v":{"$error":"#N/A"}}]
["Чкаловск",null,null,null,null,null,null,null,null,null,null,null,null,null,null,null,null,null,null,null,null,null,null,{"$f":"MATCH(W60,'остальные сборочки'!W$3:W$1113,0)","v":{"$error":"#N/A"}}]
{"$rows_left_out":1054}
{"sheet":"остальные сборочки","index":1,"n_rows":1113,"n_cols":33,"rows_kept":1113,"cut":false,"hidden":false,"merged":[]}
["КодKKS",null,null,null,null,null,null,null,null,null,null,null,null,null,null,null,null,null,null,null,null,null,"здесь в реальной таблице текстовые данные большой длины (до 100-200 символов)",null,null,null,null,null,null,null,null,"СравнениеКороткий_1()","СравнениеКороткий"]
[1,2,3,4,5,6,7,8,9,10,11,12,13,14,15,16,17,18,19,20,21,22,23,24,25,26,27,28,29,30]
["Абаза",null,null,null,null,null,null,null,null,null,null,null,null,null,null,null,null,null,null,null,null,null,"-",{"$f":"MATCH(W3,НКУ!W$3:W$1113,0)","v":{"$error":"#N/A"}},null,null,null,null,null,null,null,"7 секунд","190 секунд"]
["Абакан",null,null,null,null,null,null,null,null,null,null,null,null,null,null,null,null,null,null,null,null,null,"-",{"$f":"MATCH(W4,НКУ!W$3:W$1113,0)","v":{"$error":"#N/A"}}]
["Абдулино",null,null,null,null,null,null,null,null,null,null,null,null,null,null,null,null,null,null,null,null,null,"-",{"$f":"MATCH(W5,НКУ!W$3:W$1113,0)","v":{"$error":"#N/A"}}]
["Абинск",null,null,null,null,null,null,null,null,null,null,null,null,null,null,null,null,null,null,null,null,null,"-",{"$f":"MATCH(W6,НКУ!W$3:W$1113,0)","v":{"$error":"#N/A"}}]
["Агидель",null,null,null,null,null,null,null,null,null,null,null,null,null,null,null,null,null,null,null,null,null,"-",{"$f":"MATCH(W7,НКУ!W$3:W$1113,0)","v":{"$error":"#N/A"}}]
["Агрыз",null,null,null,null,null,null,null,null,null,null,null,null,null,null,null,null,null,null,null,null,null,"-",{"$f":"MATCH(W8,НКУ!W$3:W$1113,0)","v":{"$error":"#N/A"}}]
["Адыгейск",null,null,null,null,null,null,null,null,null,null,null,null,null,null,null,null,null,null,null,null,null,"-",{"$f":"MATCH(W9,НКУ!W$3:W$1113,0)","v":{"$error":"#N/A"}}]
["Азнакаево",null,null,null,null,null,null,null,null,null,null,null,null,null,null,null,null,null,null,null,null,null,"-",{"$f":"MATCH(W10,НКУ!W$3:W$1113,0)","v":{"$error":"#N/A"}}]
["Азов",null,null,null,null,null,null,null,null,null,null,null,null,null,null,null,null,null,null,null,null,null,"-",{"$f":"MATCH(W11,НКУ!W$3:W$1113,0)","v":{"$error":"#N/A"}}]
["Ак-Довурак",null,null,null,null,null,null,null,null,null,null,null,null,null,null,null,null,null,null,null,null,null,"-",{"$f":"MATCH(W12,НКУ!W$3:W$1113,0)","v":{"$error":"#N/A"}}]
["Аксай",null,null,null,null,null,null,null,null,null,null,null,null,null,null,null,null,null,null,null,null,null,"-",{"$f":"MATCH(W13,НКУ!W$3:W$1113,0)","v":{"$error":"#N/A"}}]
["Алагир",null,null,null,null,null,null,null,null,null,null,null,null,null,null,null,null,null,null,null,null,null,"-",{"$f":"MATCH(W14,НКУ!W$3:W$1113,0)","v":{"$error":"#N/A"}}]
["Алапаевск",null,null,null,null,null,null,null,null,null,null,null,null,null,null,null,null,null,null,null,null,null,"-",{"$f":"MATCH(W15,НКУ!W$3:W$1113,0)","v":{"$error":"#N/A"}}]
["Алатырь",null,null,null,null,null,null,null,null,null,null,null,null,null,null,null,null,null,null,null,null,null,"-",{"$f":"MATCH(W16,НКУ!W$3:W$1113,0)","v":{"$error":"#N/A"}}]
["Алдан",null,null,null,null,null,null,null,null,null,null,null,null,null,null,null,null,null,null,null,null,null,"-",{"$f":"MATCH(W17,НКУ!W$3:W$1113,0)","v":{"$error":"#N/A"}}]
["Алейск",null,null,null,null,null,null,null,null,null,null,null,null,null,null,null,null,null,null,null,null,null,"-",{"$f":"MATCH(W18,НКУ!W$3:W$1113,0)","v":{"$error":"#N/A"}}]
["Александров",null,null,null,null,null,null,null,null,null,null,null,null,null,null,null,null,null,null,null,null,null,"-",{"$f":"MATCH(W19,НКУ!W$3:W$1113,0)","v":{"$error":"#N/A"}}]
["Александровск",null,null,null,null,null,null,null,null,null,null,null,null,null,null,null,null,null,null,null,null,null,"-",{"$f":"MATCH(W20,НКУ!W$3:W$1113,0)","v":{"$error":"#N/A"}}]
["Александровск-Сахалинский",null,null,null,null,null,null,null,null,null,null,null,null,null,null,null,null,null,null,null,null,null,"-",{"$f":"MATCH(W21,НКУ!W$3:W$1113,0)","v":{"$error":"#N/A"}}]
["Алексеевка",null,null,null,null,null,null,null,null,null,null,null,null,null,null,null,null,null,null,null,null,null,"-",{"$f":"MATCH(W22,НКУ!W$3:W$1113,0)","v":{"$error":"#N/A"}}]
["Алексин",null,null,null,null,null,null,null,null,null,null,null,null,null,null,null,null,null,null,null,null,null,"-",{"$f":"MATCH(W23,НКУ!W$3:W$1113,0)","v":{"$error":"#N/A"}}]
["Алзамай",null,null,null,null,null,null,null,null,null,null,null,null,null,null,null,null,null,null,null,null,null,"-",{"$f":"MATCH(W24,НКУ!W$3:W$1113,0)","v":{"$error":"#N/A"}}]
["Алупка",null,null,null,null,null,null,null,null,null,null,null,null,null,null,null,null,null,null,null,null,null,"-",{"$f":"MATCH(W25,НКУ!W$3:W$1113,0)","v":{"$error":"#N/A"}}]
["Алушта",null,null,null,null,null,null,null,null,null,null,null,null,null,null,null,null,null,null,null,null,null,"-",{"$f":"MATCH(W26,НКУ!W$3:W$1113,0)","v":{"$error":"#N/A"}}]
["Альметьевск",null,null,null,null,null,null,null,null,null,null,null,null,null,null,null,null,null,null,null,null,null,"-",{"$f":"MATCH(W27,НКУ!W$3:W$1113,0)","v":{"$error":"#N/A"}}]
["Амурск",null,null,null,null,null,null,null,null,null,null,null,null,null,null,null,null,null,null,null,null,null,"-",{"$f":"MATCH(W28,НКУ!W$3:W$1113,0)","v":{"$error":"#N/A"}}]
["Анадырь",null,null,null,null,null,null,null,null,null,null,null,null,null,null,null,null,null,null,null,null,null,"-",{"$f":"MATCH(W29,НКУ!W$3:W$1113,0)","v":{"$error":"#N/A"}}]
["Анапа",null,null,null,null,null,null,null,null,null,null,null,null,null,null,null,null,null,null,null,null,null,"-",{"$f":"MATCH(W30,НКУ!W$3:W$1113,0)","v":{"$error":"#N/A"}}]
["Ангарск",null,null,null,null,null,null,null,null,null,null,null,null,null,null,null,null,null,null,null,null,null,"-",{"$f":"MATCH(W31,НКУ!W$3:W$1113,0)","v":{"$error":"#N/A"}}]
["Андреаполь",null,null,null,null,null,null,null,null,null,null,null,null,null,null,null,null,null,null,null,null,null,"-",{"$f":"MATCH(W32,НКУ!W$3:W$1113,0)","v":{"$error":"#N/A"}}]
["Анжеро-Судженск",null,null,null,null,null,null,null,null,null,null,null,null,null,null,null,null,null,null,null,null,null,"-",{"$f":"MATCH(W33,НКУ!W$3:W$1113,0)","v":{"$error":"#N/A"}}]
["Анива",null,null,null,null,null,null,null,null,null,null,null,null,null,null,null,null,null,null,null,null,null,"-",{"$f":"MATCH(W34,НКУ!W$3:W$1113,0)","v":{"$error":"#N/A"}}]
["Апатиты",null,null,null,null,null,null,null,null,null,null,null,null,null,null,null,null,null,null,null,null,null,"-",{"$f":"MATCH(W35,НКУ!W$3:W$1113,0)","v":{"$error":"#N/A"}}]
["Апрелевка",null,null,null,null,null,null,null,null,null,null,null,null,null,null,null,null,null,null,null,null,null,"-",{"$f":"MATCH(W36,НКУ!W$3:W$1113,0)","v":{"$error":"#N/A"}}]
["Апшеронск",null,null,null,null,null,null,null,null,null,null,null,null,null,null,null,null,null,null,null,null,null,"-",{"$f":"MATCH(W37,НКУ!W$3:W$1113,0)","v":{"$error":"#N/A"}}]
["Арамиль",null,null,null,null,null,null,null,null,null,null,null,null,null,null,null,null,null,null,null,null,null,"-",{"$f":"MATCH(W38,НКУ!W$3:W$1113,0)","v":{"$error":"#N/A"}}]
["Аргун",null,null,null,null,null,null,null,null,null,null,null,null,null,null,null,null,null,null,null,null,null,"-",{"$f":"MATCH(W39,НКУ!W$3:W$1113,0)","v":{"$error":"#N/A"}}]
["Ардатов",null,null,null,null,null,null,null,null,null,null,null,null,null,null,null,null,null,null,null,null,null,"-",{"$f":"MATCH(W40,НКУ!W$3:W$1113,0)","v":{"$error":"#N/A"}}]
["Ардон",null,null,null,null,null,null,null,null,null,null,null,null,null,null,null,null,null,null,null,null,null,"-",{"$f":"MATCH(W41,НКУ!W$3:W$1113,0)","v":{"$error":"#N/A"}}]
["Арзамас",null,null,null,null,null,null,null,null,null,null,null,null,null,null,null,null,null,null,null,null,null,"-",{"$f":"MATCH(W42,НКУ!W$3:W$1113,0)","v":{"$error":"#N/A"}}]
["Аркадак",null,null,null,null,null,null,null,null,null,null,null,null,null,null,null,null,null,null,null,null,null,"-",{"$f":"MATCH(W43,НКУ!W$3:W$1113,0)","v":{"$error":"#N/A"}}]
["Армавир",null,null,null,null,null,null,null,null,null,null,null,null,null,null,null,null,null,null,null,null,null,"-",{"$f":"MATCH(W44,НКУ!W$3:W$1113,0)","v":{"$error":"#N/A"}}]
["Армянск",null,null,null,null,null,null,null,null,null,null,null,null,null,null,null,null,null,null,null,null,null,"-",{"$f":"MATCH(W45,НКУ!W$3:W$1113,0)","v":{"$error":"#N/A"}}]
["Арсеньев",null,null,null,null,null,null,null,null,null,null,null,null,null,null,null,null,null,null,null,null,null,"-",{"$f":"MATCH(W46,НКУ!W$3:W$1113,0)","v":{"$error":"#N/A"}}]
["Арск",null,null,null,null,null,null,null,null,null,null,null,null,null,null,null,null,null,null,null,null,null,"-",{"$f":"MATCH(W47,НКУ!W$3:W$1113,0)","v":{"$error":"#N/A"}}]
["Артём",null,null,null,null,null,null,null,null,null,null,null,null,null,null,null,null,null,null,null,null,null,"-",{"$f":"MATCH(W48,НКУ!W$3:W$1113,0)","v":{"$error":"#N/A"}}]
["Артёмовск",null,null,null,null,null,null,null,null,null,null,null,null,null,null,null,null,null,null,null,null,null,"-",{"$f":"MATCH(W49,НКУ!W$3:W$1113,0)","v":{"$error":"#N/A"}}]
["Артёмовский",null,null,null,null,null,null,null,null,null,null,null,null,null,null,null,null,null,null,null,null,null,"-",{"$f":"MATCH(W50,НКУ!W$3:W$1113,0)","v":{"$error":"#N/A"}}]
["Архангельск",null,null,null,null,null,null,null,null,null,null,null,null,null,null,null,null,null,null,null,null,null,"-",{"$f":"MATCH(W51,НКУ!W$3:W$1113,0)","v":{"$error":"#N/A"}}]
["Асбест",null,null,null,null,null,null,null,null,null,null,null,null,null,null,null,null,null,null,null,null,null,"-",{"$f":"MATCH(W52,НКУ!W$3:W$1113,0)","v":{"$error":"#N/A"}}]
["Асино",null,null,null,null,null,null,null,null,null,null,null,null,null,null,null,null,null,null,null,null,null,"-",{"$f":"MATCH(W53,НКУ!W$3:W$1113,0)","v":{"$error":"#N/A"}}]
["Астрахань",null,null,null,null,null,null,null,null,null,null,null,null,null,null,null,null,null,null,null,null,null,"-",{"$f":"MATCH(W54,НКУ!W$3:W$1113,0)","v":{"$error":"#N/A"}}]
["Аткарск",null,null,null,null,null,null,null,null,null,null,null,null,null,null,null,null,null,null,null,null,null,"-",{"$f":"MATCH(W55,НКУ!W$3:W$1113,0)","v":{"$error":"#N/A"}}]
["Ахтубинск",null,null,null,null,null,null,null,null,null,null,null,null,null,null,null,null,null,null,null,null,null,"-",{"$f":"MATCH(W56,НКУ!W$3:W$1113,0)","v":{"$error":"#N/A"}}]
["Ачинск",null,null,null,null,null,null,null,null,null,null,null,null,null,null,null,null,null,null,null,null,null,"-",{"$f":"MATCH(W57,НКУ!W$3:W$1113,0)","v":{"$error":"#N/A"}}]
["Аша",null,null,null,null,null,null,null,null,null,null,null,null,null,null,null,null,null,null,null,null,null,"-",{"$f":"MATCH(W58,НКУ!W$3:W$1113,0)","v":{"$error":"#N/A"}}]
["Бабаево",null,null,null,null,null,null,null,null,null,null,null,null,null,null,null,null,null,null,null,null,null,"-",{"$f":"MATCH(W59,НКУ!W$3:W$1113,0)","v":{"$error":"#N/A"}}]
["Бабушкин",null,null,null,null,null,null,null,null,null,null,null,null,null,null,null,null,null,null,null,null,null,"-",{"$f":"MATCH(W60,НКУ!W$3:W$1113,0)","v":{"$error":"#N/A"}}]
{"$rows_left_out":1053}