{"text_format":"1","workbook":"xlsx","n_sheets":3,"sheets":["Юноши-5 км","Девушки-3 км","Сводный"],"not_rendered":{"charts":0,"images":0,"macros":1,"external_links":0,"defined_names":0,"comments":0,"pivot_tables":0},"unopened":[],"bounds":{"document_bytes":16777216,"sheet_cells":100000,"rows_first":2000,"rows_last":500,"rows_between":2000,"halvings":0,"cell_chars":16384,"cell_head_chars":4096},"cells_cut":0,"cells_raw":0,"read":"whole","date_system":"1900"}

{"sheet":"Юноши-5 км","index":0,"n_rows":77,"n_cols":13,"rows_kept":77,"cut":false,"hidden":false,"merged":[[0,0,0,8],[1,0,1,8],[2,0,2,8],[1,10,1,11]]}
["Протокол"]
["городских соревнований  по лыжным гонкам г. Щигры-2018 г.",null,null,null,null,null,null,null,null,null,"Юноши-5 км"]
["Юноши 5 км."]
["№ п/п","Фамилия, имя","Команда     Город (район)","Номер участника","Время старта (ч:мм:сс)","Время финиша (ч:мм:сс)","Чистое время (ч:мм:сс)","Место","№ п/п","№ п/п","Команда     Город (район)","Сумма времени 3 лучших результатов команды","Место"]
[1,"Чевычелов Дмитрий","СОШ№ 2",24,0,2.4363425925925927E-2,{"$f":"IF(F5=\"\",\"\",F5-E5)","v":"00:35:05"},{"$f":"IF(G5<\"\",COUNT(1/FREQUENCY(IF((G$5:G$77<=G5)*(G$5:G$77>0),G$5:G$77),G$5:G$77)),\"\")","v":1},1,1,{"$f":"IFERROR(LOOKUP(,-1/ISNA(MATCH($C$5:INDEX(C:C,MATCH(\"яяя\",$C$1:$C$77)),$K$4:K4,)),$C$5:$C$77),\"\")","v":"СОШ№ 2"},{"$f":"IF(G$5:G$77=\"\",\"\",SUM(SMALL(IF($C$5:$C$77=$K5,$G$5:$G$77),{1,2,3})))","v":{"$error":"#NUM!"}},{"$f":"IF(L5=\"\",\"\",RANK(L5,$L$5:$L$12,1))","v":{"$error":"#NUM!"}}]
[2,"Галкин Никита","СОШ№ 3",52,0,null,"",{"$f":"IF(G6<\"\",COUNT(1/FREQUENCY(IF((G$5:G$77<=G6)*(G$5:G$77>0),G$5:G$77),G$5:G$77)),\"\")","v":""},2,2,{"$f":"IFERROR(LOOKUP(,-1/ISNA(MATCH($C$5:INDEX(C:C,MATCH(\"яяя\",$C$1:$C$77)),$K$4:K5,)),$C$5:$C$77),\"\")","v":"СОШ№ 5"},{"$f":"IF(G$5:G$77=\"\",\"\",SUM(SMALL(IF($C$5:$C$77=$K6,$G$5:$G$77),{1,2,3})))","v":{"$error":"#NUM!"}},{"$error":"#NUM!"}]
[3,"Астахов Александр","СОШ№ 5",9,3.4722222222222224E-4,null,"",{"$f":"IF(G7<\"\",COUNT(1/FREQUENCY(IF((G$5:G$77<=G7)*(G$5:G$77>0),G$5:G$77),G$5:G$77)),\"\")","v":""},3,3,{"$f":"IFERROR(LOOKUP(,-1/ISNA(MATCH($C$5:INDEX(C:C,MATCH(\"яяя\",$C$1:$C$77)),$K$4:K6,)),$C$5:$C$77),\"\")","v":"СОШ№ 3"},{"$f":"IF(G$5:G$77=\"\",\"\",SUM(SMALL(IF($C$5:$C$77=$K7,$G$5:$G$77),{1,2,3})))","v":{"$error":"#NUM!"}},{"$error":"#NUM!"}]
[4,"Михайлов Максим","СОШ№ 4",14,3.4722222222222224E-4,null,"",{"$f":"IF(G8<\"\",COUNT(1/FREQUENCY(IF((G$5:G$77<=G8)*(G$5:G$77>0),G$5:G$77),G$5:G$77)),\"\")","v":""},4,4,{"$f":"IFERROR(LOOKUP(,-1/ISNA(MATCH($C$5:INDEX(C:C,MATCH(\"яяя\",$C$1:$C$77)),$K$4:K7,)),$C$5:$C$77),\"\")","v":"СОШ№ 4"},{"$f":"IF(G$5:G$77=\"\",\"\",SUM(SMALL(IF($C$5:$C$77=$K8,$G$5:$G$77),{1,2,3})))","v":{"$error":"#NUM!"}},{"$error":"#NUM!"}]
[5,"Смахтин Станислав","СОШ№ 2",28,6.9444444444444447E-4,null,"",{"$f":"IF(G9<\"\",COUNT(1/FREQUENCY(IF((G$5:G$77<=G9)*(G$5:G$77>0),G$5:G$77),G$5:G$77)),\"\")","v":""},5]
[6,"Григоренко Илья","СОШ№ 3",63,6.9444444444444447E-4,null,"",{"$f":"IF(G10<\"\",COUNT(1/FREQUENCY(IF((G$5:G$77<=G10)*(G$5:G$77>0),G$5:G$77),G$5:G$77)),\"\")","v":""},6]
[7,"Горохов Арсений","СОШ№ 5",2,1.0416666666666667E-3,null,"",{"$f":"IF(G11<\"\",COUNT(1/FREQUENCY(IF((G$5:G$77<=G11)*(G$5:G$77>0),G$5:G$77),G$5:G$77)),\"\")","v":""},7]
[8,"Васин Иван","СОШ№ 4",44,1.0416666666666667E-3,null,"",{"$f":"IF(G12<\"\",COUNT(1/FREQUENCY(IF((G$5:G$77<=G12)*(G$5:G$77>0),G$5:G$77),G$5:G$77)),\"\")","v":""},8]
[9,"Афонин Максим","СОШ№ 2",43,1.3888888888888889E-3,null,"",{"$f":"IF(G13<\"\",COUNT(1/FREQUENCY(IF((G$5:G$77<=G13)*(G$5:G$77>0),G$5:G$77),G$5:G$77)),\"\")","v":""},9]
[10,"Есипов Данил","СОШ№ 3",53,1.3888888888888889E-3,null,"",{"$f":"IF(G14<\"\",COUNT(1/FREQUENCY(IF((G$5:G$77<=G14)*(G$5:G$77>0),G$5:G$77),G$5:G$77)),\"\")","v":""},10]
[11,"Азаров Денис","СОШ№ 5",69,1.736111111111111E-3,null,"",{"$f":"IF(G15<\"\",COUNT(1/FREQUENCY(IF((G$5:G$77<=G15)*(G$5:G$77>0),G$5:G$77),G$5:G$77)),\"\")","v":""},11]
[12,"Загребаев Дмитрий","СОШ№ 4",41,1.736111111111111E-3,null,"",{"$f":"IF(G16<\"\",COUNT(1/FREQUENCY(IF((G$5:G$77<=G16)*(G$5:G$77>0),G$5:G$77),G$5:G$77)),\"\")","v":""},12]
[13,"Маслов Андрей","СОШ№ 2",48,2.0833333333333333E-3,null,"",{"$f":"IF(G17<\"\",COUNT(1/FREQUENCY(IF((G$5:G$77<=G17)*(G$5:G$77>0),G$5:G$77),G$5:G$77)),\"\")","v":""},null,null,null,null,""]
[14,"Бурамбаев Кирилл","СОШ№ 3",58,2.0833333333333333E-3,null,"",{"$f":"IF(G18<\"\",COUNT(1/FREQUENCY(IF((G$5:G$77<=G18)*(G$5:G$77>0),G$5:G$77),G$5:G$77)),\"\")","v":""},null,null,null,null,""]
[15,"Корнилов Иван","СОШ№ 5",12,2.4305555555555556E-3,null,"",{"$f":"IF(G19<\"\",COUNT(1/FREQUENCY(IF((G$5:G$77<=G19)*(G$5:G$77>0),G$5:G$77),G$5:G$77)),\"\")","v":""},null,null,null,null,""]
[16,"Першин Алексей","СОШ№ 4",37,2.4305555555555556E-3,null,"",{"$f":"IF(G20<\"\",COUNT(1/FREQUENCY(IF((G$5:G$77<=G20)*(G$5:G$77>0),G$5:G$77),G$5:G$77)),\"\")","v":""},null,null,null,null,""]
[17,"Непомнящий Эдуард","СОШ№ 2",49,2.7777777777777779E-3,null,"",{"$f":"IF(G21<\"\",COUNT(1/FREQUENCY(IF((G$5:G$77<=G21)*(G$5:G$77>0),G$5:G$77),G$5:G$77)),\"\")","v":""},null,null,null,null,""]
[18,"Помогаев Кирилл","СОШ№ 3",64,2.7777777777777779E-3,null,"",{"$f":"IF(G22<\"\",COUNT(1/FREQUENCY(IF((G$5:G$77<=G22)*(G$5:G$77>0),G$5:G$77),G$5:G$77)),\"\")","v":""},null,null,null,null,""]
[19,"Маючий Дмитрий","СОШ№ 5",30,3.1249999999999997E-3,null,"",{"$f":"IF(G23<\"\",COUNT(1/FREQUENCY(IF((G$5:G$77<=G23)*(G$5:G$77>0),G$5:G$77),G$5:G$77)),\"\")","v":""},null,null,null,null,""]
[20,"Гуров Дмитрий","СОШ№ 4",17,3.1249999999999997E-3,null,"",{"$f":"IF(G24<\"\",COUNT(1/FREQUENCY(IF((G$5:G$77<=G24)*(G$5:G$77>0),G$5:G$77),G$5:G$77)),\"\")","v":""},null,null,null,null,""]
[21,"Смахтин Денис","СОШ№ 2",47,3.472222222222222E-3,null,"",{"$f":"IF(G25<\"\",COUNT(1/FREQUENCY(IF((G$5:G$77<=G25)*(G$5:G$77>0),G$5:G$77),G$5:G$77)),\"\")","v":""},null,null,null,null,""]
[22,"Снегерёв Захар","СОШ№ 3",60,3.472222222222222E-3,null,"",{"$f":"IF(G26<\"\",COUNT(1/FREQUENCY(IF((G$5:G$77<=G26)*(G$5:G$77>0),G$5:G$77),G$5:G$77)),\"\")","v":""},null,null,null,null,""]
[23,"Горобец Дмитрий","СОШ№ 5",1,3.8194444444444443E-3,null,"",{"$f":"IF(G27<\"\",COUNT(1/FREQUENCY(IF((G$5:G$77<=G27)*(G$5:G$77>0),G$5:G$77),G$5:G$77)),\"\")","v":""},null,null,null,null,""]
[24,"Тюрин Антон","СОШ№ 4",70,3.8194444444444443E-3,null,"",{"$f":"IF(G28<\"\",COUNT(1/FREQUENCY(IF((G$5:G$77<=G28)*(G$5:G$77>0),G$5:G$77),G$5:G$77)),\"\")","v":""},null,null,null,null,""]
[25,"Поздняков Станислав","СОШ№ 2",88,4.1666666666666666E-3,null,"",{"$f":"IF(G29<\"\",COUNT(1/FREQUENCY(IF((G$5:G$77<=G29)*(G$5:G$77>0),G$5:G$77),G$5:G$77)),\"\")","v":""},null,null,null,null,""]
[26,"Хомяков Егор","СОШ№ 3",4,4.1666666666666666E-3,null,"",{"$f":"IF(G30<\"\",COUNT(1/FREQUENCY(IF((G$5:G$77<=G30)*(G$5:G$77>0),G$5:G$77),G$5:G$77)),\"\")","v":""},null,null,null,null,""]
[27,"Соглаев Андрей","СОШ№ 5",56,4.5138888888888893E-3,null,"",{"$f":"IF(G31<\"\",COUNT(1/FREQUENCY(IF((G$5:G$77<=G31)*(G$5:G$77>0),G$5:G$77),G$5:G$77)),\"\")","v":""},null,null,null,null,""]
[28,"Гордеев Дмитрий","СОШ№ 2",71,4.5138888888888893E-3,null,"",{"$f":"IF(G32<\"\",COUNT(1/FREQUENCY(IF((G$5:G$77<=G32)*(G$5:G$77>0),G$5:G$77),G$5:G$77)),\"\")","v":""}]
[29,"Бенделиани Мир","СОШ№ 2",3,4.8611111111111112E-3,null,"",{"$f":"IF(G33<\"\",COUNT(1/FREQUENCY(IF((G$5:G$77<=G33)*(G$5:G$77>0),G$5:G$77),G$5:G$77)),\"\")","v":""}]
[30,"Озеров Кирилл","СОШ№ 2",40,4.8611111111111112E-3,null,"",{"$f":"IF(G34<\"\",COUNT(1/FREQUENCY(IF((G$5:G$77<=G34)*(G$5:G$77>0),G$5:G$77),G$5:G$77)),\"\")","v":""}]
[31,null,null,null,5.208333333333333E-3,null,"",{"$f":"IF(G35<\"\",COUNT(1/FREQUENCY(IF((G$5:G$77<=G35)*(G$5:G$77>0),G$5:G$77),G$5:G$77)),\"\")","v":""}]
[32,null,null,null,5.208333333333333E-3,null,"",{"$f":"IF(G36<\"\",COUNT(1/FREQUENCY(IF((G$5:G$77<=G36)*(G$5:G$77>0),G$5:G$77),G$5:G$77)),\"\")","v":""}]
[33,null,null,null,5.5555555555555558E-3,null,"",{"$f":"IF(G37<\"\",COUNT(1/FREQUENCY(IF((G$5:G$77<=G37)*(G$5:G$77>0),G$5:G$77),G$5:G$77)),\"\")","v":""}]
[34,null,null,null,5.5555555555555558E-3,null,"",{"$f":"IF(G38<\"\",COUNT(1/FREQUENCY(IF((G$5:G$77<=G38)*(G$5:G$77>0),G$5:G$77),G$5:G$77)),\"\")","v":""}]
[35,null,null,null,5.9027777777777776E-3,null,"",{"$f":"IF(G39<\"\",COUNT(1/FREQUENCY(IF((G$5:G$77<=G39)*(G$5:G$77>0),G$5:G$77),G$5:G$77)),\"\")","v":""}]
[36,null,null,null,5.9027777777777776E-3,null,"",{"$f":"IF(G40<\"\",COUNT(1/FREQUENCY(IF((G$5:G$77<=G40)*(G$5:G$77>0),G$5:G$77),G$5:G$77)),\"\")","v":""}]
[37,null,null,null,6.2499999999999995E-3,null,"",{"$f":"IF(G41<\"\",COUNT(1/FREQUENCY(IF((G$5:G$77<=G41)*(G$5:G$77>0),G$5:G$77),G$5:G$77)),\"\")","v":""}]
[38,null,null,null,6.2499999999999995E-3,null,"",{"$f":"IF(G42<\"\",COUNT(1/FREQUENCY(IF((G$5:G$77<=G42)*(G$5:G$77>0),G$5:G$77),G$5:G$77)),\"\")","v":""}]
[39,null,null,null,6.5972222222222222E-3,null,"",{"$f":"IF(G43<\"\",COUNT(1/FREQUENCY(IF((G$5:G$77<=G43)*(G$5:G$77>0),G$5:G$77),G$5:G$77)),\"\")","v":""}]
[40,null,null,null,6.5972222222222222E-3,null,"",{"$f":"IF(G44<\"\",COUNT(1/FREQUENCY(IF((G$5:G$77<=G44)*(G$5:G$77>0),G$5:G$77),G$5:G$77)),\"\")","v":""}]
[41,null,null,null,6.9444444444444441E-3,null,"",{"$f":"IF(G45<\"\",COUNT(1/FREQUENCY(IF((G$5:G$77<=G45)*(G$5:G$77>0),G$5:G$77),G$5:G$77)),\"\")","v":""}]
[42,null,null,null,6.9444444444444441E-3,null,"",{"$f":"IF(G46<\"\",COUNT(1/FREQUENCY(IF((G$5:G$77<=G46)*(G$5:G$77>0),G$5:G$77),G$5:G$77)),\"\")","v":""}]
[43,null,null,null,7.2916666666666659E-3,null,"",{"$f":"IF(G47<\"\",COUNT(1/FREQUENCY(IF((G$5:G$77<=G47)*(G$5:G$77>0),G$5:G$77),G$5:G$77)),\"\")","v":""}]
[44,null,null,null,7.2916666666666659E-3,null,"",{"$f":"IF(G48<\"\",COUNT(1/FREQUENCY(IF((G$5:G$77<=G48)*(G$5:G$77>0),G$5:G$77),G$5:G$77)),\"\")","v":""}]
[45,null,null,null,7.6388888888888886E-3,null,"",{"$f":"IF(G49<\"\",COUNT(1/FREQUENCY(IF((G$5:G$77<=G49)*(G$5:G$77>0),G$5:G$77),G$5:G$77)),\"\")","v":""}]
[46,null,null,null,7.6388888888888886E-3,null,"",{"$f":"IF(G50<\"\",COUNT(1/FREQUENCY(IF((G$5:G$77<=G50)*(G$5:G$77>0),G$5:G$77),G$5:G$77)),\"\")","v":""}]
[47,null,null,null,7.9861111111111122E-3,null,"",{"$f":"IF(G51<\"\",COUNT(1/FREQUENCY(IF((G$5:G$77<=G51)*(G$5:G$77>0),G$5:G$77),G$5:G$77)),\"\")","v":""}]
[48,null,null,null,7.9861111111111122E-3,null,"",{"$f":"IF(G52<\"\",COUNT(1/FREQUENCY(IF((G$5:G$77<=G52)*(G$5:G$77>0),G$5:G$77),G$5:G$77)),\"\")","v":""}]
[49,null,null,null,8.3333333333333332E-3,null,"",{"$f":"IF(G53<\"\",COUNT(1/FREQUENCY(IF((G$5:G$77<=G53)*(G$5:G$77>0),G$5:G$77),G$5:G$77)),\"\")","v":""}]
[50,null,null,null,8.3333333333333332E-3,null,"",{"$f":"IF(G54<\"\",COUNT(1/FREQUENCY(IF((G$5:G$77<=G54)*(G$5:G$77>0),G$5:G$77),G$5:G$77)),\"\")","v":""}]
[51,null,null,null,8.6805555555555559E-3,null,"",{"$f":"IF(G55<\"\",COUNT(1/FREQUENCY(IF((G$5:G$77<=G55)*(G$5:G$77>0),G$5:G$77),G$5:G$77)),\"\")","v":""}]
[52,null,null,null,8.6805555555555559E-3,null,"",{"$f":"IF(G56<\"\",COUNT(1/FREQUENCY(IF((G$5:G$77<=G56)*(G$5:G$77>0),G$5:G$77),G$5:G$77)),\"\")","v":""}]
[53,null,null,null,9.0277777777777787E-3,null,"",{"$f":"IF(G57<\"\",COUNT(1/FREQUENCY(IF((G$5:G$77<=G57)*(G$5:G$77>0),G$5:G$77),G$5:G$77)),\"\")","v":""}]
[54,null,null,null,9.0277777777777787E-3,null,"",{"$f":"IF(G58<\"\",COUNT(1/FREQUENCY(IF((G$5:G$77<=G58)*(G$5:G$77>0),G$5:G$77),G$5:G$77)),\"\")","v":""}]
[55,null,null,null,9.3749999999999997E-3,null,"",{"$f":"IF(G59<\"\",COUNT(1/FREQUENCY(IF((G$5:G$77<=G59)*(G$5:G$77>0),G$5:G$77),G$5:G$77)),\"\")","v":""}]
[56,null,null,null,9.3749999999999997E-3,null,"",{"$f":"IF(G60<\"\",COUNT(1/FREQUENCY(IF((G$5:G$77<=G60)*(G$5:G$77>0),G$5:G$77),G$5:G$77)),\"\")","v":""}]
{"$rows_left_out":18}
{"sheet":"Девушки-3 км","index":1,"n_rows":77,"n_cols":13,"rows_kept":77,"cut":false,"hidden":false,"merged":[[0,0,0,8],[1,0,1,8],[2,0,2,8],[1,10,1,11]]}
["Протокол"]
["городских соревнований  по лыжным гонкам г. Щигры-2018 г.",null,null,null,null,null,null,null,null,null,"Девушки-3 км"]
["Девушки 3 км."]
["№ п/п","Фамилия, имя","Команда     Город (район)","Номер участника","Время старта (ч:мм:сс)","Время финиша (ч:мм:сс)","Чистое время (ч:мм:сс)","Место","№ п/п","№ п/п","Команда     Город (район)","Сумма времени 3 лучших результатов команды","Место"]
[1,"Чевычелова Татьяна","СОШ№ 2",74,0,null,{"$f":"IF(F5=\"\",\"\",F5-E5)","v":""},{"$f":"IF(G5<\"\",COUNT(1/FREQUENCY(IF((G$5:G$77<=G5)*(G$5:G$77>0),G$5:G$77),G$5:G$77)),\"\")","v":""},1,1,{"$f":"IFERROR(LOOKUP(,-1/ISNA(MATCH($C$5:INDEX(C:C,MATCH(\"яяя\",$C$1:$C$77)),$K$4:K4,)),$C$5:$C$77),\"\")","v":"СОШ№ 3"},{"$f":"IF(G$5:G$77=\"\",\"\",SUM(SMALL(IF($C$5:$C$77=$K5,$G$5:$G$77),{1,2,3})))","v":""},{"$f":"IF(L5=\"\",\"\",RANK(L5,$L$5:$L$12,1))","v":""}]
[2,"Тарасова Ира","СОШ№ 3",19,0,null,"",{"$f":"IF(G6<\"\",COUNT(1/FREQUENCY(IF((G$5:G$77<=G6)*(G$5:G$77>0),G$5:G$77),G$5:G$77)),\"\")","v":""},2,2,{"$f":"IFERROR(LOOKUP(,-1/ISNA(MATCH($C$5:INDEX(C:C,MATCH(\"яяя\",$C$1:$C$77)),$K$4:K5,)),$C$5:$C$77),\"\")","v":"СОШ№ 2"},{"$f":"IF(G$5:G$77=\"\",\"\",SUM(SMALL(IF($C$5:$C$77=$K6,$G$5:$G$77),{1,2,3})))","v":""},{"$f":"IF(L6=\"\",\"\",RANK(L6,$L$5:$L$12,1))","v":""}]
[3,"Денисова Анна","СОШ№ 5",22,3.4722222222222224E-4,null,"",{"$f":"IF(G7<\"\",COUNT(1/FREQUENCY(IF((G$5:G$77<=G7)*(G$5:G$77>0),G$5:G$77),G$5:G$77)),\"\")","v":""},3,3,{"$f":"IFERROR(LOOKUP(,-1/ISNA(MATCH($C$5:INDEX(C:C,MATCH(\"яяя\",$C$1:$C$77)),$K$4:K6,)),$C$5:$C$77),\"\")","v":"СОШ№ 5"},{"$f":"IF(G$5:G$77=\"\",\"\",SUM(SMALL(IF($C$5:$C$77=$K7,$G$5:$G$77),{1,2,3})))","v":""},{"$f":"IF(L7=\"\",\"\",RANK(L7,$L$5:$L$12,1))","v":""}]
[4,"Залюбовская Мария","СОШ№ 4",49,3.4722222222222224E-4,null,"",{"$f":"IF(G8<\"\",COUNT(1/FREQUENCY(IF((G$5:G$77<=G8)*(G$5:G$77>0),G$5:G$77),G$5:G$77)),\"\")","v":""},4,4,{"$f":"IFERROR(LOOKUP(,-1/ISNA(MATCH($C$5:INDEX(C:C,MATCH(\"яяя\",$C$1:$C$77)),$K$4:K7,)),$C$5:$C$77),\"\")","v":"СОШ№ 4"},{"$f":"IF(G$5:G$77=\"\",\"\",SUM(SMALL(IF($C$5:$C$77=$K8,$G$5:$G$77),{1,2,3})))","v":""},{"$f":"IF(L8=\"\",\"\",RANK(L8,$L$5:$L$12,1))","v":""}]
[5,"Гричаненко Ирина","СОШ№ 2",148,6.9444444444444447E-4,null,"",{"$f":"IF(G9<\"\",COUNT(1/FREQUENCY(IF((G$5:G$77<=G9)*(G$5:G$77>0),G$5:G$77),G$5:G$77)),\"\")","v":""},5]
[6,"Тарасова Анастасия","СОШ№ 3",57,6.9444444444444447E-4,null,"",{"$f":"IF(G10<\"\",COUNT(1/FREQUENCY(IF((G$5:G$77<=G10)*(G$5:G$77>0),G$5:G$77),G$5:G$77)),\"\")","v":""},6]
[7,"Азарова Евгения","СОШ№ 5",25,1.0416666666666667E-3,null,"",{"$f":"IF(G11<\"\",COUNT(1/FREQUENCY(IF((G$5:G$77<=G11)*(G$5:G$77>0),G$5:G$77),G$5:G$77)),\"\")","v":""},7]
[8,"Минаева Наталья","СОШ№ 4",4,1.0416666666666667E-3,null,{"$f":"IF(F12=\"\",\"\",F12-E12)","v":""},{"$f":"IF(G12<\"\",COUNT(1/FREQUENCY(IF((G$5:G$77<=G12)*(G$5:G$77>0),G$5:G$77),G$5:G$77)),\"\")","v":""},8]
[9,"Середина Анастасия","СОШ№ 2",943,1.3888888888888889E-3,null,"",{"$f":"IF(G13<\"\",COUNT(1/FREQUENCY(IF((G$5:G$77<=G13)*(G$5:G$77>0),G$5:G$77),G$5:G$77)),\"\")","v":""},9]
[10,"Мордвинова Екатерина","СОШ№ 3",33,1.3888888888888889E-3,null,"",{"$f":"IF(G14<\"\",COUNT(1/FREQUENCY(IF((G$5:G$77<=G14)*(G$5:G$77>0),G$5:G$77),G$5:G$77)),\"\")","v":""},10]
[11,"Горохова Есения","СОШ№ 5",26,1.736111111111111E-3,null,"",{"$f":"IF(G15<\"\",COUNT(1/FREQUENCY(IF((G$5:G$77<=G15)*(G$5:G$77>0),G$5:G$77),G$5:G$77)),\"\")","v":""},11]
[12,"Солпанова Юлия","СОШ№ 4",48,1.736111111111111E-3,null,"",{"$f":"IF(G16<\"\",COUNT(1/FREQUENCY(IF((G$5:G$77<=G16)*(G$5:G$77>0),G$5:G$77),G$5:G$77)),\"\")","v":""},12]
[13,"Брагина Ирина","СОШ№ 2",862,2.0833333333333333E-3,null,"",{"$f":"IF(G17<\"\",COUNT(1/FREQUENCY(IF((G$5:G$77<=G17)*(G$5:G$77>0),G$5:G$77),G$5:G$77)),\"\")","v":""},null,null,null,null,{"$f":"IF(L17=\"\",\"\",RANK(L17,$L$5:$L$12,1))","v":""}]
[14,"Петрищева Елеонора","СОШ№ 3",15,2.0833333333333333E-3,null,"",{"$f":"IF(G18<\"\",COUNT(1/FREQUENCY(IF((G$5:G$77<=G18)*(G$5:G$77>0),G$5:G$77),G$5:G$77)),\"\")","v":""},null,null,null,null,""]
[15,"Афанаськина Дарья","СОШ№ 5",39,2.4305555555555556E-3,null,"",{"$f":"IF(G19<\"\",COUNT(1/FREQUENCY(IF((G$5:G$77<=G19)*(G$5:G$77>0),G$5:G$77),G$5:G$77)),\"\")","v":""},null,null,null,null,""]
[16,"Пожидаева Екатерина","СОШ№ 4",21,2.4305555555555556E-3,null,"",{"$f":"IF(G20<\"\",COUNT(1/FREQUENCY(IF((G$5:G$77<=G20)*(G$5:G$77>0),G$5:G$77),G$5:G$77)),\"\")","v":""},null,null,null,null,""]
[17,"Антонова Анна","СОШ№ 2",1124,2.7777777777777779E-3,null,"",{"$f":"IF(G21<\"\",COUNT(1/FREQUENCY(IF((G$5:G$77<=G21)*(G$5:G$77>0),G$5:G$77),G$5:G$77)),\"\")","v":""},null,null,null,null,""]
[18,"Кузенкова Виктория","СОШ№ 3",31,2.7777777777777779E-3,null,"",{"$f":"IF(G22<\"\",COUNT(1/FREQUENCY(IF((G$5:G$77<=G22)*(G$5:G$77>0),G$5:G$77),G$5:G$77)),\"\")","v":""},null,null,null,null,""]
[19,"Сырых Екатерина","СОШ№ 5",35,3.1249999999999997E-3,null,"",{"$f":"IF(G23<\"\",COUNT(1/FREQUENCY(IF((G$5:G$77<=G23)*(G$5:G$77>0),G$5:G$77),G$5:G$77)),\"\")","v":""},null,null,null,null,""]
[20,"Чевычелова Виолетта","СОШ№ 2",45,3.1249999999999997E-3,null,"",{"$f":"IF(G24<\"\",COUNT(1/FREQUENCY(IF((G$5:G$77<=G24)*(G$5:G$77>0),G$5:G$77),G$5:G$77)),\"\")","v":""},null,null,null,null,""]
[21,"Минаенкова Анастасия","СОШ№ 5",28,3.472222222222222E-3,null,"",{"$f":"IF(G25<\"\",COUNT(1/FREQUENCY(IF((G$5:G$77<=G25)*(G$5:G$77>0),G$5:G$77),G$5:G$77)),\"\")","v":""},null,null,null,null,""]
[22,"Саврасова Лилия","СОШ№ 2",6,3.472222222222222E-3,null,"",{"$f":"IF(G26<\"\",COUNT(1/FREQUENCY(IF((G$5:G$77<=G26)*(G$5:G$77>0),G$5:G$77),G$5:G$77)),\"\")","v":""},null,null,null,null,""]
[23,"Устинова Валерия","СОШ№ 2",46,3.8194444444444443E-3,null,"",{"$f":"IF(G27<\"\",COUNT(1/FREQUENCY(IF((G$5:G$77<=G27)*(G$5:G$77>0),G$5:G$77),G$5:G$77)),\"\")","v":""},null,null,null,null,""]
[24,"Лебедева Ангелина","СОШ№ 3",2,3.8194444444444443E-3,null,"",{"$f":"IF(G28<\"\",COUNT(1/FREQUENCY(IF((G$5:G$77<=G28)*(G$5:G$77>0),G$5:G$77),G$5:G$77)),\"\")","v":""},null,null,null,null,""]
[25,null,null,null,4.1666666666666666E-3,null,"",{"$f":"IF(G29<\"\",COUNT(1/FREQUENCY(IF((G$5:G$77<=G29)*(G$5:G$77>0),G$5:G$77),G$5:G$77)),\"\")","v":""},null,null,null,null,""]
[26,null,null,null,4.1666666666666666E-3,null,"",{"$f":"IF(G30<\"\",COUNT(1/FREQUENCY(IF((G$5:G$77<=G30)*(G$5:G$77>0),G$5:G$77),G$5:G$77)),\"\")","v":""},null,null,null,null,""]
[27,null,null,null,4.5138888888888893E-3,null,"",{"$f":"IF(G31<\"\",COUNT(1/FREQUENCY(IF((G$5:G$77<=G31)*(G$5:G$77>0),G$5:G$77),G$5:G$77)),\"\")","v":""},null,null,null,null,""]
[28,null,null,null,4.5138888888888893E-3,null,{"$f":"IF(F32=\"\",\"\",F32-E32)","v":""},{"$f":"IF(G32<\"\",COUNT(1/FREQUENCY(IF((G$5:G$77<=G32)*(G$5:G$77>0),G$5:G$77),G$5:G$77)),\"\")","v":""}]
[29,null,null,null,4.8611111111111112E-3,null,{"$f":"IF(F33=\"\",\"\",F33-E33)","v":""},{"$f":"IF(G33<\"\",COUNT(1/FREQUENCY(IF((G$5:G$77<=G33)*(G$5:G$77>0),G$5:G$77),G$5:G$77)),\"\")","v":""}]
[30,null,null,null,4.8611111111111112E-3,null,"",{"$f":"IF(G34<\"\",COUNT(1/FREQUENCY(IF((G$5:G$77<=G34)*(G$5:G$77>0),G$5:G$77),G$5:G$77)),\"\")","v":""}]
[31,null,null,null,5.208333333333333E-3,null,"",{"$f":"IF(G35<\"\",COUNT(1/FREQUENCY(IF((G$5:G$77<=G35)*(G$5:G$77>0),G$5:G$77),G$5:G$77)),\"\")","v":""}]
[32,null,null,null,5.208333333333333E-3,null,"",{"$f":"IF(G36<\"\",COUNT(1/FREQUENCY(IF((G$5:G$77<=G36)*(G$5:G$77>0),G$5:G$77),G$5:G$77)),\"\")","v":""}]
[33,null,null,null,5.5555555555555558E-3,null,"",{"$f":"IF(G37<\"\",COUNT(1/FREQUENCY(IF((G$5:G$77<=G37)*(G$5:G$77>0),G$5:G$77),G$5:G$77)),\"\")","v":""}]
[34,null,null,null,5.5555555555555558E-3,null,"",{"$f":"IF(G38<\"\",COUNT(1/FREQUENCY(IF((G$5:G$77<=G38)*(G$5:G$77>0),G$5:G$77),G$5:G$77)),\"\")","v":""}]
[35,null,null,null,5.9027777777777776E-3,null,"",{"$f":"IF(G39<\"\",COUNT(1/FREQUENCY(IF((G$5:G$77<=G39)*(G$5:G$77>0),G$5:G$77),G$5:G$77)),\"\")","v":""}]
[36,null,null,null,5.9027777777777776E-3,null,"",{"$f":"IF(G40<\"\",COUNT(1/FREQUENCY(IF((G$5:G$77<=G40)*(G$5:G$77>0),G$5:G$77),G$5:G$77)),\"\")","v":""}]
[37,null,null,null,6.2499999999999995E-3,null,"",{"$f":"IF(G41<\"\",COUNT(1/FREQUENCY(IF((G$5:G$77<=G41)*(G$5:G$77>0),G$5:G$77),G$5:G$77)),\"\")","v":""}]
[38,null,null,null,6.2499999999999995E-3,null,"",{"$f":"IF(G42<\"\",COUNT(1/FREQUENCY(IF((G$5:G$77<=G42)*(G$5:G$77>0),G$5:G$77),G$5:G$77)),\"\")","v":""}]
[39,null,null,null,6.5972222222222222E-3,null,"",{"$f":"IF(G43<\"\",COUNT(1/FREQUENCY(IF((G$5:G$77<=G43)*(G$5:G$77>0),G$5:G$77),G$5:G$77)),\"\")","v":""}]
[40,null,null,null,6.5972222222222222E-3,null,"",{"$f":"IF(G44<\"\",COUNT(1/FREQUENCY(IF((G$5:G$77<=G44)*(G$5:G$77>0),G$5:G$77),G$5:G$77)),\"\")","v":""}]
[41,null,null,null,6.9444444444444441E-3,null,"",{"$f":"IF(G45<\"\",COUNT(1/FREQUENCY(IF((G$5:G$77<=G45)*(G$5:G$77>0),G$5:G$77),G$5:G$77)),\"\")","v":""}]
[42,null,null,null,6.9444444444444441E-3,null,"",{"$f":"IF(G46<\"\",COUNT(1/FREQUENCY(IF((G$5:G$77<=G46)*(G$5:G$77>0),G$5:G$77),G$5:G$77)),\"\")","v":""}]
[43,null,null,null,7.2916666666666659E-3,null,"",{"$f":"IF(G47<\"\",COUNT(1/FREQUENCY(IF((G$5:G$77<=G47)*(G$5:G$77>0),G$5:G$77),G$5:G$77)),\"\")","v":""}]
[44,null,null,null,7.2916666666666659E-3,null,"",{"$f":"IF(G48<\"\",COUNT(1/FREQUENCY(IF((G$5:G$77<=G48)*(G$5:G$77>0),G$5:G$77),G$5:G$77)),\"\")","v":""}]
[45,null,null,null,7.6388888888888886E-3,null,"",{"$f":"IF(G49<\"\",COUNT(1/FREQUENCY(IF((G$5:G$77<=G49)*(G$5:G$77>0),G$5:G$77),G$5:G$77)),\"\")","v":""}]
[46,null,null,null,7.6388888888888886E-3,null,"",{"$f":"IF(G50<\"\",COUNT(1/FREQUENCY(IF((G$5:G$77<=G50)*(G$5:G$77>0),G$5:G$77),G$5:G$77)),\"\")","v":""}]
[47,null,null,null,7.9861111111111122E-3,null,"",{"$f":"IF(G51<\"\",COUNT(1/FREQUENCY(IF((G$5:G$77<=G51)*(G$5:G$77>0),G$5:G$77),G$5:G$77)),\"\")","v":""}]
[48,null,null,null,7.9861111111111122E-3,null,"",{"$f":"IF(G52<\"\",COUNT(1/FREQUENCY(IF((G$5:G$77<=G52)*(G$5:G$77>0),G$5:G$77),G$5:G$77)),\"\")","v":""}]
[49,null,null,null,8.3333333333333332E-3,null,"",{"$f":"IF(G53<\"\",COUNT(1/FREQUENCY(IF((G$5:G$77<=G53)*(G$5:G$77>0),G$5:G$77),G$5:G$77)),\"\")","v":""}]
[50,null,null,null,8.3333333333333332E-3,null,"",{"$f":"IF(G54<\"\",COUNT(1/FREQUENCY(IF((G$5:G$77<=G54)*(G$5:G$77>0),G$5:G$77),G$5:G$77)),\"\")","v":""}]
[51,null,null,null,8.6805555555555559E-3,null,"",{"$f":"IF(G55<\"\",COUNT(1/FREQUENCY(IF((G$5:G$77<=G55)*(G$5:G$77>0),G$5:G$77),G$5:G$77)),\"\")","v":""}]
[52,null,null,null,8.6805555555555559E-3,null,"",{"$f":"IF(G56<\"\",COUNT(1/FREQUENCY(IF((G$5:G$77<=G56)*(G$5:G$77>0),G$5:G$77),G$5:G$77)),\"\")","v":""}]
[53,null,null,null,9.0277777777777787E-3,null,"",{"$f":"IF(G57<\"\",COUNT(1/FREQUENCY(IF((G$5:G$77<=G57)*(G$5:G$77>0),G$5:G$77),G$5:G$77)),\"\")","v":""}]
[54,null,null,null,9.0277777777777787E-3,null,"",{"$f":"IF(G58<\"\",COUNT(1/FREQUENCY(IF((G$5:G$77<=G58)*(G$5:G$77>0),G$5:G$77),G$5:G$77)),\"\")","v":""}]
[55,null,null,null,9.3749999999999997E-3,null,"",{"$f":"IF(G59<\"\",COUNT(1/FREQUENCY(IF((G$5:G$77<=G59)*(G$5:G$77>0),G$5:G$77),G$5:G$77)),\"\")","v":""}]
[56,null,null,null,9.3749999999999997E-3,null,"",{"$f":"IF(G60<\"\",COUNT(1/FREQUENCY(IF((G$5:G$77<=G60)*(G$5:G$77>0),G$5:G$77),G$5:G$77)),\"\")","v":""}]
{"$rows_left_out":18}
{"sheet":"Сводный","index":2,"n_rows":8,"n_cols":6,"rows_kept":8,"cut":false,"hidden":false,"merged":[[0,0,0,6],[1,0,1,6],[2,0,2,6]]}
["Сводный протокол"]
["городских соревнований среди школ "]
["по лыжным гонкам г. Щигры-2018 год."]
["№ п/п","Команда     Город (район)","Время девушки 3 км","Время юноши         5 км","Общее время команды","Место команды"]
[1,{"$f":"'Юноши-5 км'!K5","v":"СОШ№ 2"},{"$f":"INDEX('Девушки-3 км'!$L$5:$L$100,MATCH(B5,'Девушки-3 км'!$K$5:$K$100,))","v":""},{"$f":"INDEX('Юноши-5 км'!$L$5:$L$100,MATCH(B5,'Юноши-5 км'!$K$5:$K$100,))","v":{"$error":"#NUM!"}},{"$f":"C5+D5","v":{"$error":"#VALUE!"}},{"$f":"IF(E5=\"\",\"\",RANK(E5,$E$5:$E$100,1))","v":{"$error":"#VALUE!"}}]
[2,{"$f":"'Юноши-5 км'!K6","v":"СОШ№ 5"},{"$f":"INDEX('Девушки-3 км'!$L$5:$L$100,MATCH(B6,'Девушки-3 км'!$K$5:$K$100,))","v":""},{"$f":"INDEX('Юноши-5 км'!$L$5:$L$100,MATCH(B6,'Юноши-5 км'!$K$5:$K$100,))","v":{"$error":"#NUM!"}},{"$f":"C6+D6","v":{"$error":"#VALUE!"}},{"$f":"IF(E6=\"\",\"\",RANK(E6,$E$5:$E$100,1))","v":{"$error":"#VALUE!"}}]
[3,{"$f":"'Юноши-5 км'!K7","v":"СОШ№ 3"},{"$f":"INDEX('Девушки-3 км'!$L$5:$L$100,MATCH(B7,'Девушки-3 км'!$K$5:$K$100,))","v":""},{"$f":"INDEX('Юноши-5 км'!$L$5:$L$100,MATCH(B7,'Юноши-5 км'!$K$5:$K$100,))","v":{"$error":"#NUM!"}},{"$error":"#VALUE!"},{"$error":"#VALUE!"}]
[4,{"$f":"'Юноши-5 км'!K8","v":"СОШ№ 4"},{"$f":"INDEX('Девушки-3 км'!$L$5:$L$100,MATCH(B8,'Девушки-3 км'!$K$5:$K$100,))","v":""},{"$f":"INDEX('Юноши-5 км'!$L$5:$L$100,MATCH(B8,'Юноши-5 км'!$K$5:$K$100,))","v":{"$error":"#NUM!"}},{"$error":"#VALUE!"},{"$error":"#VALUE!"}]