{"text_format":"1","workbook":"xlsx","n_sheets":3,"sheets":["Юноши-5 км","Девушки-3 км","Сводный"],"not_rendered":{"charts":0,"images":0,"macros":1,"external_links":0,"defined_names":1,"comments":0,"pivot_tables":0},"unopened":[],"bounds":{"document_bytes":16777216,"sheet_cells":100000,"rows_first":2000,"rows_last":500,"rows_between":2000,"halvings":0,"cell_chars":16384,"cell_head_chars":4096},"cells_cut":0,"cells_raw":0,"read":"whole","date_system":"1900"}

{"sheet":"Юноши-5 км","index":0,"n_rows":77,"n_cols":13,"rows_kept":77,"cut":false,"hidden":false,"merged":[[0,0,0,8],[1,0,1,8],[2,0,2,8],[1,10,1,11],[0,10,0,12]]}
["Протокол",null,null,null,null,null,null,null,null,null,"Командный протокол"]
["областных соревнований  по лыжным гонкам г. Щигры-2018 г.",null,null,null,null,null,null,null,null,null,"Юноши-5 км"]
["Юноши-5 км."]
[0,"Фамилия, имя","Команда     Город (район)","Номер участника","Время старта (ч:мм:сс)","Время финиша (ч:мм:сс)","Чистое время (ч:мм:сс)","Место","№ п/п","№ п/п","Команда     Город (район)","Сумма времени 3 лучших результатов команды","Место"]
[{"$f":"IF(AND(RIGHTB(C5,2)<>\"-л\",IFERROR(MATCH(C5,C$5:C5,),0)=ROW(A1)),A4+1,(A4+1)&\"\")","v":1},"Чевычелов Дмитрий","г. Щигры",74,0,1.2337962962962962E-2,{"$f":"IF(F5=\"\",\"\",F5-E5)","v":"00:17:46"},{"$f":"IF(G5<\"\",COUNT(1/FREQUENCY(IF((G$5:G$77<=G5)*(G$5:G$77>0),G$5:G$77),G$5:G$77)),\"\")","v":1},1,1,{"$f":"INDEX(C$5:C$18251,SMALL(A$5:A$18251,J5))","v":"г. Щигры"},{"$f":"SUM(SMALL(IF($C$5:$C$77=$K5,$G$5:$G$77),{1,2,3}))","v":"01:23:27"},{"$f":"RANK(L5,$L$5:$L$16,1)","v":{"$error":"#NUM!"}}]
[{"$f":"IF(AND(RIGHTB(C6,2)<>\"-л\",IFERROR(MATCH(C6,C$5:C6,),0)=ROW(A2)),A5+1,(A5+1)&\"\")","v":2},"Бобков Николай","Советский",30,1.3888888888888889E-3,1.3958333333333335E-2,{"$f":"IF(F6=\"\",\"\",F6-E6)","v":"00:18:06"},{"$f":"IF(G6<\"\",COUNT(1/FREQUENCY(IF((G$5:G$77<=G6)*(G$5:G$77>0),G$5:G$77),G$5:G$77)),\"\")","v":2},2,2,{"$f":"INDEX(C$5:C$18251,SMALL(A$5:A$18251,J6))","v":"Советский"},{"$f":"SUM(SMALL(IF($C$5:$C$77=$K6,$G$5:$G$77),{1,2,3}))","v":"01:09:44"},{"$f":"RANK(L6,$L$5:$L$16,1)","v":{"$error":"#NUM!"}}]
[{"$f":"IF(AND(RIGHTB(C7,2)<>\"-л\",IFERROR(MATCH(C7,C$5:C7,),0)=ROW(A3)),A6+1,(A6+1)&\"\")","v":3},"Ильин Андрей","Пристень",69,2.0833333333333333E-3,1.5914351851851853E-2,{"$f":"IF(F7=\"\",\"\",F7-E7)","v":"00:19:55"},{"$f":"IF(G7<\"\",COUNT(1/FREQUENCY(IF((G$5:G$77<=G7)*(G$5:G$77>0),G$5:G$77),G$5:G$77)),\"\")","v":3},3,3,"Пристень",{"$f":"SUM(SMALL(IF($C$5:$C$77=$K7,$G$5:$G$77),{1,2,3}))","v":"01:17:10"},{"$error":"#NUM!"}]
[{"$f":"IF(AND(RIGHTB(C8,2)<>\"-л\",IFERROR(MATCH(C8,C$5:C8,),0)=ROW(A4)),A7+1,(A7+1)&\"\")","v":4},"Боев Дмитрий","Горшечное",9,2.7777777777777779E-3,1.6643518518518519E-2,{"$f":"IF(F8=\"\",\"\",F8-E8)","v":"00:19:58"},{"$f":"IF(G8<\"\",COUNT(1/FREQUENCY(IF((G$5:G$77<=G8)*(G$5:G$77>0),G$5:G$77),G$5:G$77)),\"\")","v":4},4,4,"Горшечное",{"$f":"SUM(SMALL(IF($C$5:$C$77=$K8,$G$5:$G$77),{1,2,3}))","v":"01:26:22"},{"$error":"#NUM!"}]
[{"$f":"IF(AND(RIGHTB(C9,2)<>\"-л\",IFERROR(MATCH(C9,C$5:C9,),0)=ROW(A5)),A8+1,(A8+1)&\"\")","v":"5"},"Гордеев Дмитрий","г. Щигры-л",88,4.1666666666666666E-3,1.8831018518518518E-2,{"$f":"IF(F9=\"\",\"\",F9-E9)","v":"00:21:07"},{"$f":"IF(G9<\"\",COUNT(1/FREQUENCY(IF((G$5:G$77<=G9)*(G$5:G$77>0),G$5:G$77),G$5:G$77)),\"\")","v":5},5,5,"Курчатов",{"$f":"SUM(SMALL(IF($C$5:$C$77=$K9,$G$5:$G$77),{1,2,3}))","v":"01:26:49"},{"$error":"#NUM!"}]
[{"$f":"IF(AND(RIGHTB(C10,2)<>\"-л\",IFERROR(MATCH(C10,C$5:C10,),0)=ROW(A6)),A9+1,(A9+1)&\"\")","v":"6"},"Щеглов Даниил","Советский",44,4.8611111111111112E-3,1.9710648148148147E-2,{"$f":"IF(F10=\"\",\"\",F10-E10)","v":"00:21:23"},{"$f":"IF(G10<\"\",COUNT(1/FREQUENCY(IF((G$5:G$77<=G10)*(G$5:G$77>0),G$5:G$77),G$5:G$77)),\"\")","v":6},6,6,"Золотухино",{"$f":"SUM(SMALL(IF($C$5:$C$77=$K10,$G$5:$G$77),{1,2,3}))","v":"01:24:34"},{"$error":"#NUM!"}]
[{"$f":"IF(AND(RIGHTB(C11,2)<>\"-л\",IFERROR(MATCH(C11,C$5:C11,),0)=ROW(A7)),A10+1,(A10+1)&\"\")","v":"7"},"Смахтин Станислав","г. Щигры-л",24,6.9444444444444447E-4,1.5578703703703704E-2,{"$f":"IF(F11=\"\",\"\",F11-E11)","v":"00:21:26"},{"$f":"IF(G11<\"\",COUNT(1/FREQUENCY(IF((G$5:G$77<=G11)*(G$5:G$77>0),G$5:G$77),G$5:G$77)),\"\")","v":7},7,7,"Касторное",{"$f":"SUM(SMALL(IF($C$5:$C$77=$K11,$G$5:$G$77),{1,2,3}))","v":"01:41:53"},{"$error":"#NUM!"}]
[{"$f":"IF(AND(RIGHTB(C12,2)<>\"-л\",IFERROR(MATCH(C12,C$5:C12,),0)=ROW(A8)),A11+1,(A11+1)&\"\")","v":"8"},"Дерусов Дмитрий","Горшечное-л",40,7.6388888888888886E-3,2.4548611111111115E-2,{"$f":"IF(F12=\"\",\"\",F12-E12)","v":"00:24:21"},{"$f":"IF(G12<\"\",COUNT(1/FREQUENCY(IF((G$5:G$77<=G12)*(G$5:G$77>0),G$5:G$77),G$5:G$77)),\"\")","v":8},8,8,"Фатеж",{"$f":"SUM(SMALL(IF($C$5:$C$77=$K12,$G$5:$G$77),{1,2,3}))","v":"01:36:06"},{"$error":"#NUM!"}]
[{"$f":"IF(AND(RIGHTB(C13,2)<>\"-л\",IFERROR(MATCH(C13,C$5:C13,),0)=ROW(A9)),A12+1,(A12+1)&\"\")","v":9},"Исютин Никита","Курчатов",6,3.472222222222222E-3,2.0601851851851854E-2,{"$f":"IF(F13=\"\",\"\",F13-E13)","v":"00:24:40"},{"$f":"IF(G13<\"\",COUNT(1/FREQUENCY(IF((G$5:G$77<=G13)*(G$5:G$77>0),G$5:G$77),G$5:G$77)),\"\")","v":9},9,9,{"$error":"#NUM!"},{"$f":"SUM(SMALL(IF($C$5:$C$77=$K13,$G$5:$G$77),{1,2,3}))","v":{"$error":"#NUM!"}},{"$error":"#NUM!"}]
[{"$f":"IF(AND(RIGHTB(C14,2)<>\"-л\",IFERROR(MATCH(C14,C$5:C14,),0)=ROW(A10)),A13+1,(A13+1)&\"\")","v":"10"},"Андросов Владимир","Пристень",39,0,1.7384259259259262E-2,{"$f":"IF(F14=\"\",\"\",F14-E14)","v":"00:25:02"},{"$f":"IF(G14<\"\",COUNT(1/FREQUENCY(IF((G$5:G$77<=G14)*(G$5:G$77>0),G$5:G$77),G$5:G$77)),\"\")","v":10},10,10,{"$error":"#NUM!"},{"$f":"SUM(SMALL(IF($C$5:$C$77=$K14,$G$5:$G$77),{1,2,3}))","v":{"$error":"#NUM!"}},{"$error":"#NUM!"}]
[{"$f":"IF(AND(RIGHTB(C15,2)<>\"-л\",IFERROR(MATCH(C15,C$5:C15,),0)=ROW(A11)),A14+1,(A14+1)&\"\")","v":"11"},"Матусов Дмитрий","Горшечное-л",48,7.2916666666666659E-3,2.5891203703703704E-2,{"$f":"IF(F15=\"\",\"\",F15-E15)","v":"00:26:47"},{"$f":"IF(G15<\"\",COUNT(1/FREQUENCY(IF((G$5:G$77<=G15)*(G$5:G$77>0),G$5:G$77),G$5:G$77)),\"\")","v":11},11,11,{"$error":"#NUM!"},{"$f":"SUM(SMALL(IF($C$5:$C$77=$K15,$G$5:$G$77),{1,2,3}))","v":{"$error":"#NUM!"}},{"$error":"#NUM!"}]
[{"$f":"IF(AND(RIGHTB(C16,2)<>\"-л\",IFERROR(MATCH(C16,C$5:C16,),0)=ROW(A12)),A15+1,(A15+1)&\"\")","v":12},"Тишин Ярослав","Золотухино",71,3.1249999999999997E-3,2.1782407407407407E-2,{"$f":"IF(F16=\"\",\"\",F16-E16)","v":"00:26:52"},{"$f":"IF(G16<\"\",COUNT(1/FREQUENCY(IF((G$5:G$77<=G16)*(G$5:G$77>0),G$5:G$77),G$5:G$77)),\"\")","v":12},12,12,{"$error":"#NUM!"},{"$f":"SUM(SMALL(IF($C$5:$C$77=$K16,$G$5:$G$77),{1,2,3}))","v":{"$error":"#NUM!"}},{"$error":"#NUM!"}]
[{"$f":"IF(AND(RIGHTB(C17,2)<>\"-л\",IFERROR(MATCH(C17,C$5:C17,),0)=ROW(A13)),A16+1,(A16+1)&\"\")","v":"13"},"Петров Владимир","Золотухино",37,6.5972222222222222E-3,2.5983796296296297E-2,{"$f":"IF(F17=\"\",\"\",F17-E17)","v":"00:27:55"},{"$f":"IF(G17<\"\",COUNT(1/FREQUENCY(IF((G$5:G$77<=G17)*(G$5:G$77>0),G$5:G$77),G$5:G$77)),\"\")","v":13}]
[{"$f":"IF(AND(RIGHTB(C18,2)<>\"-л\",IFERROR(MATCH(C18,C$5:C18,),0)=ROW(A14)),A17+1,(A17+1)&\"\")","v":"14"},"Лашин Виталий","Пристень-л",4,7.2916666666666659E-3,2.6770833333333331E-2,{"$f":"IF(F18=\"\",\"\",F18-E18)","v":"00:28:03"},{"$f":"IF(G18<\"\",COUNT(1/FREQUENCY(IF((G$5:G$77<=G18)*(G$5:G$77>0),G$5:G$77),G$5:G$77)),\"\")","v":14}]
[{"$f":"IF(AND(RIGHTB(C19,2)<>\"-л\",IFERROR(MATCH(C19,C$5:C19,),0)=ROW(A15)),A18+1,(A18+1)&\"\")","v":"15"},"Дрюков Кирилл","Курчатов-л",13,7.6388888888888886E-3,2.8043981481481479E-2,{"$f":"IF(F19=\"\",\"\",F19-E19)","v":"00:29:23"},{"$f":"IF(G19<\"\",COUNT(1/FREQUENCY(IF((G$5:G$77<=G19)*(G$5:G$77>0),G$5:G$77),G$5:G$77)),\"\")","v":15}]
[{"$f":"IF(AND(RIGHTB(C20,2)<>\"-л\",IFERROR(MATCH(C20,C$5:C20,),0)=ROW(A16)),A19+1,(A19+1)&\"\")","v":16},"Плохих Сергей","Касторное",2,2.4305555555555556E-3,2.3032407407407404E-2,{"$f":"IF(F20=\"\",\"\",F20-E20)","v":"00:29:40"},{"$f":"IF(G20<\"\",COUNT(1/FREQUENCY(IF((G$5:G$77<=G20)*(G$5:G$77>0),G$5:G$77),G$5:G$77)),\"\")","v":16}]
[{"$f":"IF(AND(RIGHTB(C21,2)<>\"-л\",IFERROR(MATCH(C21,C$5:C21,),0)=ROW(A17)),A20+1,(A20+1)&\"\")","v":"17"},"Казаков Даниил","Золотухино",49,4.5138888888888893E-3,2.5196759259259256E-2,{"$f":"IF(F21=\"\",\"\",F21-E21)","v":"00:29:47"},{"$f":"IF(G21<\"\",COUNT(1/FREQUENCY(IF((G$5:G$77<=G21)*(G$5:G$77>0),G$5:G$77),G$5:G$77)),\"\")","v":17}]
[{"$f":"IF(AND(RIGHTB(C22,2)<>\"-л\",IFERROR(MATCH(C22,C$5:C22,),0)=ROW(A18)),A21+1,(A21+1)&\"\")","v":"18"},"Лобынцев Максим","Золотухино",56,6.9444444444444447E-4,2.1400462962962965E-2,{"$f":"IF(F22=\"\",\"\",F22-E22)","v":"00:29:49"},{"$f":"IF(G22<\"\",COUNT(1/FREQUENCY(IF((G$5:G$77<=G22)*(G$5:G$77>0),G$5:G$77),G$5:G$77)),\"\")","v":18}]
[{"$f":"IF(AND(RIGHTB(C23,2)<>\"-л\",IFERROR(MATCH(C23,C$5:C23,),0)=ROW(A19)),A22+1,(A22+1)&\"\")","v":19},"Горбатых Михаил","Фатеж",17,6.9444444444444441E-3,2.7708333333333331E-2,{"$f":"IF(F23=\"\",\"\",F23-E23)","v":"00:29:54"},{"$f":"IF(G23<\"\",COUNT(1/FREQUENCY(IF((G$5:G$77<=G23)*(G$5:G$77>0),G$5:G$77),G$5:G$77)),\"\")","v":19}]
[{"$f":"IF(AND(RIGHTB(C24,2)<>\"-л\",IFERROR(MATCH(C24,C$5:C24,),0)=ROW(A20)),A23+1,(A23+1)&\"\")","v":"20"},"Афонин Максим","г. Щигры",43,1.3888888888888889E-3,2.2291666666666668E-2,{"$f":"IF(F24=\"\",\"\",F24-E24)","v":"00:30:06"},{"$f":"IF(G24<\"\",COUNT(1/FREQUENCY(IF((G$5:G$77<=G24)*(G$5:G$77>0),G$5:G$77),G$5:G$77)),\"\")","v":20}]
[{"$f":"IF(AND(RIGHTB(C25,2)<>\"-л\",IFERROR(MATCH(C25,C$5:C25,),0)=ROW(A21)),A24+1,(A24+1)&\"\")","v":"21"},"Башкардин Евгений","Советский",59,5.5555555555555558E-3,2.6562499999999999E-2,{"$f":"IF(F25=\"\",\"\",F25-E25)","v":"00:30:15"},{"$f":"IF(G25<\"\",COUNT(1/FREQUENCY(IF((G$5:G$77<=G25)*(G$5:G$77>0),G$5:G$77),G$5:G$77)),\"\")","v":22}]
[{"$f":"IF(AND(RIGHTB(C26,2)<>\"-л\",IFERROR(MATCH(C26,C$5:C26,),0)=ROW(A22)),A25+1,(A25+1)&\"\")","v":"22"},"Кравцов Алексей","Курчатов",55,5.9027777777777776E-3,2.6909722222222224E-2,{"$f":"IF(F26=\"\",\"\",F26-E26)","v":"00:30:15"},{"$f":"IF(G26<\"\",COUNT(1/FREQUENCY(IF((G$5:G$77<=G26)*(G$5:G$77>0),G$5:G$77),G$5:G$77)),\"\")","v":22}]
[{"$f":"IF(AND(RIGHTB(C27,2)<>\"-л\",IFERROR(MATCH(C27,C$5:C27,),0)=ROW(A23)),A26+1,(A26+1)&\"\")","v":"23"},"Смольянинов Артемий","Касторное",26,3.4722222222222224E-4,2.1377314814814818E-2,{"$f":"IF(F27=\"\",\"\",F27-E27)","v":"00:30:17"},{"$f":"IF(G27<\"\",COUNT(1/FREQUENCY(IF((G$5:G$77<=G27)*(G$5:G$77>0),G$5:G$77),G$5:G$77)),\"\")","v":23}]
[{"$f":"IF(AND(RIGHTB(C28,2)<>\"-л\",IFERROR(MATCH(C28,C$5:C28,),0)=ROW(A24)),A27+1,(A27+1)&\"\")","v":"24"},"Кислинский Николай","Фатеж",20,5.9027777777777776E-3,2.7557870370370368E-2,{"$f":"IF(F28=\"\",\"\",F28-E28)","v":"00:31:11"},{"$f":"IF(G28<\"\",COUNT(1/FREQUENCY(IF((G$5:G$77<=G28)*(G$5:G$77>0),G$5:G$77),G$5:G$77)),\"\")","v":24}]
[{"$f":"IF(AND(RIGHTB(C29,2)<>\"-л\",IFERROR(MATCH(C29,C$5:C29,),0)=ROW(A25)),A28+1,(A28+1)&\"\")","v":"25"},"Смахтин Денис","г. Щигры-л",1124,5.5555555555555558E-3,2.732638888888889E-2,{"$f":"IF(F29=\"\",\"\",F29-E29)","v":"00:31:21"},{"$f":"IF(G29<\"\",COUNT(1/FREQUENCY(IF((G$5:G$77<=G29)*(G$5:G$77>0),G$5:G$77),G$5:G$77)),\"\")","v":25}]
[{"$f":"IF(AND(RIGHTB(C30,2)<>\"-л\",IFERROR(MATCH(C30,C$5:C30,),0)=ROW(A26)),A29+1,(A29+1)&\"\")","v":"26"},"Мельников Кирилл","Касторное-л",21,6.9444444444444441E-3,2.8738425925925928E-2,{"$f":"IF(F30=\"\",\"\",F30-E30)","v":"00:31:23"},{"$f":"IF(G30<\"\",COUNT(1/FREQUENCY(IF((G$5:G$77<=G30)*(G$5:G$77>0),G$5:G$77),G$5:G$77)),\"\")","v":26}]
{"$rows_left_out":48}
{"sheet":"Девушки-3 км","index":1,"n_rows":77,"n_cols":13,"rows_kept":77,"cut":false,"hidden":false,"merged":[[0,0,0,8],[1,0,1,8],[2,0,2,8],[1,10,1,11],[0,10,0,12]]}
["Протокол",null,null,null,null,null,null,null,null,null,"Командный протокол"]
["областных соревнований  по лыжным гонкам г. Щигры-2018 год",null,null,null,null,null,null,null,null,null,"Девушки-3 км"]
["Девушки -3 км."]
["№ п/п","Фамилия, имя","Команда     Город (район)","Номер участника","Время старта (ч:мм:сс)","Время финиша (ч:мм:сс)","Чистое время (ч:мм:сс)","Место","№ п/п","№ п/п","Команда     Город (район)","Сумма времени 3 лучших результатов команды","Место"]
[1,"Чевычелова Татьяна","г. Щигры",74,0,null,{"$f":"IF(F5=\"\",\"\",F5-E5)","v":""},{"$f":"IF(G5<\"\",COUNT(1/FREQUENCY(IF((G$5:G$77<=G5)*(G$5:G$77>0),G$5:G$77),G$5:G$77)),\"\")","v":""},1,1,{"$f":"IFERROR(LOOKUP(,-1/ISNA(MATCH($C$5:INDEX(C:C,MATCH(\"яяя\",$C$1:$C$77)),$K$4:K4,)),$C$5:$C$77),\"\")","v":"Касторное-л"},{"$f":"SUM(SMALL(IF($C$5:$C$77=$K5,$G$5:$G$77),{1,2,3}))","v":{"$error":"#NUM!"}},{"$f":"IF(L5=\"\",\"\",RANK(L5,$L$5:$L$12,1))","v":{"$error":"#NUM!"}}]
[2,"Ерина Мария","Пристень",39,0,null,"",{"$f":"IF(G6<\"\",COUNT(1/FREQUENCY(IF((G$5:G$77<=G6)*(G$5:G$77>0),G$5:G$77),G$5:G$77)),\"\")","v":""},2,2,{"$f":"IFERROR(LOOKUP(,-1/ISNA(MATCH($C$5:INDEX(C:C,MATCH(\"яяя\",$C$1:$C$77)),$K$4:K5,)),$C$5:$C$77),\"\")","v":"Горшечное-л"},{"$f":"SUM(SMALL(IF($C$5:$C$77=$K6,$G$5:$G$77),{1,2,3}))","v":{"$error":"#NUM!"}},{"$f":"IF(L6=\"\",\"\",RANK(L6,$L$5:$L$12,1))","v":{"$error":"#NUM!"}}]
[3,"Осипова Снежанна","Касторное",26,3.4722222222222224E-4,null,"",{"$f":"IF(G7<\"\",COUNT(1/FREQUENCY(IF((G$5:G$77<=G7)*(G$5:G$77>0),G$5:G$77),G$5:G$77)),\"\")","v":""},3,3,{"$f":"IFERROR(LOOKUP(,-1/ISNA(MATCH($C$5:INDEX(C:C,MATCH(\"яяя\",$C$1:$C$77)),$K$4:K6,)),$C$5:$C$77),\"\")","v":"Курчатов-л"},{"$f":"SUM(SMALL(IF($C$5:$C$77=$K7,$G$5:$G$77),{1,2,3}))","v":{"$error":"#NUM!"}},{"$error":"#NUM!"}]
[4,"Бартенева Ольга","Фатеж",25,3.4722222222222224E-4,null,"",{"$f":"IF(G8<\"\",COUNT(1/FREQUENCY(IF((G$5:G$77<=G8)*(G$5:G$77>0),G$5:G$77),G$5:G$77)),\"\")","v":""},4,4,{"$f":"IFERROR(LOOKUP(,-1/ISNA(MATCH($C$5:INDEX(C:C,MATCH(\"яяя\",$C$1:$C$77)),$K$4:K7,)),$C$5:$C$77),\"\")","v":"Пристень-л"},{"$f":"SUM(SMALL(IF($C$5:$C$77=$K8,$G$5:$G$77),{1,2,3}))","v":{"$error":"#NUM!"}},{"$error":"#NUM!"}]
[5,"Гричаненко Ирина","г. Щигры",24,6.9444444444444447E-4,null,"",{"$f":"IF(G9<\"\",COUNT(1/FREQUENCY(IF((G$5:G$77<=G9)*(G$5:G$77>0),G$5:G$77),G$5:G$77)),\"\")","v":""},5,5,{"$f":"IFERROR(LOOKUP(,-1/ISNA(MATCH($C$5:INDEX(C:C,MATCH(\"яяя\",$C$1:$C$77)),$K$4:K8,)),$C$5:$C$77),\"\")","v":"Фатеж"},{"$f":"SUM(SMALL(IF($C$5:$C$77=$K9,$G$5:$G$77),{1,2,3}))","v":{"$error":"#NUM!"}},{"$error":"#NUM!"}]
[6,"Широбокова Елена","Золотухино",56,6.9444444444444447E-4,null,"",{"$f":"IF(G10<\"\",COUNT(1/FREQUENCY(IF((G$5:G$77<=G10)*(G$5:G$77>0),G$5:G$77),G$5:G$77)),\"\")","v":""},6,6,{"$f":"IFERROR(LOOKUP(,-1/ISNA(MATCH($C$5:INDEX(C:C,MATCH(\"яяя\",$C$1:$C$77)),$K$4:K9,)),$C$5:$C$77),\"\")","v":"Золотухино"},{"$f":"SUM(SMALL(IF($C$5:$C$77=$K10,$G$5:$G$77),{1,2,3}))","v":{"$error":"#NUM!"}},{"$error":"#NUM!"}]
[7,"Куприянова Алёна","Курчатов",12,1.0416666666666667E-3,null,"",{"$f":"IF(G11<\"\",COUNT(1/FREQUENCY(IF((G$5:G$77<=G11)*(G$5:G$77>0),G$5:G$77),G$5:G$77)),\"\")","v":""},7,7,{"$f":"IFERROR(LOOKUP(,-1/ISNA(MATCH($C$5:INDEX(C:C,MATCH(\"яяя\",$C$1:$C$77)),$K$4:K10,)),$C$5:$C$77),\"\")","v":"Советский"},{"$f":"SUM(SMALL(IF($C$5:$C$77=$K11,$G$5:$G$77),{1,2,3}))","v":{"$error":"#NUM!"}},{"$error":"#NUM!"}]
[8,"Середина Анастасия","г. Щигры",47,1.0416666666666667E-3,null,{"$f":"IF(F12=\"\",\"\",F12-E12)","v":""},{"$f":"IF(G12<\"\",COUNT(1/FREQUENCY(IF((G$5:G$77<=G12)*(G$5:G$77>0),G$5:G$77),G$5:G$77)),\"\")","v":""},8,8,{"$f":"IFERROR(LOOKUP(,-1/ISNA(MATCH($C$5:INDEX(C:C,MATCH(\"яяя\",$C$1:$C$77)),$K$4:K11,)),$C$5:$C$77),\"\")","v":"Пристень"},{"$f":"SUM(SMALL(IF($C$5:$C$77=$K12,$G$5:$G$77),{1,2,3}))","v":{"$error":"#NUM!"}},{"$error":"#NUM!"}]
[9,"Маркова Анастасия","Советский",30,1.3888888888888889E-3,null,"",{"$f":"IF(G13<\"\",COUNT(1/FREQUENCY(IF((G$5:G$77<=G13)*(G$5:G$77>0),G$5:G$77),G$5:G$77)),\"\")","v":""},9,9,{"$f":"IFERROR(LOOKUP(,-1/ISNA(MATCH($C$5:INDEX(C:C,MATCH(\"яяя\",$C$1:$C$77)),$K$4:K12,)),$C$5:$C$77),\"\")","v":"Курчатов"},{"$f":"SUM(SMALL(IF($C$5:$C$77=$K13,$G$5:$G$77),{1,2,3}))","v":{"$error":"#NUM!"}},{"$error":"#NUM!"}]
[10,"Сергеева Яна","г. Щигры-л",43,1.3888888888888889E-3,null,"",{"$f":"IF(G14<\"\",COUNT(1/FREQUENCY(IF((G$5:G$77<=G14)*(G$5:G$77>0),G$5:G$77),G$5:G$77)),\"\")","v":""},10,10,{"$f":"IFERROR(LOOKUP(,-1/ISNA(MATCH($C$5:INDEX(C:C,MATCH(\"яяя\",$C$1:$C$77)),$K$4:K13,)),$C$5:$C$77),\"\")","v":"Фатеж-л"},{"$f":"SUM(SMALL(IF($C$5:$C$77=$K14,$G$5:$G$77),{1,2,3}))","v":{"$error":"#NUM!"}},{"$error":"#NUM!"}]
[11,"Захарова Евгения","Горшечное",3,1.736111111111111E-3,null,"",{"$f":"IF(G15<\"\",COUNT(1/FREQUENCY(IF((G$5:G$77<=G15)*(G$5:G$77>0),G$5:G$77),G$5:G$77)),\"\")","v":""},11,11,{"$f":"IFERROR(LOOKUP(,-1/ISNA(MATCH($C$5:INDEX(C:C,MATCH(\"яяя\",$C$1:$C$77)),$K$4:K14,)),$C$5:$C$77),\"\")","v":"г. Щигры"},{"$f":"SUM(SMALL(IF($C$5:$C$77=$K15,$G$5:$G$77),{1,2,3}))","v":{"$error":"#NUM!"}},{"$error":"#NUM!"}]
[12,"Плохих Анна","Фатеж",22,1.736111111111111E-3,null,"",{"$f":"IF(G16<\"\",COUNT(1/FREQUENCY(IF((G$5:G$77<=G16)*(G$5:G$77>0),G$5:G$77),G$5:G$77)),\"\")","v":""},12,12,{"$f":"IFERROR(LOOKUP(,-1/ISNA(MATCH($C$5:INDEX(C:C,MATCH(\"яяя\",$C$1:$C$77)),$K$4:K15,)),$C$5:$C$77),\"\")","v":"Касторное"},{"$f":"SUM(SMALL(IF($C$5:$C$77=$K16,$G$5:$G$77),{1,2,3}))","v":{"$error":"#NUM!"}},{"$error":"#NUM!"}]
[13,"Пигарева Анастасия","Пристень",69,2.0833333333333333E-3,null,"",{"$f":"IF(G17<\"\",COUNT(1/FREQUENCY(IF((G$5:G$77<=G17)*(G$5:G$77>0),G$5:G$77),G$5:G$77)),\"\")","v":""},null,13,{"$f":"IFERROR(LOOKUP(,-1/ISNA(MATCH($C$5:INDEX(C:C,MATCH(\"яяя\",$C$1:$C$77)),$K$4:K16,)),$C$5:$C$77),\"\")","v":"г. Щигры-л"},{"$f":"SUM(SMALL(IF($C$5:$C$77=$K17,$G$5:$G$77),{1,2,3}))","v":{"$error":"#NUM!"}},{"$error":"#NUM!"}]
[14,"Брагина Ирина","г. Щигры",49,2.0833333333333333E-3,null,"",{"$f":"IF(G18<\"\",COUNT(1/FREQUENCY(IF((G$5:G$77<=G18)*(G$5:G$77>0),G$5:G$77),G$5:G$77)),\"\")","v":""},null,14,{"$f":"IFERROR(LOOKUP(,-1/ISNA(MATCH($C$5:INDEX(C:C,MATCH(\"яяя\",$C$1:$C$77)),$K$4:K17,)),$C$5:$C$77),\"\")","v":"Горшечное"},{"$f":"SUM(SMALL(IF($C$5:$C$77=$K18,$G$5:$G$77),{1,2,3}))","v":{"$error":"#NUM!"}},{"$error":"#NUM!"}]
[15,"Трухачёва Анастасия","Горшечное",35,2.4305555555555556E-3,null,"",{"$f":"IF(G19<\"\",COUNT(1/FREQUENCY(IF((G$5:G$77<=G19)*(G$5:G$77>0),G$5:G$77),G$5:G$77)),\"\")","v":""},null,15,{"$f":"IFERROR(LOOKUP(,-1/ISNA(MATCH($C$5:INDEX(C:C,MATCH(\"яяя\",$C$1:$C$77)),$K$4:K18,)),$C$5:$C$77),\"\")","v":""},{"$f":"SUM(SMALL(IF($C$5:$C$77=$K19,$G$5:$G$77),{1,2,3}))","v":{"$error":"#NUM!"}},{"$error":"#NUM!"}]
[16,"Зубахина Снежанна","Касторное",2,2.4305555555555556E-3,null,"",{"$f":"IF(G20<\"\",COUNT(1/FREQUENCY(IF((G$5:G$77<=G20)*(G$5:G$77>0),G$5:G$77),G$5:G$77)),\"\")","v":""},null,16,{"$f":"IFERROR(LOOKUP(,-1/ISNA(MATCH($C$5:INDEX(C:C,MATCH(\"яяя\",$C$1:$C$77)),$K$4:K19,)),$C$5:$C$77),\"\")","v":""},{"$f":"SUM(SMALL(IF($C$5:$C$77=$K20,$G$5:$G$77),{1,2,3}))","v":{"$error":"#NUM!"}},{"$error":"#NUM!"}]
[17,"Болотова Анастасия","Горшечное",9,2.7777777777777779E-3,null,"",{"$f":"IF(G21<\"\",COUNT(1/FREQUENCY(IF((G$5:G$77<=G21)*(G$5:G$77>0),G$5:G$77),G$5:G$77)),\"\")","v":""}]
[18,"Антонова Анна","г. Щигры-л",148,2.7777777777777779E-3,null,"",{"$f":"IF(G22<\"\",COUNT(1/FREQUENCY(IF((G$5:G$77<=G22)*(G$5:G$77>0),G$5:G$77),G$5:G$77)),\"\")","v":""}]
[19,"Красникова Александра","Фатеж",1,3.1249999999999997E-3,null,"",{"$f":"IF(G23<\"\",COUNT(1/FREQUENCY(IF((G$5:G$77<=G23)*(G$5:G$77>0),G$5:G$77),G$5:G$77)),\"\")","v":""}]
[20,"Марьенкова Юлия","Золотухино",71,3.1249999999999997E-3,null,"",{"$f":"IF(G24<\"\",COUNT(1/FREQUENCY(IF((G$5:G$77<=G24)*(G$5:G$77>0),G$5:G$77),G$5:G$77)),\"\")","v":""}]
[21,"Туинова Ольга","Курчатов",6,3.472222222222222E-3,null,"",{"$f":"IF(G25<\"\",COUNT(1/FREQUENCY(IF((G$5:G$77<=G25)*(G$5:G$77>0),G$5:G$77),G$5:G$77)),\"\")","v":""}]
[22,"Беспалова Екатерина","Пристень",46,3.472222222222222E-3,null,"",{"$f":"IF(G26<\"\",COUNT(1/FREQUENCY(IF((G$5:G$77<=G26)*(G$5:G$77>0),G$5:G$77),G$5:G$77)),\"\")","v":""}]
[23,"Саврасова Лилия","г. Щигры-л",862,3.8194444444444443E-3,null,"",{"$f":"IF(G27<\"\",COUNT(1/FREQUENCY(IF((G$5:G$77<=G27)*(G$5:G$77>0),G$5:G$77),G$5:G$77)),\"\")","v":""}]
[24,"Кузьминова Алина","Горшечное",45,3.8194444444444443E-3,null,"",{"$f":"IF(G28<\"\",COUNT(1/FREQUENCY(IF((G$5:G$77<=G28)*(G$5:G$77>0),G$5:G$77),G$5:G$77)),\"\")","v":""}]
[25,"Чевычелова Виолетта","г. Щигры-л",88,4.1666666666666666E-3,null,"",{"$f":"IF(G29<\"\",COUNT(1/FREQUENCY(IF((G$5:G$77<=G29)*(G$5:G$77>0),G$5:G$77),G$5:G$77)),\"\")","v":""}]
[26,"Михайлова София","Касторное",70,4.1666666666666666E-3,null,"",{"$f":"IF(G30<\"\",COUNT(1/FREQUENCY(IF((G$5:G$77<=G30)*(G$5:G$77>0),G$5:G$77),G$5:G$77)),\"\")","v":""}]
{"$rows_left_out":48}
{"sheet":"Сводный","index":2,"n_rows":19,"n_cols":6,"rows_kept":19,"cut":false,"hidden":false,"merged":[[0,0,0,5],[1,0,1,5],[2,0,2,5]]}
["Сводный (итоговый) протокол"]
["областных соревнований среди обучающихся"]
["по лыжным гонкам г. Щигры-2018 год."]
["№ п/п","Команда     Город (район)","Время девушки 3 км","Время юноши         5 км","Общее время команды","Место команды"]
[1,{"$f":"'Юноши-5 км'!K5","v":"г. Щигры"},{"$f":"INDEX('Девушки-3 км'!$L$5:$L$100,MATCH(B5,'Девушки-3 км'!$K$5:$K$100,))","v":{"$error":"#NUM!"}},{"$f":"INDEX('Юноши-5 км'!$L$5:$L$100,MATCH(B5,'Юноши-5 км'!$K$5:$K$100,))","v":5.7951388888888899E-2},{"$f":"C5+D5","v":{"$error":"#NUM!"}},{"$f":"IF(E5=\"\",\"\",RANK(E5,$E$5:$E$100,1))","v":{"$error":"#NUM!"}}]
[2,{"$f":"'Юноши-5 км'!K6","v":"Советский"},{"$f":"INDEX('Девушки-3 км'!$L$5:$L$100,MATCH(B6,'Девушки-3 км'!$K$5:$K$100,))","v":{"$error":"#NUM!"}},{"$f":"INDEX('Юноши-5 км'!$L$5:$L$100,MATCH(B6,'Юноши-5 км'!$K$5:$K$100,))","v":4.8425925925925928E-2},{"$f":"C6+D6","v":{"$error":"#NUM!"}},{"$f":"IF(E6=\"\",\"\",RANK(E6,$E$5:$E$100,1))","v":{"$error":"#NUM!"}}]
[3,{"$f":"'Юноши-5 км'!K7","v":"Пристень"},{"$f":"INDEX('Девушки-3 км'!$L$5:$L$100,MATCH(B7,'Девушки-3 км'!$K$5:$K$100,))","v":{"$error":"#NUM!"}},{"$f":"INDEX('Юноши-5 км'!$L$5:$L$100,MATCH(B7,'Юноши-5 км'!$K$5:$K$100,))","v":5.3587962962962969E-2},{"$error":"#NUM!"},{"$error":"#NUM!"}]
[4,{"$f":"'Юноши-5 км'!K8","v":"Горшечное"},{"$f":"INDEX('Девушки-3 км'!$L$5:$L$100,MATCH(B8,'Девушки-3 км'!$K$5:$K$100,))","v":{"$error":"#NUM!"}},{"$f":"INDEX('Юноши-5 км'!$L$5:$L$100,MATCH(B8,'Юноши-5 км'!$K$5:$K$100,))","v":5.9976851851851851E-2},{"$error":"#NUM!"},{"$error":"#NUM!"}]
[5,{"$f":"'Юноши-5 км'!K9","v":"Курчатов"},{"$f":"INDEX('Девушки-3 км'!$L$5:$L$100,MATCH(B9,'Девушки-3 км'!$K$5:$K$100,))","v":{"$error":"#NUM!"}},{"$f":"INDEX('Юноши-5 км'!$L$5:$L$100,MATCH(B9,'Юноши-5 км'!$K$5:$K$100,))","v":6.0289351851851858E-2},{"$error":"#NUM!"},{"$error":"#NUM!"}]
[6,{"$f":"'Юноши-5 км'!K10","v":"Золотухино"},{"$f":"INDEX('Девушки-3 км'!$L$5:$L$100,MATCH(B10,'Девушки-3 км'!$K$5:$K$100,))","v":{"$error":"#NUM!"}},{"$f":"INDEX('Юноши-5 км'!$L$5:$L$100,MATCH(B10,'Юноши-5 км'!$K$5:$K$100,))","v":5.872685185185185E-2},{"$error":"#NUM!"},{"$error":"#NUM!"}]
[7,{"$f":"'Юноши-5 км'!K11","v":"Касторное"},{"$f":"INDEX('Девушки-3 км'!$L$5:$L$100,MATCH(B11,'Девушки-3 км'!$K$5:$K$100,))","v":{"$error":"#NUM!"}},{"$f":"INDEX('Юноши-5 км'!$L$5:$L$100,MATCH(B11,'Юноши-5 км'!$K$5:$K$100,))","v":7.075231481481481E-2},{"$error":"#NUM!"},{"$error":"#NUM!"}]
[8,{"$f":"'Юноши-5 км'!K12","v":"Фатеж"},{"$f":"INDEX('Девушки-3 км'!$L$5:$L$100,MATCH(B12,'Девушки-3 км'!$K$5:$K$100,))","v":{"$error":"#NUM!"}},{"$f":"INDEX('Юноши-5 км'!$L$5:$L$100,MATCH(B12,'Юноши-5 км'!$K$5:$K$100,))","v":6.6736111111111107E-2},{"$error":"#NUM!"},{"$error":"#NUM!"}]
[9,{"$f":"'Юноши-5 км'!K13","v":{"$error":"#NUM!"}},{"$f":"INDEX('Девушки-3 км'!$L$5:$L$100,MATCH(B13,'Девушки-3 км'!$K$5:$K$100,))","v":{"$error":"#NUM!"}},{"$f":"INDEX('Юноши-5 км'!$L$5:$L$100,MATCH(B13,'Юноши-5 км'!$K$5:$K$100,))","v":{"$error":"#NUM!"}},{"$error":"#NUM!"},{"$error":"#NUM!"}]
[10,{"$f":"'Юноши-5 км'!K14","v":{"$error":"#NUM!"}},{"$f":"INDEX('Девушки-3 км'!$L$5:$L$100,MATCH(B14,'Девушки-3 км'!$K$5:$K$100,))","v":{"$error":"#NUM!"}},{"$f":"INDEX('Юноши-5 км'!$L$5:$L$100,MATCH(B14,'Юноши-5 км'!$K$5:$K$100,))","v":{"$error":"#NUM!"}},{"$error":"#NUM!"},{"$error":"#NUM!"}]
[11,{"$f":"'Юноши-5 км'!K15","v":{"$error":"#NUM!"}},{"$f":"INDEX('Девушки-3 км'!$L$5:$L$100,MATCH(B15,'Девушки-3 км'!$K$5:$K$100,))","v":{"$error":"#NUM!"}},{"$f":"INDEX('Юноши-5 км'!$L$5:$L$100,MATCH(B15,'Юноши-5 км'!$K$5:$K$100,))","v":{"$error":"#NUM!"}},{"$error":"#NUM!"},{"$error":"#NUM!"}]
[12,{"$f":"'Юноши-5 км'!K16","v":{"$error":"#NUM!"}},{"$f":"INDEX('Девушки-3 км'!$L$5:$L$100,MATCH(B16,'Девушки-3 км'!$K$5:$K$100,))","v":{"$error":"#NUM!"}},{"$f":"INDEX('Юноши-5 км'!$L$5:$L$100,MATCH(B16,'Юноши-5 км'!$K$5:$K$100,))","v":{"$error":"#NUM!"}},{"$error":"#NUM!"},{"$error":"#NUM!"}]
[12,{"$f":"'Юноши-5 км'!K17","v":0},{"$f":"INDEX('Девушки-3 км'!$L$5:$L$100,MATCH(B17,'Девушки-3 км'!$K$5:$K$100,))","v":{"$error":"#N/A"}},{"$f":"INDEX('Юноши-5 км'!$L$5:$L$100,MATCH(B17,'Юноши-5 км'!$K$5:$K$100,))","v":{"$error":"#N/A"}},{"$error":"#N/A"},{"$error":"#N/A"}]
[12,{"$f":"'Юноши-5 км'!K18","v":0},{"$f":"INDEX('Девушки-3 км'!$L$5:$L$100,MATCH(B18,'Девушки-3 км'!$K$5:$K$100,))","v":{"$error":"#N/A"}},{"$f":"INDEX('Юноши-5 км'!$L$5:$L$100,MATCH(B18,'Юноши-5 км'!$K$5:$K$100,))","v":{"$error":"#N/A"}},{"$error":"#N/A"},{"$error":"#N/A"}]
[13,{"$f":"'Юноши-5 км'!K19","v":0},{"$f":"INDEX('Девушки-3 км'!$L$5:$L$100,MATCH(B19,'Девушки-3 км'!$K$5:$K$100,))","v":{"$error":"#N/A"}},{"$f":"INDEX('Юноши-5 км'!$L$5:$L$100,MATCH(B19,'Юноши-5 км'!$K$5:$K$100,))","v":{"$error":"#N/A"}},{"$error":"#N/A"},{"$error":"#N/A"}]