{"text_format":"1","workbook":"xlsx","n_sheets":3,"sheets":["Заполнить","ПЛ1","Лист1"],"not_rendered":{"charts":0,"images":3,"macros":1,"external_links":0,"defined_names":0,"comments":0,"pivot_tables":0},"unopened":[],"bounds":{"document_bytes":16777216,"sheet_cells":100000,"rows_first":2000,"rows_last":500,"rows_between":2000,"halvings":0,"cell_chars":16384,"cell_head_chars":4096},"cells_cut":0,"cells_raw":0,"read":"whole","date_system":"1900"}

{"sheet":"Заполнить","index":0,"n_rows":117,"n_cols":14,"rows_kept":117,"cut":false,"hidden":false,"merged":[[4,12,5,12],[4,11,5,11],[4,2,5,2],[4,3,5,3],[4,4,5,4],[4,8,5,10]]}
[null,null,false]
[null,null,false,null,null,null,null,null,null,null,"Дата выписки",5,"марта",2018]
[]
[]
["№ п/п","Фамилия Имя Отчество","Краткое Имя","Диспетчер","номер водительского удостоверения","Закрепленное автотранспортное средство",null,null,null,null,null,"Выбор печати"]
[null,null,null,null,null,"Марка, модель автомобиля"," Гос. регистрац. знак","Тип автомобиля                                                  "]
[]
[1,"Гаврилов Валерий Анатольевич","Гаврилов В.А.","Гришина Л.Н.",123123,"TOYOTA CAMRI ","Н 007 РВ 63","легкового"]
[2,"Ваняев  Александр Владимирович","Варин Г.А.","Гришина Л.Н.",123124,"HYUNDAI NF 2.0 GLS AT","К 496 ВК 163","легкового"]
[3,"Глухов Дмитрий Алексеевич","Глухов Д. А.","Гришина Л.Н.",123125,"TOYOTA CAMRI ","Н 007 РА 63","легкового"]
[4,null,null,null,123126,"ТОЙОТА LK100","О 007 ХМ 63","легкового"]
[5,null,null,null,123127,"ТОЙОТА LK ПРАДО","Х 007 УА 63","легкового"]
[6,null,null,null,123128,"ТОЙОТА КАМРИ ","О 007 РМ 63","легкового"]
[7,null,null,null,123129,"HYUNDAI NF 2.0 GLS AT","К 498 ВК 163","легкового"]
[8,null,null,null,123130,"ФОЛЬКСВАГЕН КАРАВЕЛЛА","О 004 УН 63","легкового"]
[9,null,null,null,123131,"VOLKSWAGEN JETTA","М 397 АУ 163","легкового"]
[10,null,null,null,123132,"ШЕВРОЛЕ НИВА    ","К 433 УУ 63","легкового"]
[11,null,null,null,123133,"ШЕВРОЛЕ НИВА    ","Е 907 АО 163","легкового"]
[12,"Агафонов  Борис Иванович",null,null,123134,"ШЕВРОЛЕ НИВА    ","Н 341 УУ 63","легкового"]
[null,"Балбашов Сергей  Иванович"]
[null,"Баранов Олег Николаевич"]
[null,"Баулин Алексей  Степанович"]
[null,"Белякин Евгений Михайлович"]
[null,"Белякин Евгений Михайлович"]
[null,"Бондаренко Виктор Алексеевич"]
[null,"Борисенков Николай Максимович"]
[null,"Бояров  Владимир Николаевич"]
[null,"Ваканция"]
[null,"Ваканция"]
[null,"Ваканция"]
[null,"Ваканция"]
[null,"Ваканция"]
[null,"Ваняев  Александр Владимирович",{"$f":"VLOOKUP($B33,Лист1!$B$3:$H$101,2,FALSE)","v":0},{"$f":"VLOOKUP($B33,Лист1!$B$3:$H$101,3,FALSE)","v":0}]
[null,"Глухов Дмитрий Алексеевич",{"$f":"VLOOKUP($B34,Лист1!$B$3:$H$101,2,FALSE)","v":"Глухов Д. А."},{"$f":"VLOOKUP($B34,Лист1!$B$3:$H$101,3,FALSE)","v":"Гришина Л.Н."}]
[null,"Вдовин  Александр Геннадьевич",{"$f":"VLOOKUP($B35,Лист1!$B$3:$H$101,2,FALSE)","v":0},{"$f":"VLOOKUP($B35,Лист1!$B$3:$H$101,3,FALSE)","v":0}]
[null,"Вишневский Алексей  Иванович"]
[null,"Вишневский Алексей  Иванович"]
[null,"Гаврилов Валерий Анатольевич"]
[null,"Газеев Леонид Николаевич"]
[null,"Глинчиков Владимир Николаевич"]
[null,"Глухов Дмитрий Алексеевич"]
[null,"Говар Александр Сергеевич"]
[null,"Губайдулин Алексей  Абдуллозянович"]
[null,"Губайдулин Алексей  Абдуллозянович"]
[null,"Гугнин Петр  Константинович   "]
[null,"Демин Юрий Валерьевич"]
[null,"Димитрюк Александр Владимирович"]
[null,"Дмитриев Александр Геннадьевич"]
[null,"Доброхлебов Александр Борисович"]
[null,"Доброхлебов Александр Борисович"]
[null,"Доброхлебов Александр Борисович"]
[null,"Долгинов  Владимир Петрович"]
[null,"Долгинов  Владимир Петрович"]
[null,"Долгинов  Владимир Петрович"]
[null,"Емельянов Юрий Михайлович "]
[null,"Зинин Владимир Геннадьевич"]
[null,"Кайдаров Дмитрий Викторович"]
[null,"Каленов Петр Борисович"]
[null,"Каленов Петр Борисович"]
[null,"Каленов Петр Борисович"]
[null,"Калинкин Виталий  Юрьевич"]
[null,"Кириллов Юрий Афанасьевия"]
[null,"Коженов Сергей Ростиславович"]
[null,"Кожин Александр Гаврилович"]
[null,"Кортушов Сергей Александрович"]
[null,"Кортушов Сергей Александрович"]
[null,"Кортушов Сергей Александрович"]
[null,"Косачев Петр Иванович"]
[null,"Кочетков Виктор Анатольевич"]
[null,"Кудряшов Александр Николаевич"]
[null,"Кузнецов Евгений Дмитриевич"]
[null,"Кулаков Александр Степанович"]
[null,"Кулишов Сергей Алексеевич"]
[null,"Куценко Виталий Александрович"]
[null,"Лабжинов Анатолий Михайлович"]
[null,"Латыпов Радий Мансурович"]
[null,"Лепишин Сергей Евгеньевич"]
[null,"Лошкарев Иван Васильевич"]
[null,"Лошкарев Иван Васильевич"]
[null,"Лошкарев Иван Васильевич"]
{"$rows_left_out":38}
{"sheet":"ПЛ1","index":1,"n_rows":45,"n_cols":72,"rows_kept":45,"cut":false,"hidden":false,"merged":[[44,55,44,63],[44,65,44,84],[1,46,1,51],[0,2,0,18],[0,38,0,53],[40,0,40,43],[41,0,42,18],[42,19,42,26],[42,29,42,42],[42,71,42,84],[43,19,43,25],[43,27,43,43],[43,65,43,84],[37,15,37,43],[37,71,37,84],[38,0,38,43],[38,71,38,84],[39,0,39,43],[39,71,39,84],[34,20,34,26],[34,28,34,44],[34,71,34,84],[35,0,35,43],[35,71,35,84],[36,71,36,84],[29,20,29,26],[29,29,29,43],[30,20,30,26],[30,28,30,44],[30,71,30,84],[31,71,33,84],[32,32,32,43],[33,20,33,26],[33,29,33,43],[33,54,33,70],[25,0,25,43],[25,44,26,56],[25,57,25,70],[25,71,25,84],[26,57,27,70],[26,71,27,84],[27,30,27,43],[23,17,23,43],[23,57,23,65],[23,67,23,84],[24,0,24,43],[24,57,24,65],[24,67,24,84],[20,0,20,27],[9,12,9,48],[10,18,10,54],[10,66,10,81],[16,59,16,67],[16,69,16,88],[17,16,17,43],[18,16,18,43],[19,0,19,27],[19,29,19,43],[19,56,19,63],[19,65,19,84],[7,34,7,48],[7,49,7,66],[7,67,7,84],[8,12,8,48],[8,49,8,66],[8,67,8,84],[2,67,2,84],[3,67,3,84],[4,67,4,84],[5,17,5,53],[6,21,6,62],[6,67,6,84],[0,70,0,74],[0,75,0,84],[1,29,1,31],[1,34,1,44],[1,61,1,69],[0,19,0,37]]}
[null,null,"Путевой лист",null,null,null,null,null,null,null,null,null,null,null,null,null,null,null,null,{"$f":"Заполнить!$I$7","v":0},null,null,null,null,null,null,null,null,null,null,null,null,null,null,null,null,null,null,"автомобиля",null,null,null,null,null,null,null,null,null,null,null,null,null,null,null,null,null,null,null,null,null,null,null,null,null,null,null,null,null,null,null,"№"]
[null,null,null,null,null,null,null,null,null,null,null,null,null,null,null,null,null,null,null,null,null,null,null,null,null,null,null,null,"«",{"$f":"Заполнить!$M$2","v":"марта"},null,null,"»",null,{"$f":"Заполнить!$N$2","v":2018},null,null,null,null,null,null,null,null,null,null,null,{"$f":"Заполнить!$O$2","v":0},null,null,null,null,null," г."]
[null,null,null,null,null,null,null,null,null,null,null,null,null,null,"ПАО \"Белые столбы\", ОГРН 256987456369",null,null,null,null,null,null,null,null,null,null,null,null,null,null,null,null,null,null,null,null,null,null,null,null,null,null,null,null,null,null,null,null,null,null,null,null,null,null,null,null,null,null,null,null,null,null,null,null,null,null,null,null,"Коды"]
[null,null,null,null,null,null,null,null,null,null,null,null,null,null,"г. Самара ул. Озерская д. 17",null,null,null,null,null,null,null,null,null,null,null,null,null,null,null,null,null,null,null,null,null,null,null,null,null,null,null,null,null,null,null,null,null,null,null,null,null,null,null,null,null,null,null,null,null,null,null,null,null,null,"Форма по ОКУД",null,"0345001"]
[null,"Организация",null,null,null,null,null,null,null,null,null,null,null,null,"т. (846) 333-10-265",null,null,null,null,null,null,null,null,null,null,null,null,null,null,null,null,null,null,null,null,null,null,null,null,null,null,null,null,null,null,null,null,null,null,null,null,null,null,null,null,null,null,null,null,null,null,null,null,null,null,"по ОКПО"]
[null,null,null,null,null,null,null,null,null,null,null,null,null,null,null,null,null,"(наименование, ОГРН, адрес, номер телефона)"]
[null,"Марка автомобиля",null,null,null,null,null,null,null,null,null,null,null,null,null,null,null,null,null,null,null,{"$f":"Заполнить!$G$7","v":0}]
[null,"Государственный номерной знак",null,null,null,null,null,null,null,null,null,null,null,null,null,null,null,null,null,null,null,null,null,null,null,null,null,null,null,null,null,null,null,null,{"$f":"Заполнить!$H$7","v":0},null,null,null,null,null,null,null,null,null,null,null,null,null,null,"Гаражный номер  "]
[null,"Водитель",null,null,null,null,null,null,null,null,null,null,{"$f":"Заполнить!$B$7","v":0},null,null,null,null,null,null,null,null,null,null,null,null,null,null,null,null,null,null,null,null,null,null,null,null,null,null,null,null,null,null,null,null,null,null,null,null,"Табельный номер  ",null,null,null,null,null,null,null,null,null,null,null,null,null,null,null,null,null,{"$f":"Заполнить!$A$7","v":0}]
[null,null,null,null,null,null,null,null,null,null,null,null,"(фамилия, имя, отчество)"]
[null,"Удостоверение №",null,null,null,null,null,null,null,null,null,null,null,null,null,null,null,null,{"$f":"Заполнить!$E$7","v":0},null,null,null,null,null,null,null,null,null,null,null,null,null,null,null,null,null,null,null,null,null,null,null,null,null,null,null,null,null,null,null,null,null,null,null,null,null,null,null,null,null,"Класс"]
[]
[]
[null,null,null,null,null,null,null,null,null,null,null,null,null,null,null,null,null,null,null,null,null,null,null,null,null,null,null,null,null,null,null,null,null,null,null,null,null,null,null,null,null,null,null,null,null,null,null,null,null,"Прошел предрейсовый контроль"]
[null,null,null,null,null,null,null,null,null,null,null,null,null,null,null,null,null,null,null,null,null,null,null,null,null,null,null,null,null,null,null,null,null,null,null,null,null,null,null,null,null,null,null,null,null,null,null,null,null,"технического состояния"]
[null,null,null,null,null,null,null,null,null,null,"Задание водителю",null,null,null,null,null,null,null,null,null,null,null,null,null,null,null,null,null,null,null,null,null,null,null,null,null,null,null,null,null,null,null,null,null,null,null,null,null,null,"Контролер ____________________"]
[null,null,null,null,null,null,null,null,null,null,null,null,null,null,null,null,null,null,null,null,null,null,null,null,null,null,null,null,null,null,null,null,null,null,null,null,null,null,null,null,null,null,null,null,null,null,null,null,null,null,null,null,null,null,null,null,null,null,null,"(подпись)",null,null,null,null,null,null,null,null,null,"(расшифровка подписи)"]
[null,"В распоряжение",null,null,null,null,null,null,null,null,null,null,null,null,null,null,null,null,null,null,null,null,null,null,null,null,null,null,null,null,null,null,null,null,null,null,null,null,null,null,null,null,null,null,null,null,null,"Дата, время проведения контроля"]
[null,null,null,null,null,null,null,null,null,null,null,null,null,null,null,null,"(наименование)",null,null,null,null,null,null,null,null,null,null,null,null,null,null,null,null,null,null,null,null,null,null,null,null,null,null,null,null,null,null,null,null,"___________   __________"]
[null,null,null,null,null,null,null,null,null,null,null,null,null,null,null,null,null,null,null,null,null,null,null,null,null,null,null,null,null,null,null,null,null,null,null,null,null,null,null,null,null,null,null,null,null,null,null,null,null,null,"дата",null,null,null,null,null,null,null,null,null,null,null,null,null,null,"время"]
["(организация)",null,null,null,null,null,null,null,null,null,null,null,null,null,null,null,null,null,null,null,null,null,null,null,null,null,null,null,null,null,null,null,null,null,null,null,null,null,null,null,null,null,null,null,null,null,"Показания одометра, км"]
[null,null,null,null,null,null,null,null,null,null,null,null,null,null,null,null,null,null,null,null,null,null,null,null,null,null,null,null,null,null,null,null,null,null,null,null,null,null,null,null,null,null,null,null,null,null,"Автомобиль в технически"]
[null,null,null,null,null,null,null,null,null,null,null,null,null,null,null,null,null,null,null,null,null,null,null,null,null,null,null,null,null,null,null,null,null,null,null,null,null,null,null,null,null,null,null,null,null,null,"исправном состоянии принял"]
[null,"Адрес подачи",null,null,null,null,null,null,null,null,null,null,null,null,null,null,null,null,null,null,null,null,null,null,null,null,null,null,null,null,null,null,null,null,null,null,null,null,null,null,null,null,null,null,null,null,"Водитель",null,null,null,null,null,null,null,null,null,null,null,null,null,null,null,null,null,null,null,null,{"$f":"Заполнить!$C$7","v":0}]
[null,null,null,null,null,null,null,null,null,null,null,null,null,null,null,null,null,null,null,null,null,null,null,null,null,null,null,null,null,null,null,null,null,null,null,null,null,null,null,null,null,null,null,null,null,null,null,null,null,null,null,null,null,null,null,null,null,"(подпись)",null,null,null,null,null,null,null,null,null,"(расшифровка подписи)"]
[null,null,null,null,null,null,null,null,null,null,null,null,null,null,null,null,null,null,null,null,null,null,null,null,null,null,null,null,null,null,null,null,null,null,null,null,null,null,null,null,null,null,null,null,"Горючее",null,null,null,null,null,null,null,null,null,null,null,null,"марка",null,null,null,null,null,null,null,null,null,null,null,null,null,"код"]
[]
[null,"Время выезда из гаража, ч. мин."]
[]
[null,"Диспетчер-нарядчик",null,null,null,null,null,null,null,null,null,null,null,null,null,null,null,null,null,null,null,null,null,null,null,null,null,null,null,{"$f":"Заполнить!$D$7","v":0},null,null,null,null,null,null,null,null,null,null,null,null,null,null,null,null,null,null,null,null,null,null,"Движение горючего"]
[null,null,null,null,null,null,null,null,null,null,null,null,null,null,null,null,null,null,null,null,"(подпись)",null,null,null,null,null,null,null,"(расшифровка подписи)",null,null,null,null,null,null,null,null,null,null,null,null,null,null,null,null,null,null,null,null,null,null,null,null,null,null,null,null,null,null,null,null,null,null,null,null,null,null,null,null,null,null,"количество,\nл"]
[null,null,null,null,null,null,null,null,null,null,null,null,null,null,null,null,null,null,null,null,null,null,null,null,null,null,null,null,null,null,null,null,null,null,null,null,null,null,null,null,null,null,null,null,null,null,null,null,null,"Выдано:"]
[null,"Время возвращения в гараж, ч. мин.",null,null,null,null,null,null,null,null,null,null,null,null,null,null,null,null,null,null,null,null,null,null,null,null,null,null,null,null,null,null,null,null,null,null,null,null,null,null,null,null,null,null,null,"по заправочному"]
[null,"Диспетчер-нарядчик",null,null,null,null,null,null,null,null,null,null,null,null,null,null,null,null,null,null,null,null,null,null,null,null,null,null,null,null,null,null,null,null,null,null,null,null,null,null,null,null,null,null,null,"листу №"]
[null,null,null,null,null,null,null,null,null,null,null,null,null,null,null,null,null,null,null,null,"(подпись)",null,null,null,null,null,null,null,"(расшифровка подписи)",null,null,null,null,null,null,null,null,null,null,null,null,null,null,null,null,"Остаток: при выезде"]
[null,null,null,null,null,null,null,null,null,null,null,null,null,null,null,null,null,null,null,null,null,null,null,null,null,null,null,null,null,null,null,null,null,null,null,null,null,null,null,null,null,null,null,null,null,null,null,null,null,null,null,null,null,"при возвращении"]
[null,null,null,null,null,null,null,null,null,null,null,null,null,null,null,null,null,null,null,null,null,null,null,null,null,null,null,null,null,null,null,null,null,null,null,null,null,null,null,null,null,null,null,null,null,"Расход: по норме"]
[null,null,null,null,null,null,null,null,null,null,null,null,null,null,null,null,null,null,null,null,null,null,null,null,null,null,null,null,null,null,null,null,null,null,null,null,null,null,null,null,null,null,null,null,null,null,null,null,null,null,null,null,"фактический"]
[null,null,null,null,null,null,null,null,null,null,null,null,null,null,null,null,null,null,null,null,null,null,null,null,null,null,null,null,null,null,null,null,null,null,null,null,null,null,null,null,null,null,null,null,null,"Экономия"]
[null,null,null,null,null,null,null,null,null,null,null,null,null,null,null,null,null,null,null,null,null,null,null,null,null,null,null,null,null,null,null,null,null,null,null,null,null,null,null,null,null,null,null,null,null,"Перерасход"]
[null,null,null,null,null,null,null,null,null,null,null,null,null,null,null,null,null,null,null,null,null,null,null,null,null,null,null,null,null,null,null,null,null,null,null,null,null,null,null,null,null,null,null,null,null,"Автомобиль принял. Показания спидо-"]
["Автомобиль сдал водитель",null,null,null,null,null,null,null,null,null,null,null,null,null,null,null,null,null,null,null,null,null,null,null,null,null,null,null,null,null,null,null,null,null,null,null,null,null,null,null,null,null,null,null,null,"метра при возвращении в гараж, км"]
[null,null,null,null,null,null,null,null,null,null,null,null,null,null,null,null,null,null,null,null,null,null,null,null,null,null,null,null,null,{"$f":"Заполнить!$C$7","v":0}]
[null,null,null,null,null,null,null,null,null,null,null,null,null,null,null,null,null,null,null,"(подпись)",null,null,null,null,null,null,null,"(расшифровка подписи)",null,null,null,null,null,null,null,null,null,null,null,null,null,null,null,null,null,"Контролер"]
[null,null,null,null,null,null,null,"М.П.",null,null,null,null,null,null,null,null,null,null,null,null,null,null,null,null,null,null,null,null,null,null,null,null,null,null,null,null,null,null,null,null,null,null,null,null,null,null,null,null,null,null,null,null,null,null,null,"(подпись)",null,null,null,null,null,null,null,null,null,"(расшифровка подписи)"]

{"sheet":"Лист1","index":2,"n_rows":101,"n_cols":8,"rows_kept":101,"cut":false,"hidden":false,"merged":[]}
["№ п/п","Фамилия Имя Отчество","Краткое Имя",null,"номер водительского удостоверения","Закрепленное автотранспортное средство"]
[null,null,null,"Диспетчер",null,"Марка, модель автомобиля"," Гос. регистрац. знак","Тип автомобиля                                                  "]
[47,"Агафонов  Борис Иванович",null,null,123169,"УАЗ 390995","М 684 СУ 163","Грузовой"]
[45,"Балбашов Сергей  Иванович",null,null,123167,"УАЗ 390945","Н 868 МР 163","Грузовой"]
[23,"Баранов Олег Николаевич",null,null,123145,"HYUNDAI NF 2.0 GLS AT","К 497 ВК 163","Легковой"]
[32,"Баулин Алексей  Степанович",null,null,123154,"ГАЗ 2705","Н 855 МР 163","Грузовой фургон"]
[48,"Белякин Евгений Михайлович",null,null,123170,"ВАЗ 21041-20","А 152 ТВ 163","Легковой"]
[83,"Белякин Евгений Михайлович",null,null,123205,"КАМАЗ 431010","С 071 МК 63","ЛИОК"]
[10,"Бондаренко Виктор Алексеевич",null,null,123132,"ШЕВРОЛЕ НИВА    ","К 433 УУ 63","легкового"]
[58,"Борисенков Николай Максимович",null,null,123180,"ГАЗ 330273","У 561 ЕВ 163","Грузовой бортовой"]
[61,"Бояров  Владимир Николаевич",null,null,123183,"ЛАДА ЛАРГУС","У 931 ВХ 163","Легковой"]
[30,"Ваканция",null,null,123152,"УАЗ 390995","М 691 СУ 163","Грузовой"]
[35,"Ваканция",null,null,123157,"LADA 213100 LADA 4х4","Н 861 МР 163","Легковой"]
[37,"Ваканция",null,null,123159,"УАЗ 390995","М 675 СУ 163","Грузовой"]
[39,"Ваканция",null,null,123161,"УАЗ 390995","М 673 СУ 163","Грузовой"]
[46,"Ваканция",null,null,123168,"УАЗ 390995","М 692 СУ 163","Грузовой"]
[42,"Ваняев  Александр Владимирович",null,null,123164,"LADA 210740 LADA 2107","Н 858 МР 163","Легковой"]
[2,"Варин Геннадий Алексеевич","Варин Г.А.","Гришина Л.Н.",123124,"HYUNDAI NF 2.0 GLS AT","К 496 ВК 163","легкового"]
[40,"Вдовин  Александр Геннадьевич",null,null,123162,"УАЗ 390995","М 690 СУ 163","Грузовой"]
[14,"Вишневский Алексей  Иванович","Вишневский А.И.","Гришина Л.Н.",123136,"ГАЗ 2705","М 082 СУ 163","Грузовой фургон"]
[90,"Вишневский Алексей  Иванович",null,null,123212,"ЗИЛ 433110  (с краном - манипулятором БАКМ-890 )   ","К 483 ХХ 63","Грузовой бортовой"]
[1,"Гаврилов Валерий Анатольевич","Гаврилов В.А.","Гришина Л.Н.",123123,"TOYOTA CAMRI ","Н 007 РВ 63","легкового"]
[29,"Газеев Леонид Николаевич",null,null,123151,"УАЗ 390995","М 688 СУ 163","Грузовой"]
[19,"Глинчиков Владимир Николаевич",null,null,123141,"ГАЗ 322130 ","А 974 КУ 163","Автобус"]
[3,"Глухов Дмитрий Алексеевич","Глухов Д. А.","Гришина Л.Н.",123125,"TOYOTA CAMRI ","Н 007 РА 63","легкового"]
[24,"Говар Александр Сергеевич",null,null,123146,"ВАЗ  21214 LADA 4х4","Е 908 АО 163","Легковой"]
[68,"Губайдулин Алексей  Абдуллозянович",null,null,123190,"ГАЗ 27527","У 371 УО 163","Грузовой фургон"]
[84,"Губайдулин Алексей  Абдуллозянович",null,null,123206,"3997 БКМ-317-03","Т 298 УХ 163","Специальный"]
[20,"Гугнин Петр  Константинович   ",null,null,123142,"ГАЗ 32212","ЕК 721 63","Автобус"]
[53,"Демин Юрий Валерьевич",null,null,123175,"УАЗ 390995","Т 715 АТ 163","Грузовой фургон"]
[27,"Димитрюк Александр Владимирович",null,null,123149,"ВАЗ  21214 LADA 4х4","Е 281 РХ 163","Легковой"]
[12,"Дмитриев Александр Геннадьевич",null,null,123134,"ШЕВРОЛЕ НИВА    ","Н 341 УУ 63","легкового"]
[4,"Доброхлебов Александр Борисович",null,null,123126,"ТОЙОТА LK100","О 007 ХМ 63","легкового"]
[5,"Доброхлебов Александр Борисович",null,null,123127,"ТОЙОТА LK ПРАДО","Х 007 УА 63","легкового"]
[6,"Доброхлебов Александр Борисович",null,null,123128,"ТОЙОТА КАМРИ ","О 007 РМ 63","легкового"]
[72,"Долгинов  Владимир Петрович",null,null,123194,"ГАЗ 27529","У 406 УО 163"]
[80,"Долгинов  Владимир Петрович",null,null,123202,"КАМАЗ 4310       ","Е 265 КХ 63"]
[88,"Долгинов  Владимир Петрович",null,null,123210,"КАМАЗ 532150","У 793 СН 63"]
[62,"Емельянов Юрий Михайлович ",null,null,123184,"ЛАДА ЛАРГУС","У 931 ВХ 163"]
[38,"Зинин Владимир Геннадьевич",null,null,123160,"УАЗ 390995","М 686 СУ 163","Грузовой"]
[43,"Кайдаров Дмитрий Викторович",null,null,123165,"УАЗ 390995","М 676 СУ 163","Грузовой"]
[74,"Каленов Петр Борисович",null,null,123196,"ГАЗ 27527","У 414 УО 163","Грузовой фургон"]
[93,"Каленов Петр Борисович",null,null,123215,"КАМАЗ 44108 ЧАЙКА-СЕРВИС 2784GY","О 822 РХ 163","Седельный тягач"]
[97,"Каленов Петр Борисович",null,null,123219,"ПП-НЕФАЗ  9334-10-11","АН 6933 63","п/прицеп"]
[49,"Калинкин Виталий  Юрьевич",null,null,123171,"ГАЗ 3302","К 489 СВ 63","Грузовой бортовой"]
[26,"Кириллов Юрий Афанасьевия",null,null,123148,"УАЗ 390944","К 326 УС 163","Грузовой"]
[22,"Коженов Сергей Ростиславович",null,null,123144,"ГАЗ-27527","В 786 НХ 73","Грузовой фургон"]
[52,"Кожин Александр Гаврилович",null,null,123174,"ВАЗ 21041-20","В 271 ХХ 163","Легковой"]
[21,"Кортушов Сергей Александрович",null,null,123143,"ГАЗ-27527","В 990 ХХ 73","Грузовой фургон"]
[91,"Кортушов Сергей Александрович",null,null,123213,"КС 357151","Е 946 АК 63","                Автокран                          "]
[92,"Кортушов Сергей Александрович",null,null,123214,"КАМАЗ 55102","Х 565 СА 163","Самосвал"]
[54,"Косачев Петр Иванович",null,null,123176,"УАЗ 390996","Т 715 АТ 163"]
[69,"Кочетков Виктор Анатольевич",null,null,123191,"ГАЗ 27527","У 386 УО 163","Грузовой фургон"]
[51,"Кудряшов Александр Николаевич",null,null,123173,"УАЗ-390995","Х 261 РС 163","Грузовой фургон"]
[55,"Кузнецов Евгений Дмитриевич",null,null,123177,"УАЗ 390997","Т 715 АТ 163"]
[63,"Кулаков Александр Степанович",null,null,123185,"ЛАДА ЛАРГУС","У 931 ВХ 163"]
[59,"Кулишов Сергей Алексеевич",null,null,123181,"ГАЗ 330273","У 586 ЕВ 163","Грузовой бортовой"]
[17,"Куценко Виталий Александрович",null,null,123139,"ГАЗ 2705","М 085 СУ 163","Грузовой фургон"]
[15,"Лабжинов Анатолий Михайлович",null,null,123137,"ГАЗ 2705","М 084 СУ 163","Грузовой фургон"]
[34,"Латыпов Радий Мансурович",null,null,123156,"ГАЗ 2217","А 209 ВР 163","Микроавтобус"]
[56,"Лепишин Сергей Евгеньевич",null,null,123178,"УАЗ 390998","Т 715 АТ 163"]
[71,"Лошкарев Иван Васильевич",null,null,123193,"ГАЗ 27528","У 406 УО 163"]
[79,"Лошкарев Иван Васильевич",null,null,123201,"КАМАЗ 4310       ","Е 265 КХ 63"]
[87,"Лошкарев Иван Васильевич",null,null,123209,"КАМАЗ 532150","У 793 СН 63"]
[67,"Лыткин Анатолий Петрович",null,null,123189,"ГАЗ 27527","У 619 ОМ 163","Грузовой фургон"]
[98,"Лыткин Анатолий Петрович",null,null,123220,"ТО-30","63 СА 54-85","Погрузчик фронтальный"]
[99,"Лыткин Анатолий Петрович",null,null,123221,"АМКОДОР 451А","63 СА 54-89","Погрузчик вилочный "]
[25,"Малахов Александр Олегович ,",null,null,123147,"ВАЗ 21104 LADA 110","В 449 ВХ 82","Легковой"]
[64,"Мальцев Виктор Александрович",null,null,123186,"ЛАДА ЛАРГУС","У 931 ВХ 163"]
[65,"Медведев Владимир Федорович",null,null,123187,"ГАЗ 27527","У 517 РХ 163","Грузовой фургон"]
[75,"Музалевский Александр  Сергееевич",null,null,123197,"ГАЗ 331063","У 714 УО 163","Грузовой бортовой"]
[96,"Музалевский Александр  Сергееевич",null,null,123218," YANMAR ","63 ОТ 21-61","Экскаватор ковшовый"]
[76,"Музалевский Владимир Сергееевич",null,null,123198,"ГАЗ 331063","У 699 УО 163","Грузовой бортовой"]
[94,"Музалевский Владимир Сергееевич",null,null,123216,"Экскаватор траншейный цепной ЭТЦ 1609 на базе \"Беларус-82.1-СМ","63 СА 75-58","Экскаватор траншейный"]
[95,"Музалевский Владимир Сергееевич",null,null,123217," YANMAR ","63 СЕ 80-01","Экскаватор ковшовый"]
[57,"Нечаев Константин Николаевич",null,null,123179,"УАЗ 390945","Т 718 АТ 163","Грузовой"]
[9,"Нистерюк Иван Николаевич",null,null,123131,"VOLKSWAGEN JETTA","М 397 АУ 163","легкового"]
[18,"Павлов Валентин Александрович",null,null,123140," ГАЗ 3302       ","М 031 ТМ 163","Грузовой бортовой"]
[66,"Петров Евгений Александрович",null,null,123188,"ГАЗ 27527","У 645 ОМ 163","Грузовой фургон"]
[85,"Ракитин Сергей Викторович",null,null,123207,"КО 522-Б","Т 614 ХМ 163","Ассенизаторский"]
{"$rows_left_out":21}