{"text_format":"1","workbook":"xlsx","n_sheets":2,"sheets":["ВЕДОМОСТЬ Лященко","Табель"],"not_rendered":{"charts":0,"images":0,"macros":1,"external_links":0,"defined_names":17,"comments":0,"pivot_tables":0},"unopened":[],"bounds":{"document_bytes":16777216,"sheet_cells":100000,"rows_first":2000,"rows_last":500,"rows_between":2000,"halvings":0,"cell_chars":16384,"cell_head_chars":4096},"cells_cut":0,"cells_raw":0,"read":"whole","date_system":"1900"}

{"sheet":"ВЕДОМОСТЬ Лященко","index":0,"n_rows":15,"n_cols":17,"rows_kept":15,"cut":false,"hidden":false,"merged":[]}
[null,null,null,"рабочии дни",21,null,null,"Расчётная ведомость сш .  им. ЛЯЩЕНКО"]
["№ п/п","№ п/п (для формулы)","Ф. И.О.",null,"Ч/cт"," %","отр дн","Уч","Пч","Мч/Вч","З-Уч","З-Пч","З- Мч /Вч","Гос яз","На  дому","Кр/ч","Круж по тариф"]
[null,null,0,null,null,null,null,"ОС","ДС","ЧО,ТС ","ЗОС","ЗДС","ЗЧО,ТС ","тил","уйдо окуу","ийирим"]
[null,1,"Перегородова Ольга Ивановна",null,67.5,0.3,null,{"$f":"ROUND(IF($G4>0,IFERROR(INDEX(Табель!$E:$E,MATCH('ВЕДОМОСТЬ Лященко'!$B4,Табель!$A:$A,0)+MATCH('ВЕДОМОСТЬ Лященко'!H$3,Табель!$D$6:$D$14,0)-1),\"\")*4.2/$E$1*$G4,IFERROR(INDEX(Табель!$H:$H,MATCH('ВЕДОМОСТЬ Лященко'!$B4,Табель!$A:$A,0)+MATCH('ВЕДОМОСТЬ Лященко'!H$3,Табель!$D$6:$D$14,0)-1),\"\")),2)","v":0},{"$f":"ROUND(IF($G4>0,IFERROR(INDEX(Табель!$E:$E,MATCH('ВЕДОМОСТЬ Лященко'!$B4,Табель!$A:$A,0)+MATCH('ВЕДОМОСТЬ Лященко'!I$3,Табель!$D$6:$D$14,0)-1),\"\")*4.2/$E$1*$G4,IFERROR(INDEX(Табель!$H:$H,MATCH('ВЕДОМОСТЬ Лященко'!$B4,Табель!$A:$A,0)+MATCH('ВЕДОМОСТЬ Лященко'!I$3,Табель!$D$6:$D$14,0)-1),\"\")),2)","v":0},{"$f":"ROUND(IF($G4>0,IFERROR(INDEX(Табель!$E:$E,MATCH('ВЕДОМОСТЬ Лященко'!$B4,Табель!$A:$A,0)+MATCH('ВЕДОМОСТЬ Лященко'!J$3,Табель!$D$6:$D$14,0)-1),\"\")*4.2/$E$1*$G4,IFERROR(INDEX(Табель!$H:$H,MATCH('ВЕДОМОСТЬ Лященко'!$B4,Табель!$A:$A,0)+MATCH('ВЕДОМОСТЬ Лященко'!J$3,Табель!$D$6:$D$14,0)-1),\"\")),2)","v":0},{"$f":"ROUND(IF($G4>0,IFERROR(INDEX(Табель!$E:$E,MATCH('ВЕДОМОСТЬ Лященко'!$B4,Табель!$A:$A,0)+MATCH('ВЕДОМОСТЬ Лященко'!K$3,Табель!$D$6:$D$14,0)-1),\"\")*4.2/$E$1*$G4,IFERROR(INDEX(Табель!$H:$H,MATCH('ВЕДОМОСТЬ Лященко'!$B4,Табель!$A:$A,0)+MATCH('ВЕДОМОСТЬ Лященко'!K$3,Табель!$D$6:$D$14,0)-1),\"\")),2)","v":0},{"$f":"ROUND(IF($G4>0,IFERROR(INDEX(Табель!$E:$E,MATCH('ВЕДОМОСТЬ Лященко'!$B4,Табель!$A:$A,0)+MATCH('ВЕДОМОСТЬ Лященко'!L$3,Табель!$D$6:$D$14,0)-1),\"\")*4.2/$E$1*$G4,IFERROR(INDEX(Табель!$H:$H,MATCH('ВЕДОМОСТЬ Лященко'!$B4,Табель!$A:$A,0)+MATCH('ВЕДОМОСТЬ Лященко'!L$3,Табель!$D$6:$D$14,0)-1),\"\")),2)","v":0},{"$f":"ROUND(IF($G4>0,IFERROR(INDEX(Табель!$E:$E,MATCH('ВЕДОМОСТЬ Лященко'!$B4,Табель!$A:$A,0)+MATCH('ВЕДОМОСТЬ Лященко'!M$3,Табель!$D$6:$D$14,0)-1),\"\")*4.2/$E$1*$G4,IFERROR(INDEX(Табель!$H:$H,MATCH('ВЕДОМОСТЬ Лященко'!$B4,Табель!$A:$A,0)+MATCH('ВЕДОМОСТЬ Лященко'!M$3,Табель!$D$6:$D$14,0)-1),\"\")),2)","v":0},{"$f":"ROUND(IF($G4=0,IFERROR(INDEX(Табель!$F:$F,MATCH('ВЕДОМОСТЬ Лященко'!$B4,Табель!$A:$A,0)+1),\"\"),IFERROR(INDEX(Табель!$F:$F,MATCH('ВЕДОМОСТЬ Лященко'!$B4,Табель!$A:$A,0)+1),\"\")*4.2/$E$1*$G4),2)","v":0},{"$f":"ROUND(IF($G4=0,IFERROR(INDEX(Табель!$G:$G,MATCH('ВЕДОМОСТЬ Лященко'!$B4,Табель!$A:$A,0)+1),\"\"),IFERROR(INDEX(Табель!$G:$G,MATCH('ВЕДОМОСТЬ Лященко'!$B4,Табель!$A:$A,0)+1),\"\")*4.2/$E$1*$G4),2)","v":0},{"$f":"IF($G4>0,IFERROR(INDEX(Табель!$E:$E,MATCH('ВЕДОМОСТЬ Лященко'!$B4,Табель!$A:$A,0)+MATCH('ВЕДОМОСТЬ Лященко'!P$3,Табель!$D$6:$D$14,0)-1),\"\")*4.2/$E$1*$G4,IFERROR(INDEX(Табель!$H:$H,MATCH('ВЕДОМОСТЬ Лященко'!$B4,Табель!$A:$A,0)+MATCH('ВЕДОМОСТЬ Лященко'!P$3,Табель!$D$6:$D$14,0)-1),\"\"))","v":0}]
[null,14,"Бочарникова Оксана Анатольевна",null,60,0.1,null,{"$f":"ROUND(IF($G5>0,IFERROR(INDEX(Табель!$E:$E,MATCH('ВЕДОМОСТЬ Лященко'!$B5,Табель!$A:$A,0)+MATCH('ВЕДОМОСТЬ Лященко'!H$3,Табель!$D$6:$D$14,0)-1),\"\")*4.2/$E$1*$G5,IFERROR(INDEX(Табель!$H:$H,MATCH('ВЕДОМОСТЬ Лященко'!$B5,Табель!$A:$A,0)+MATCH('ВЕДОМОСТЬ Лященко'!H$3,Табель!$D$6:$D$14,0)-1),\"\")),2)","v":45},{"$f":"ROUND(IF($G5>0,IFERROR(INDEX(Табель!$E:$E,MATCH('ВЕДОМОСТЬ Лященко'!$B5,Табель!$A:$A,0)+MATCH('ВЕДОМОСТЬ Лященко'!I$3,Табель!$D$6:$D$14,0)-1),\"\")*4.2/$E$1*$G5,IFERROR(INDEX(Табель!$H:$H,MATCH('ВЕДОМОСТЬ Лященко'!$B5,Табель!$A:$A,0)+MATCH('ВЕДОМОСТЬ Лященко'!I$3,Табель!$D$6:$D$14,0)-1),\"\")),2)","v":8},{"$f":"ROUND(IF($G5>0,IFERROR(INDEX(Табель!$E:$E,MATCH('ВЕДОМОСТЬ Лященко'!$B5,Табель!$A:$A,0)+MATCH('ВЕДОМОСТЬ Лященко'!J$3,Табель!$D$6:$D$14,0)-1),\"\")*4.2/$E$1*$G5,IFERROR(INDEX(Табель!$H:$H,MATCH('ВЕДОМОСТЬ Лященко'!$B5,Табель!$A:$A,0)+MATCH('ВЕДОМОСТЬ Лященко'!J$3,Табель!$D$6:$D$14,0)-1),\"\")),2)","v":26},{"$f":"ROUND(IF($G5>0,IFERROR(INDEX(Табель!$E:$E,MATCH('ВЕДОМОСТЬ Лященко'!$B5,Табель!$A:$A,0)+MATCH('ВЕДОМОСТЬ Лященко'!K$3,Табель!$D$6:$D$14,0)-1),\"\")*4.2/$E$1*$G5,IFERROR(INDEX(Табель!$H:$H,MATCH('ВЕДОМОСТЬ Лященко'!$B5,Табель!$A:$A,0)+MATCH('ВЕДОМОСТЬ Лященко'!K$3,Табель!$D$6:$D$14,0)-1),\"\")),2)","v":0},{"$f":"ROUND(IF($G5>0,IFERROR(INDEX(Табель!$E:$E,MATCH('ВЕДОМОСТЬ Лященко'!$B5,Табель!$A:$A,0)+MATCH('ВЕДОМОСТЬ Лященко'!L$3,Табель!$D$6:$D$14,0)-1),\"\")*4.2/$E$1*$G5,IFERROR(INDEX(Табель!$H:$H,MATCH('ВЕДОМОСТЬ Лященко'!$B5,Табель!$A:$A,0)+MATCH('ВЕДОМОСТЬ Лященко'!L$3,Табель!$D$6:$D$14,0)-1),\"\")),2)","v":0},{"$f":"ROUND(IF($G5>0,IFERROR(INDEX(Табель!$E:$E,MATCH('ВЕДОМОСТЬ Лященко'!$B5,Табель!$A:$A,0)+MATCH('ВЕДОМОСТЬ Лященко'!M$3,Табель!$D$6:$D$14,0)-1),\"\")*4.2/$E$1*$G5,IFERROR(INDEX(Табель!$H:$H,MATCH('ВЕДОМОСТЬ Лященко'!$B5,Табель!$A:$A,0)+MATCH('ВЕДОМОСТЬ Лященко'!M$3,Табель!$D$6:$D$14,0)-1),\"\")),2)","v":0},{"$f":"ROUND(IF($G5=0,IFERROR(INDEX(Табель!$F:$F,MATCH('ВЕДОМОСТЬ Лященко'!$B5,Табель!$A:$A,0)+1),\"\"),IFERROR(INDEX(Табель!$F:$F,MATCH('ВЕДОМОСТЬ Лященко'!$B5,Табель!$A:$A,0)+1),\"\")*4.2/$E$1*$G5),2)","v":0},{"$f":"ROUND(IF($G5=0,IFERROR(INDEX(Табель!$G:$G,MATCH('ВЕДОМОСТЬ Лященко'!$B5,Табель!$A:$A,0)+1),\"\"),IFERROR(INDEX(Табель!$G:$G,MATCH('ВЕДОМОСТЬ Лященко'!$B5,Табель!$A:$A,0)+1),\"\")*4.2/$E$1*$G5),2)","v":0},{"$f":"IF($G5>0,IFERROR(INDEX(Табель!$E:$E,MATCH('ВЕДОМОСТЬ Лященко'!$B5,Табель!$A:$A,0)+MATCH('ВЕДОМОСТЬ Лященко'!P$3,Табель!$D$6:$D$14,0)-1),\"\")*4.2/$E$1*$G5,IFERROR(INDEX(Табель!$H:$H,MATCH('ВЕДОМОСТЬ Лященко'!$B5,Табель!$A:$A,0)+MATCH('ВЕДОМОСТЬ Лященко'!P$3,Табель!$D$6:$D$14,0)-1),\"\"))","v":63},15]
[null,15,"Бучина Татьяна Васильевна",null,67.5,0.3,null,{"$f":"ROUND(IF($G6>0,IFERROR(INDEX(Табель!$E:$E,MATCH('ВЕДОМОСТЬ Лященко'!$B6,Табель!$A:$A,0)+MATCH('ВЕДОМОСТЬ Лященко'!H$3,Табель!$D$6:$D$14,0)-1),\"\")*4.2/$E$1*$G6,IFERROR(INDEX(Табель!$H:$H,MATCH('ВЕДОМОСТЬ Лященко'!$B6,Табель!$A:$A,0)+MATCH('ВЕДОМОСТЬ Лященко'!H$3,Табель!$D$6:$D$14,0)-1),\"\")),2)","v":67},{"$f":"ROUND(IF($G6>0,IFERROR(INDEX(Табель!$E:$E,MATCH('ВЕДОМОСТЬ Лященко'!$B6,Табель!$A:$A,0)+MATCH('ВЕДОМОСТЬ Лященко'!I$3,Табель!$D$6:$D$14,0)-1),\"\")*4.2/$E$1*$G6,IFERROR(INDEX(Табель!$H:$H,MATCH('ВЕДОМОСТЬ Лященко'!$B6,Табель!$A:$A,0)+MATCH('ВЕДОМОСТЬ Лященко'!I$3,Табель!$D$6:$D$14,0)-1),\"\")),2)","v":16},{"$f":"ROUND(IF($G6>0,IFERROR(INDEX(Табель!$E:$E,MATCH('ВЕДОМОСТЬ Лященко'!$B6,Табель!$A:$A,0)+MATCH('ВЕДОМОСТЬ Лященко'!J$3,Табель!$D$6:$D$14,0)-1),\"\")*4.2/$E$1*$G6,IFERROR(INDEX(Табель!$H:$H,MATCH('ВЕДОМОСТЬ Лященко'!$B6,Табель!$A:$A,0)+MATCH('ВЕДОМОСТЬ Лященко'!J$3,Табель!$D$6:$D$14,0)-1),\"\")),2)","v":25},{"$f":"ROUND(IF($G6>0,IFERROR(INDEX(Табель!$E:$E,MATCH('ВЕДОМОСТЬ Лященко'!$B6,Табель!$A:$A,0)+MATCH('ВЕДОМОСТЬ Лященко'!K$3,Табель!$D$6:$D$14,0)-1),\"\")*4.2/$E$1*$G6,IFERROR(INDEX(Табель!$H:$H,MATCH('ВЕДОМОСТЬ Лященко'!$B6,Табель!$A:$A,0)+MATCH('ВЕДОМОСТЬ Лященко'!K$3,Табель!$D$6:$D$14,0)-1),\"\")),2)","v":0},{"$f":"ROUND(IF($G6>0,IFERROR(INDEX(Табель!$E:$E,MATCH('ВЕДОМОСТЬ Лященко'!$B6,Табель!$A:$A,0)+MATCH('ВЕДОМОСТЬ Лященко'!L$3,Табель!$D$6:$D$14,0)-1),\"\")*4.2/$E$1*$G6,IFERROR(INDEX(Табель!$H:$H,MATCH('ВЕДОМОСТЬ Лященко'!$B6,Табель!$A:$A,0)+MATCH('ВЕДОМОСТЬ Лященко'!L$3,Табель!$D$6:$D$14,0)-1),\"\")),2)","v":0},{"$f":"ROUND(IF($G6>0,IFERROR(INDEX(Табель!$E:$E,MATCH('ВЕДОМОСТЬ Лященко'!$B6,Табель!$A:$A,0)+MATCH('ВЕДОМОСТЬ Лященко'!M$3,Табель!$D$6:$D$14,0)-1),\"\")*4.2/$E$1*$G6,IFERROR(INDEX(Табель!$H:$H,MATCH('ВЕДОМОСТЬ Лященко'!$B6,Табель!$A:$A,0)+MATCH('ВЕДОМОСТЬ Лященко'!M$3,Табель!$D$6:$D$14,0)-1),\"\")),2)","v":0},{"$f":"ROUND(IF($G6=0,IFERROR(INDEX(Табель!$F:$F,MATCH('ВЕДОМОСТЬ Лященко'!$B6,Табель!$A:$A,0)+1),\"\"),IFERROR(INDEX(Табель!$F:$F,MATCH('ВЕДОМОСТЬ Лященко'!$B6,Табель!$A:$A,0)+1),\"\")*4.2/$E$1*$G6),2)","v":0},{"$f":"ROUND(IF($G6=0,IFERROR(INDEX(Табель!$G:$G,MATCH('ВЕДОМОСТЬ Лященко'!$B6,Табель!$A:$A,0)+1),\"\"),IFERROR(INDEX(Табель!$G:$G,MATCH('ВЕДОМОСТЬ Лященко'!$B6,Табель!$A:$A,0)+1),\"\")*4.2/$E$1*$G6),2)","v":0},{"$f":"IF($G6>0,IFERROR(INDEX(Табель!$E:$E,MATCH('ВЕДОМОСТЬ Лященко'!$B6,Табель!$A:$A,0)+MATCH('ВЕДОМОСТЬ Лященко'!P$3,Табель!$D$6:$D$14,0)-1),\"\")*4.2/$E$1*$G6,IFERROR(INDEX(Табель!$H:$H,MATCH('ВЕДОМОСТЬ Лященко'!$B6,Табель!$A:$A,0)+MATCH('ВЕДОМОСТЬ Лященко'!P$3,Табель!$D$6:$D$14,0)-1),\"\"))","v":20},5]
[null,16,"Джумабаева Анара Акимкановна",null,67.5,0.3,null,{"$f":"ROUND(IF($G7>0,IFERROR(INDEX(Табель!$E:$E,MATCH('ВЕДОМОСТЬ Лященко'!$B7,Табель!$A:$A,0)+MATCH('ВЕДОМОСТЬ Лященко'!H$3,Табель!$D$6:$D$14,0)-1),\"\")*4.2/$E$1*$G7,IFERROR(INDEX(Табель!$H:$H,MATCH('ВЕДОМОСТЬ Лященко'!$B7,Табель!$A:$A,0)+MATCH('ВЕДОМОСТЬ Лященко'!H$3,Табель!$D$6:$D$14,0)-1),\"\")),2)","v":48},{"$f":"ROUND(IF($G7>0,IFERROR(INDEX(Табель!$E:$E,MATCH('ВЕДОМОСТЬ Лященко'!$B7,Табель!$A:$A,0)+MATCH('ВЕДОМОСТЬ Лященко'!I$3,Табель!$D$6:$D$14,0)-1),\"\")*4.2/$E$1*$G7,IFERROR(INDEX(Табель!$H:$H,MATCH('ВЕДОМОСТЬ Лященко'!$B7,Табель!$A:$A,0)+MATCH('ВЕДОМОСТЬ Лященко'!I$3,Табель!$D$6:$D$14,0)-1),\"\")),2)","v":20},{"$f":"ROUND(IF($G7>0,IFERROR(INDEX(Табель!$E:$E,MATCH('ВЕДОМОСТЬ Лященко'!$B7,Табель!$A:$A,0)+MATCH('ВЕДОМОСТЬ Лященко'!J$3,Табель!$D$6:$D$14,0)-1),\"\")*4.2/$E$1*$G7,IFERROR(INDEX(Табель!$H:$H,MATCH('ВЕДОМОСТЬ Лященко'!$B7,Табель!$A:$A,0)+MATCH('ВЕДОМОСТЬ Лященко'!J$3,Табель!$D$6:$D$14,0)-1),\"\")),2)","v":8},{"$f":"ROUND(IF($G7>0,IFERROR(INDEX(Табель!$E:$E,MATCH('ВЕДОМОСТЬ Лященко'!$B7,Табель!$A:$A,0)+MATCH('ВЕДОМОСТЬ Лященко'!K$3,Табель!$D$6:$D$14,0)-1),\"\")*4.2/$E$1*$G7,IFERROR(INDEX(Табель!$H:$H,MATCH('ВЕДОМОСТЬ Лященко'!$B7,Табель!$A:$A,0)+MATCH('ВЕДОМОСТЬ Лященко'!K$3,Табель!$D$6:$D$14,0)-1),\"\")),2)","v":0},{"$f":"ROUND(IF($G7>0,IFERROR(INDEX(Табель!$E:$E,MATCH('ВЕДОМОСТЬ Лященко'!$B7,Табель!$A:$A,0)+MATCH('ВЕДОМОСТЬ Лященко'!L$3,Табель!$D$6:$D$14,0)-1),\"\")*4.2/$E$1*$G7,IFERROR(INDEX(Табель!$H:$H,MATCH('ВЕДОМОСТЬ Лященко'!$B7,Табель!$A:$A,0)+MATCH('ВЕДОМОСТЬ Лященко'!L$3,Табель!$D$6:$D$14,0)-1),\"\")),2)","v":0},{"$f":"ROUND(IF($G7>0,IFERROR(INDEX(Табель!$E:$E,MATCH('ВЕДОМОСТЬ Лященко'!$B7,Табель!$A:$A,0)+MATCH('ВЕДОМОСТЬ Лященко'!M$3,Табель!$D$6:$D$14,0)-1),\"\")*4.2/$E$1*$G7,IFERROR(INDEX(Табель!$H:$H,MATCH('ВЕДОМОСТЬ Лященко'!$B7,Табель!$A:$A,0)+MATCH('ВЕДОМОСТЬ Лященко'!M$3,Табель!$D$6:$D$14,0)-1),\"\")),2)","v":0},{"$f":"ROUND(IF($G7=0,IFERROR(INDEX(Табель!$F:$F,MATCH('ВЕДОМОСТЬ Лященко'!$B7,Табель!$A:$A,0)+1),\"\"),IFERROR(INDEX(Табель!$F:$F,MATCH('ВЕДОМОСТЬ Лященко'!$B7,Табель!$A:$A,0)+1),\"\")*4.2/$E$1*$G7),2)","v":12},{"$f":"ROUND(IF($G7=0,IFERROR(INDEX(Табель!$G:$G,MATCH('ВЕДОМОСТЬ Лященко'!$B7,Табель!$A:$A,0)+1),\"\"),IFERROR(INDEX(Табель!$G:$G,MATCH('ВЕДОМОСТЬ Лященко'!$B7,Табель!$A:$A,0)+1),\"\")*4.2/$E$1*$G7),2)","v":0},{"$f":"IF($G7>0,IFERROR(INDEX(Табель!$E:$E,MATCH('ВЕДОМОСТЬ Лященко'!$B7,Табель!$A:$A,0)+MATCH('ВЕДОМОСТЬ Лященко'!P$3,Табель!$D$6:$D$14,0)-1),\"\")*4.2/$E$1*$G7,IFERROR(INDEX(Табель!$H:$H,MATCH('ВЕДОМОСТЬ Лященко'!$B7,Табель!$A:$A,0)+MATCH('ВЕДОМОСТЬ Лященко'!P$3,Табель!$D$6:$D$14,0)-1),\"\"))","v":0}]
[null,17,"Джумабаева Анара Акимкановна",null,81,0.3,null,{"$f":"ROUND(IF($G8>0,IFERROR(INDEX(Табель!$E:$E,MATCH('ВЕДОМОСТЬ Лященко'!$B8,Табель!$A:$A,0)+MATCH('ВЕДОМОСТЬ Лященко'!H$3,Табель!$D$6:$D$14,0)-1),\"\")*4.2/$E$1*$G8,IFERROR(INDEX(Табель!$H:$H,MATCH('ВЕДОМОСТЬ Лященко'!$B8,Табель!$A:$A,0)+MATCH('ВЕДОМОСТЬ Лященко'!H$3,Табель!$D$6:$D$14,0)-1),\"\")),2)","v":20},{"$f":"ROUND(IF($G8>0,IFERROR(INDEX(Табель!$E:$E,MATCH('ВЕДОМОСТЬ Лященко'!$B8,Табель!$A:$A,0)+MATCH('ВЕДОМОСТЬ Лященко'!I$3,Табель!$D$6:$D$14,0)-1),\"\")*4.2/$E$1*$G8,IFERROR(INDEX(Табель!$H:$H,MATCH('ВЕДОМОСТЬ Лященко'!$B8,Табель!$A:$A,0)+MATCH('ВЕДОМОСТЬ Лященко'!I$3,Табель!$D$6:$D$14,0)-1),\"\")),2)","v":0},{"$f":"ROUND(IF($G8>0,IFERROR(INDEX(Табель!$E:$E,MATCH('ВЕДОМОСТЬ Лященко'!$B8,Табель!$A:$A,0)+MATCH('ВЕДОМОСТЬ Лященко'!J$3,Табель!$D$6:$D$14,0)-1),\"\")*4.2/$E$1*$G8,IFERROR(INDEX(Табель!$H:$H,MATCH('ВЕДОМОСТЬ Лященко'!$B8,Табель!$A:$A,0)+MATCH('ВЕДОМОСТЬ Лященко'!J$3,Табель!$D$6:$D$14,0)-1),\"\")),2)","v":0},{"$f":"ROUND(IF($G8>0,IFERROR(INDEX(Табель!$E:$E,MATCH('ВЕДОМОСТЬ Лященко'!$B8,Табель!$A:$A,0)+MATCH('ВЕДОМОСТЬ Лященко'!K$3,Табель!$D$6:$D$14,0)-1),\"\")*4.2/$E$1*$G8,IFERROR(INDEX(Табель!$H:$H,MATCH('ВЕДОМОСТЬ Лященко'!$B8,Табель!$A:$A,0)+MATCH('ВЕДОМОСТЬ Лященко'!K$3,Табель!$D$6:$D$14,0)-1),\"\")),2)","v":0},{"$f":"ROUND(IF($G8>0,IFERROR(INDEX(Табель!$E:$E,MATCH('ВЕДОМОСТЬ Лященко'!$B8,Табель!$A:$A,0)+MATCH('ВЕДОМОСТЬ Лященко'!L$3,Табель!$D$6:$D$14,0)-1),\"\")*4.2/$E$1*$G8,IFERROR(INDEX(Табель!$H:$H,MATCH('ВЕДОМОСТЬ Лященко'!$B8,Табель!$A:$A,0)+MATCH('ВЕДОМОСТЬ Лященко'!L$3,Табель!$D$6:$D$14,0)-1),\"\")),2)","v":0},{"$f":"ROUND(IF($G8>0,IFERROR(INDEX(Табель!$E:$E,MATCH('ВЕДОМОСТЬ Лященко'!$B8,Табель!$A:$A,0)+MATCH('ВЕДОМОСТЬ Лященко'!M$3,Табель!$D$6:$D$14,0)-1),\"\")*4.2/$E$1*$G8,IFERROR(INDEX(Табель!$H:$H,MATCH('ВЕДОМОСТЬ Лященко'!$B8,Табель!$A:$A,0)+MATCH('ВЕДОМОСТЬ Лященко'!M$3,Табель!$D$6:$D$14,0)-1),\"\")),2)","v":0},{"$f":"ROUND(IF($G8=0,IFERROR(INDEX(Табель!$F:$F,MATCH('ВЕДОМОСТЬ Лященко'!$B8,Табель!$A:$A,0)+1),\"\"),IFERROR(INDEX(Табель!$F:$F,MATCH('ВЕДОМОСТЬ Лященко'!$B8,Табель!$A:$A,0)+1),\"\")*4.2/$E$1*$G8),2)","v":20},{"$f":"ROUND(IF($G8=0,IFERROR(INDEX(Табель!$G:$G,MATCH('ВЕДОМОСТЬ Лященко'!$B8,Табель!$A:$A,0)+1),\"\"),IFERROR(INDEX(Табель!$G:$G,MATCH('ВЕДОМОСТЬ Лященко'!$B8,Табель!$A:$A,0)+1),\"\")*4.2/$E$1*$G8),2)","v":0},{"$f":"IF($G8>0,IFERROR(INDEX(Табель!$E:$E,MATCH('ВЕДОМОСТЬ Лященко'!$B8,Табель!$A:$A,0)+MATCH('ВЕДОМОСТЬ Лященко'!P$3,Табель!$D$6:$D$14,0)-1),\"\")*4.2/$E$1*$G8,IFERROR(INDEX(Табель!$H:$H,MATCH('ВЕДОМОСТЬ Лященко'!$B8,Табель!$A:$A,0)+MATCH('ВЕДОМОСТЬ Лященко'!P$3,Табель!$D$6:$D$14,0)-1),\"\"))","v":0}]
[null,18,"Дмитриченко  Анна Сергеевна",null,72,0.2,null,{"$f":"ROUND(IF($G9>0,IFERROR(INDEX(Табель!$E:$E,MATCH('ВЕДОМОСТЬ Лященко'!$B9,Табель!$A:$A,0)+MATCH('ВЕДОМОСТЬ Лященко'!H$3,Табель!$D$6:$D$14,0)-1),\"\")*4.2/$E$1*$G9,IFERROR(INDEX(Табель!$H:$H,MATCH('ВЕДОМОСТЬ Лященко'!$B9,Табель!$A:$A,0)+MATCH('ВЕДОМОСТЬ Лященко'!H$3,Табель!$D$6:$D$14,0)-1),\"\")),2)","v":80},{"$f":"ROUND(IF($G9>0,IFERROR(INDEX(Табель!$E:$E,MATCH('ВЕДОМОСТЬ Лященко'!$B9,Табель!$A:$A,0)+MATCH('ВЕДОМОСТЬ Лященко'!I$3,Табель!$D$6:$D$14,0)-1),\"\")*4.2/$E$1*$G9,IFERROR(INDEX(Табель!$H:$H,MATCH('ВЕДОМОСТЬ Лященко'!$B9,Табель!$A:$A,0)+MATCH('ВЕДОМОСТЬ Лященко'!I$3,Табель!$D$6:$D$14,0)-1),\"\")),2)","v":26},{"$f":"ROUND(IF($G9>0,IFERROR(INDEX(Табель!$E:$E,MATCH('ВЕДОМОСТЬ Лященко'!$B9,Табель!$A:$A,0)+MATCH('ВЕДОМОСТЬ Лященко'!J$3,Табель!$D$6:$D$14,0)-1),\"\")*4.2/$E$1*$G9,IFERROR(INDEX(Табель!$H:$H,MATCH('ВЕДОМОСТЬ Лященко'!$B9,Табель!$A:$A,0)+MATCH('ВЕДОМОСТЬ Лященко'!J$3,Табель!$D$6:$D$14,0)-1),\"\")),2)","v":26},{"$f":"ROUND(IF($G9>0,IFERROR(INDEX(Табель!$E:$E,MATCH('ВЕДОМОСТЬ Лященко'!$B9,Табель!$A:$A,0)+MATCH('ВЕДОМОСТЬ Лященко'!K$3,Табель!$D$6:$D$14,0)-1),\"\")*4.2/$E$1*$G9,IFERROR(INDEX(Табель!$H:$H,MATCH('ВЕДОМОСТЬ Лященко'!$B9,Табель!$A:$A,0)+MATCH('ВЕДОМОСТЬ Лященко'!K$3,Табель!$D$6:$D$14,0)-1),\"\")),2)","v":0},{"$f":"ROUND(IF($G9>0,IFERROR(INDEX(Табель!$E:$E,MATCH('ВЕДОМОСТЬ Лященко'!$B9,Табель!$A:$A,0)+MATCH('ВЕДОМОСТЬ Лященко'!L$3,Табель!$D$6:$D$14,0)-1),\"\")*4.2/$E$1*$G9,IFERROR(INDEX(Табель!$H:$H,MATCH('ВЕДОМОСТЬ Лященко'!$B9,Табель!$A:$A,0)+MATCH('ВЕДОМОСТЬ Лященко'!L$3,Табель!$D$6:$D$14,0)-1),\"\")),2)","v":0},{"$f":"ROUND(IF($G9>0,IFERROR(INDEX(Табель!$E:$E,MATCH('ВЕДОМОСТЬ Лященко'!$B9,Табель!$A:$A,0)+MATCH('ВЕДОМОСТЬ Лященко'!M$3,Табель!$D$6:$D$14,0)-1),\"\")*4.2/$E$1*$G9,IFERROR(INDEX(Табель!$H:$H,MATCH('ВЕДОМОСТЬ Лященко'!$B9,Табель!$A:$A,0)+MATCH('ВЕДОМОСТЬ Лященко'!M$3,Табель!$D$6:$D$14,0)-1),\"\")),2)","v":0},{"$f":"ROUND(IF($G9=0,IFERROR(INDEX(Табель!$F:$F,MATCH('ВЕДОМОСТЬ Лященко'!$B9,Табель!$A:$A,0)+1),\"\"),IFERROR(INDEX(Табель!$F:$F,MATCH('ВЕДОМОСТЬ Лященко'!$B9,Табель!$A:$A,0)+1),\"\")*4.2/$E$1*$G9),2)","v":0},{"$f":"ROUND(IF($G9=0,IFERROR(INDEX(Табель!$G:$G,MATCH('ВЕДОМОСТЬ Лященко'!$B9,Табель!$A:$A,0)+1),\"\"),IFERROR(INDEX(Табель!$G:$G,MATCH('ВЕДОМОСТЬ Лященко'!$B9,Табель!$A:$A,0)+1),\"\")*4.2/$E$1*$G9),2)","v":0},{"$f":"IF($G9>0,IFERROR(INDEX(Табель!$E:$E,MATCH('ВЕДОМОСТЬ Лященко'!$B9,Табель!$A:$A,0)+MATCH('ВЕДОМОСТЬ Лященко'!P$3,Табель!$D$6:$D$14,0)-1),\"\")*4.2/$E$1*$G9,IFERROR(INDEX(Табель!$H:$H,MATCH('ВЕДОМОСТЬ Лященко'!$B9,Табель!$A:$A,0)+MATCH('ВЕДОМОСТЬ Лященко'!P$3,Табель!$D$6:$D$14,0)-1),\"\"))","v":0}]
[null,19,"Дмитриченко  Анна Сергеевна",null,72,0.2,null,{"$f":"ROUND(IF($G10>0,IFERROR(INDEX(Табель!$E:$E,MATCH('ВЕДОМОСТЬ Лященко'!$B10,Табель!$A:$A,0)+MATCH('ВЕДОМОСТЬ Лященко'!H$3,Табель!$D$6:$D$14,0)-1),\"\")*4.2/$E$1*$G10,IFERROR(INDEX(Табель!$H:$H,MATCH('ВЕДОМОСТЬ Лященко'!$B10,Табель!$A:$A,0)+MATCH('ВЕДОМОСТЬ Лященко'!H$3,Табель!$D$6:$D$14,0)-1),\"\")),2)","v":63},{"$f":"ROUND(IF($G10>0,IFERROR(INDEX(Табель!$E:$E,MATCH('ВЕДОМОСТЬ Лященко'!$B10,Табель!$A:$A,0)+MATCH('ВЕДОМОСТЬ Лященко'!I$3,Табель!$D$6:$D$14,0)-1),\"\")*4.2/$E$1*$G10,IFERROR(INDEX(Табель!$H:$H,MATCH('ВЕДОМОСТЬ Лященко'!$B10,Табель!$A:$A,0)+MATCH('ВЕДОМОСТЬ Лященко'!I$3,Табель!$D$6:$D$14,0)-1),\"\")),2)","v":6},{"$f":"ROUND(IF($G10>0,IFERROR(INDEX(Табель!$E:$E,MATCH('ВЕДОМОСТЬ Лященко'!$B10,Табель!$A:$A,0)+MATCH('ВЕДОМОСТЬ Лященко'!J$3,Табель!$D$6:$D$14,0)-1),\"\")*4.2/$E$1*$G10,IFERROR(INDEX(Табель!$H:$H,MATCH('ВЕДОМОСТЬ Лященко'!$B10,Табель!$A:$A,0)+MATCH('ВЕДОМОСТЬ Лященко'!J$3,Табель!$D$6:$D$14,0)-1),\"\")),2)","v":0},{"$f":"ROUND(IF($G10>0,IFERROR(INDEX(Табель!$E:$E,MATCH('ВЕДОМОСТЬ Лященко'!$B10,Табель!$A:$A,0)+MATCH('ВЕДОМОСТЬ Лященко'!K$3,Табель!$D$6:$D$14,0)-1),\"\")*4.2/$E$1*$G10,IFERROR(INDEX(Табель!$H:$H,MATCH('ВЕДОМОСТЬ Лященко'!$B10,Табель!$A:$A,0)+MATCH('ВЕДОМОСТЬ Лященко'!K$3,Табель!$D$6:$D$14,0)-1),\"\")),2)","v":0},{"$f":"ROUND(IF($G10>0,IFERROR(INDEX(Табель!$E:$E,MATCH('ВЕДОМОСТЬ Лященко'!$B10,Табель!$A:$A,0)+MATCH('ВЕДОМОСТЬ Лященко'!L$3,Табель!$D$6:$D$14,0)-1),\"\")*4.2/$E$1*$G10,IFERROR(INDEX(Табель!$H:$H,MATCH('ВЕДОМОСТЬ Лященко'!$B10,Табель!$A:$A,0)+MATCH('ВЕДОМОСТЬ Лященко'!L$3,Табель!$D$6:$D$14,0)-1),\"\")),2)","v":0},{"$f":"ROUND(IF($G10>0,IFERROR(INDEX(Табель!$E:$E,MATCH('ВЕДОМОСТЬ Лященко'!$B10,Табель!$A:$A,0)+MATCH('ВЕДОМОСТЬ Лященко'!M$3,Табель!$D$6:$D$14,0)-1),\"\")*4.2/$E$1*$G10,IFERROR(INDEX(Табель!$H:$H,MATCH('ВЕДОМОСТЬ Лященко'!$B10,Табель!$A:$A,0)+MATCH('ВЕДОМОСТЬ Лященко'!M$3,Табель!$D$6:$D$14,0)-1),\"\")),2)","v":0},{"$f":"ROUND(IF($G10=0,IFERROR(INDEX(Табель!$F:$F,MATCH('ВЕДОМОСТЬ Лященко'!$B10,Табель!$A:$A,0)+1),\"\"),IFERROR(INDEX(Табель!$F:$F,MATCH('ВЕДОМОСТЬ Лященко'!$B10,Табель!$A:$A,0)+1),\"\")*4.2/$E$1*$G10),2)","v":0},{"$f":"ROUND(IF($G10=0,IFERROR(INDEX(Табель!$G:$G,MATCH('ВЕДОМОСТЬ Лященко'!$B10,Табель!$A:$A,0)+1),\"\"),IFERROR(INDEX(Табель!$G:$G,MATCH('ВЕДОМОСТЬ Лященко'!$B10,Табель!$A:$A,0)+1),\"\")*4.2/$E$1*$G10),2)","v":0},{"$f":"IF($G10>0,IFERROR(INDEX(Табель!$E:$E,MATCH('ВЕДОМОСТЬ Лященко'!$B10,Табель!$A:$A,0)+MATCH('ВЕДОМОСТЬ Лященко'!P$3,Табель!$D$6:$D$14,0)-1),\"\")*4.2/$E$1*$G10,IFERROR(INDEX(Табель!$H:$H,MATCH('ВЕДОМОСТЬ Лященко'!$B10,Табель!$A:$A,0)+MATCH('ВЕДОМОСТЬ Лященко'!P$3,Табель!$D$6:$D$14,0)-1),\"\"))","v":0}]
{"$rows_left_out":6}
{"sheet":"Табель","index":1,"n_rows":148,"n_cols":39,"rows_kept":148,"cut":false,"hidden":false,"merged":[[3,6,4,6],[3,7,4,7],[27,1,29,2],[34,1,35,2],[16,0,26,0],[16,1,18,2],[23,1,24,2],[3,0,4,0],[3,1,4,2],[3,3,4,3],[3,4,4,4],[3,5,4,5],[12,1,13,2],[9,1,11,2],[5,1,7,2],[5,0,15,0],[93,1,95,2],[100,1,101,2],[104,0,114,0],[27,0,37,0],[71,0,81,0],[71,1,73,2],[78,1,79,2],[104,1,106,2],[111,1,112,2],[137,0,147,0],[137,1,139,2],[144,1,145,2],[38,0,48,0],[38,1,40,2],[45,1,46,2],[49,0,59,0],[49,1,51,2],[56,1,57,2],[60,0,70,0],[60,1,62,2],[67,1,68,2],[82,0,92,0],[82,1,84,2],[89,1,90,2],[93,0,103,0],[115,0,125,0],[115,1,117,2],[122,1,123,2],[126,0,136,0],[126,1,128,2],[133,1,134,2]]}
[]
[]
[null," 2018-ж."]
[null,"ФИО",null,"Иш убактысы","Саат/ Ств","Тил","уйдо окуу","Бард-гы","иш","жш","дш","шш","шр","бш","жм","иш","жш","дш","шш","шр","бш","жм","иш","жш","дш","шш","шр","бш","жм","иш","жш","дш","шш","шр","бш","жм","иш","жш","дш"]
[null,null,null,null,null,null,null,null,1,2,3,4,5,6,7,8,9,10,11,12,13,14,15,16,17,18,19,20,21,22,23,24,25,26,27,28,29,30,31]
[1,"Перегородова Ольга Ивановна",null,"директор",1,null,null,{"$f":"COUNTIF(I6:AM6,\"7\")","v":21},null,"жш",7,7,7,7,7,null,"жш",7,7,7,7,7,null,"жш",7,7,7,7,7,null,"жш",7,7,7,7,7,null,"жш",7]
[null,null,null,"ОС",null,null,null,{"$f":"SUM(I7:AM7)","v":0},null,"жш",null,null,null,null,null,null,"жш",null,null,null,null,null,null,"жш",null,null,null,null,null,null,"жш",null,null,null,null,null,null,"жш"]
[null,null,null,"ДС",null,null,null,0,null,"жш",null,null,null,null,null,null,"жш",null,null,null,null,null,null,"жш",null,null,null,null,null,null,"жш",null,null,null,null,null,null,"жш"]
[null,null,"Всш","ЧО,ТС ",null,null,null,0,null,"жш",null,null,null,null,null,null,"жш",null,null,null,null,null,null,"жш",null,null,null,null,null,null,"жш",null,null,null,null,null,null,"жш"]
[null,null,null,"ЗОС",null,null,null,0,null,"жш",null,null,null,null,null,null,"жш",null,null,null,null,null,null,"жш",null,null,null,null,null,null,"жш",null,null,null,null,null,null,"жш"]
{"$rows_left_out":138}