{"text_format":"1","workbook":"xlsx","n_sheets":4,"sheets":["Foglio1","Foglio2","Foglio3","Foglio4"],"not_rendered":{"charts":0,"images":0,"macros":1,"external_links":0,"defined_names":0,"comments":0,"pivot_tables":0},"unopened":[],"bounds":{"document_bytes":16777216,"sheet_cells":100000,"rows_first":2000,"rows_last":500,"rows_between":2000,"halvings":0,"cell_chars":16384,"cell_head_chars":4096},"cells_cut":0,"cells_raw":0,"read":"whole","date_system":"1900"}

{"sheet":"Foglio1","index":0,"n_rows":7,"n_cols":26,"rows_kept":7,"cut":false,"hidden":false,"merged":[[0,25,0,26],[0,11,0,12],[0,3,0,4],[0,5,0,6],[0,7,0,8],[0,9,0,10],[0,21,0,22],[0,23,0,24],[0,1,0,2],[0,13,0,14],[0,15,0,16],[0,17,0,18],[0,19,0,20]]}
[null,2018,null,{"$f":"F1-1","v":"2017-12-31"},null,{"$f":"DATE($B$1,1,1)","v":"2018-01-01"},null,{"$f":"F1+1","v":"2018-01-02"},null,{"$f":"H1+1","v":"2018-01-03"},null,{"$f":"J1+1","v":"2018-01-04"},null,{"$f":"L1+1","v":"2018-01-05"},null,{"$f":"N1+1","v":"2018-01-06"},null,{"$f":"P1+1","v":"2018-01-07"},null,{"$f":"R1+1","v":"2018-01-08"},null,{"$f":"T1+1","v":"2018-01-09"},null,{"$f":"V1+1","v":"2018-01-10"},null,{"$f":"X1+1","v":"2018-01-11"}]
[]
[]
[]
[null,null,null,null,null,null,null,"AA",null,null,null,null,null,null,null,"AA"]
[null,"Topolino",null,null,null,null,null,"AA",null,null,null,null,null,null,null,"AA",null,null,null,null,null,null,null,null,null,"AA"]
[null,"Pippo",null,null,null,null,null,null,null,"AA",null,"AA",null,"AA",null,null,null,null,null,null,null,null,null,"AA"]

{"sheet":"Foglio2","index":1,"n_rows":7,"n_cols":26,"rows_kept":7,"cut":false,"hidden":false,"merged":[[0,25,0,26],[0,13,0,14],[0,15,0,16],[0,17,0,18],[0,19,0,20],[0,21,0,22],[0,23,0,24],[0,11,0,12],[0,1,0,2],[0,3,0,4],[0,5,0,6],[0,7,0,8],[0,9,0,10]]}
[null,2018,null,{"$f":"DATE($B$1,5,1)","v":"2018-05-01"},null,{"$f":"D1+1","v":"2018-05-02"},null,{"$f":"F1+1","v":"2018-05-03"},null,{"$f":"H1+1","v":"2018-05-04"},null,{"$f":"J1+1","v":"2018-05-05"},null,{"$f":"L1+1","v":"2018-05-06"},null,{"$f":"N1+1","v":"2018-05-07"},null,{"$f":"P1+1","v":"2018-05-08"},null,{"$f":"R1+1","v":"2018-05-09"},null,{"$f":"T1+1","v":"2018-05-10"},null,{"$f":"V1+1","v":"2018-05-11"},null,{"$f":"X1+1","v":"2018-05-12"}]
[]
[]
[]
[]
[null,"Topolino",null,null,null,"AA",null,null,null,null,null,"AA"]
[null,"Pippo",null,null,null,null,null,null,null,null,null,"AA",null,null,null,"AA"]

{"sheet":"Foglio3","index":2,"n_rows":7,"n_cols":26,"rows_kept":7,"cut":false,"hidden":false,"merged":[[0,25,0,26],[0,13,0,14],[0,15,0,16],[0,17,0,18],[0,19,0,20],[0,21,0,22],[0,23,0,24],[0,11,0,12],[0,1,0,2],[0,3,0,4],[0,5,0,6],[0,7,0,8],[0,9,0,10]]}
[null,2018,null,{"$f":"DATE($B$1,9,1)","v":"2018-09-01"},null,{"$f":"D1+1","v":"2018-09-02"},null,{"$f":"F1+1","v":"2018-09-03"},null,{"$f":"H1+1","v":"2018-09-04"},null,{"$f":"J1+1","v":"2018-09-05"},null,{"$f":"L1+1","v":"2018-09-06"},null,{"$f":"N1+1","v":"2018-09-07"},null,{"$f":"P1+1","v":"2018-09-08"},null,{"$f":"R1+1","v":"2018-09-09"},null,{"$f":"T1+1","v":"2018-09-10"},null,{"$f":"V1+1","v":"2018-09-11"},null,{"$f":"X1+1","v":"2018-09-12"}]
[]
[]
[]
[]
[null,"Topolino",null,null,null,"AA"]
[null,"Pippo",null,null,null,null,null,null,null,null,null,"AA"]

{"sheet":"Foglio4","index":3,"n_rows":18,"n_cols":12,"rows_kept":18,"cut":false,"hidden":false,"merged":[]}
[]
["AA",null,1,2,3,4,5,6,7,8,9,10]
[{"$f":"sborr(A2,6,1)","v":{"$error":"#VALUE!"}},null,{"$f":"sborr(A2,6,1)","v":{"$error":"#VALUE!"}},{"$error":"#VALUE!"},{"$error":"#VALUE!"},{"$error":"#VALUE!"},{"$error":"#VALUE!"},{"$error":"#VALUE!"},{"$error":"#VALUE!"},{"$error":"#VALUE!"},{"$error":"#VALUE!"},{"$error":"#VALUE!"}]
[]
[null,"Topolino",{"$f":"IFERROR(INDIRECT(TEXT(_xlfn.AGGREGATE(15,6,(ROW($C$6:$J$8)*10000+COLUMN($C$6:$J$8))/($C$6:$J$8<>\"\"),COLUMN(A$4)),\"R0000C0000\"),),\"\")","v":"2018-01-02"},{"$f":"IFERROR(INDIRECT(TEXT(_xlfn.AGGREGATE(15,6,(ROW($C$6:$J$8)*10000+COLUMN($C$6:$J$8))/($C$6:$J$8<>\"\"),COLUMN(B$4)),\"R0000C0000\"),),\"\")","v":"2018-01-06"},"2018-01-11","2018-05-02","2018-05-05","2018-09-02","",""]
[null,1,{"$f":"IFERROR(_xlfn.AGGREGATE(15,6,Foglio1!$F$1:$IK$1/(Foglio1!$F6:$IK6=\"AA\"),COLUMN(A$4)),\"\")","v":"2018-01-02"},{"$f":"IFERROR(_xlfn.AGGREGATE(15,6,Foglio1!$F$1:$IK$1/(Foglio1!$F6:$IK6=\"AA\"),COLUMN(B$4)),\"\")","v":"2018-01-06"},{"$f":"IFERROR(_xlfn.AGGREGATE(15,6,Foglio1!$F$1:$IK$1/(Foglio1!$F6:$IK6=\"AA\"),COLUMN(C$4)),\"\")","v":"2018-01-11"},{"$f":"IFERROR(_xlfn.AGGREGATE(15,6,Foglio1!$F$1:$IK$1/(Foglio1!$F6:$IK6=\"AA\"),COLUMN(D$4)),\"\")","v":""},{"$f":"IFERROR(_xlfn.AGGREGATE(15,6,Foglio1!$F$1:$IK$1/(Foglio1!$F6:$IK6=\"AA\"),COLUMN(E$4)),\"\")","v":""},{"$f":"IFERROR(_xlfn.AGGREGATE(15,6,Foglio1!$F$1:$IK$1/(Foglio1!$F6:$IK6=\"AA\"),COLUMN(F$4)),\"\")","v":""},{"$f":"IFERROR(_xlfn.AGGREGATE(15,6,Foglio1!$F$1:$IK$1/(Foglio1!$F6:$IK6=\"AA\"),COLUMN(G$4)),\"\")","v":""},{"$f":"IFERROR(_xlfn.AGGREGATE(15,6,Foglio1!$F$1:$IK$1/(Foglio1!$F6:$IK6=\"AA\"),COLUMN(H$4)),\"\")","v":""}]
[null,2,{"$f":"IFERROR(_xlfn.AGGREGATE(15,6,Foglio2!$F$1:$IK$1/(Foglio2!$F6:$IK6=\"AA\"),COLUMN(A$4)),\"\")","v":"2018-05-02"},{"$f":"IFERROR(_xlfn.AGGREGATE(15,6,Foglio2!$F$1:$IK$1/(Foglio2!$F6:$IK6=\"AA\"),COLUMN(B$4)),\"\")","v":"2018-05-05"},{"$f":"IFERROR(_xlfn.AGGREGATE(15,6,Foglio2!$F$1:$IK$1/(Foglio2!$F6:$IK6=\"AA\"),COLUMN(C$4)),\"\")","v":""},{"$f":"IFERROR(_xlfn.AGGREGATE(15,6,Foglio2!$F$1:$IK$1/(Foglio2!$F6:$IK6=\"AA\"),COLUMN(D$4)),\"\")","v":""},{"$f":"IFERROR(_xlfn.AGGREGATE(15,6,Foglio2!$F$1:$IK$1/(Foglio2!$F6:$IK6=\"AA\"),COLUMN(E$4)),\"\")","v":""},{"$f":"IFERROR(_xlfn.AGGREGATE(15,6,Foglio2!$F$1:$IK$1/(Foglio2!$F6:$IK6=\"AA\"),COLUMN(F$4)),\"\")","v":""},{"$f":"IFERROR(_xlfn.AGGREGATE(15,6,Foglio2!$F$1:$IK$1/(Foglio2!$F6:$IK6=\"AA\"),COLUMN(G$4)),\"\")","v":""},{"$f":"IFERROR(_xlfn.AGGREGATE(15,6,Foglio2!$F$1:$IK$1/(Foglio2!$F6:$IK6=\"AA\"),COLUMN(H$4)),\"\")","v":""}]
[null,3,{"$f":"IFERROR(_xlfn.AGGREGATE(15,6,Foglio3!$F$1:$IK$1/(Foglio3!$F6:$IK6=\"AA\"),COLUMN(A$4)),\"\")","v":"2018-09-02"},{"$f":"IFERROR(_xlfn.AGGREGATE(15,6,Foglio3!$F$1:$IK$1/(Foglio3!$F6:$IK6=\"AA\"),COLUMN(B$4)),\"\")","v":""},{"$f":"IFERROR(_xlfn.AGGREGATE(15,6,Foglio3!$F$1:$IK$1/(Foglio3!$F6:$IK6=\"AA\"),COLUMN(C$4)),\"\")","v":""},{"$f":"IFERROR(_xlfn.AGGREGATE(15,6,Foglio3!$F$1:$IK$1/(Foglio3!$F6:$IK6=\"AA\"),COLUMN(D$4)),\"\")","v":""},{"$f":"IFERROR(_xlfn.AGGREGATE(15,6,Foglio3!$F$1:$IK$1/(Foglio3!$F6:$IK6=\"AA\"),COLUMN(E$4)),\"\")","v":""},{"$f":"IFERROR(_xlfn.AGGREGATE(15,6,Foglio3!$F$1:$IK$1/(Foglio3!$F6:$IK6=\"AA\"),COLUMN(F$4)),\"\")","v":""},{"$f":"IFERROR(_xlfn.AGGREGATE(15,6,Foglio3!$F$1:$IK$1/(Foglio3!$F6:$IK6=\"AA\"),COLUMN(G$4)),\"\")","v":""},{"$f":"IFERROR(_xlfn.AGGREGATE(15,6,Foglio3!$F$1:$IK$1/(Foglio3!$F6:$IK6=\"AA\"),COLUMN(H$4)),\"\")","v":""}]
[null,"Pippo",{"$f":"IF(IFERROR(INDEX(Foglio1!$F$1:$IK$1,_xlfn.AGGREGATE(15,6,COLUMN($A:$IJ)/(Foglio1!$F7:$IK7=\"AA\"),COLUMN(A$4))),)=0,\"\",IFERROR(INDEX(Foglio1!$F$1:$IK$1,_xlfn.AGGREGATE(15,6,COLUMN($A:$IJ)/(Foglio1!$F7:$IK7=\"AA\"),COLUMN(A$4))),))","v":"2018-01-03"},{"$f":"IF(IFERROR(INDEX(Foglio1!$F$1:$IK$1,_xlfn.AGGREGATE(15,6,COLUMN($A:$IJ)/(Foglio1!$F7:$IK7=\"AA\"),COLUMN(B$4))),)=0,\"\",IFERROR(INDEX(Foglio1!$F$1:$IK$1,_xlfn.AGGREGATE(15,6,COLUMN($A:$IJ)/(Foglio1!$F7:$IK7=\"AA\"),COLUMN(B$4))),))","v":"2018-01-04"},{"$f":"IF(IFERROR(INDEX(Foglio1!$F$1:$IK$1,_xlfn.AGGREGATE(15,6,COLUMN($A:$IJ)/(Foglio1!$F7:$IK7=\"AA\"),COLUMN(C$4))),)=0,\"\",IFERROR(INDEX(Foglio1!$F$1:$IK$1,_xlfn.AGGREGATE(15,6,COLUMN($A:$IJ)/(Foglio1!$F7:$IK7=\"AA\"),COLUMN(C$4))),))","v":"2018-01-05"},{"$f":"IF(IFERROR(INDEX(Foglio1!$F$1:$IK$1,_xlfn.AGGREGATE(15,6,COLUMN($A:$IJ)/(Foglio1!$F7:$IK7=\"AA\"),COLUMN(D$4))),)=0,\"\",IFERROR(INDEX(Foglio1!$F$1:$IK$1,_xlfn.AGGREGATE(15,6,COLUMN($A:$IJ)/(Foglio1!$F7:$IK7=\"AA\"),COLUMN(D$4))),))","v":"2018-01-10"},"2018-05-05","2018-05-07","2018-09-05",{"$f":"IF(IFERROR(INDEX(Foglio1!$F$1:$IK$1,_xlfn.AGGREGATE(15,6,COLUMN($A:$IJ)/(Foglio1!$F7:$IK7=\"AA\"),COLUMN(H$4))),)=0,\"\",IFERROR(INDEX(Foglio1!$F$1:$IK$1,_xlfn.AGGREGATE(15,6,COLUMN($A:$IJ)/(Foglio1!$F7:$IK7=\"AA\"),COLUMN(H$4))),))","v":""}]
[]
[]
[null,{"$f":"sss(Foglio1!C16)","v":1}]
[]
[]
[null,null,null,null,null,null,null,{"$f":"\"\"","v":""}]
[]
[]
[null,null,null,null,null,null,null,null,null,null,null,{"$f":"COUNTIF($H$15:$J$15,\"<0\")","v":0}]