{"text_format":"1","workbook":"xlsx","n_sheets":2,"sheets":["Данные","Форма"],"not_rendered":{"charts":0,"images":0,"macros":1,"external_links":0,"defined_names":0,"comments":0,"pivot_tables":0},"unopened":[],"bounds":{"document_bytes":16777216,"sheet_cells":100000,"rows_first":2000,"rows_last":500,"rows_between":2000,"halvings":0,"cell_chars":16384,"cell_head_chars":4096},"cells_cut":0,"cells_raw":0,"read":"whole","date_system":"1900"}

{"sheet":"Данные","index":0,"n_rows":34,"n_cols":11,"rows_kept":34,"cut":false,"hidden":false,"merged":[[0,0,0,6]]}
["Перевозка по территории за ",null,null,null,null,null,null,"апрель",2018]
["№ п/п","Дата","Авто № 1","Авто №2","Авто № 3","Авто № 4","Авто № 5","Авто № 6",null,null,"Всего :"]
[1,{"$f":"IF(MONTH($H$1&0)=MONTH(DATE($I$1,MONTH($H$1&0),A3)),DATE($I$1,MONTH($H$1&0),A3),\"\")","v":"2018-04-01"},80,80,96,0,80,32,null,null,{"$f":"SUM(C3:J3)","v":368}]
[2,{"$f":"IF(MONTH($H$1&0)=MONTH(DATE($I$1,MONTH($H$1&0),A4)),DATE($I$1,MONTH($H$1&0),A4),\"\")","v":"2018-04-02"},144,160,160,0,160,160,null,null,{"$f":"SUM(C4:J4)","v":784}]
[3,"2018-04-03",128,144,128,0,144,144,null,null,688]
[4,"2018-04-04",128,112,128,0,160,192,null,null,720]
[5,"2018-04-05",112,96,176,0,160,144,null,null,688]
[6,"2018-04-06",176,128,192,0,176,160,null,null,832]
[7,"2018-04-07",128,112,112,0,144,144,null,null,640]
[8,"2018-04-08",0,0,0,0,0,0,null,null,0]
[9,"2018-04-09",144,144,160,0,176,144,null,null,768]
[10,"2018-04-10",112,128,160,0,160,112,null,null,672]
[11,"2018-04-11",112,112,112,0,128,112,null,null,{"$f":"SUM(C13:J13)","v":576}]
[12,"2018-04-12",96,144,144,0,144,160,null,null,688]
[13,"2018-04-13",160,192,160,0,176,128,null,null,816]
[14,"2018-04-14",192,128,192,0,192,192,null,null,896]
[15,"2018-04-15",144,128,128,0,160,144,null,null,704]
[16,"2018-04-16",192,144,192,0,192,192,null,null,912]
[17,"2018-04-17",240,{"$f":"12*16","v":192},240,0,240,240,null,null,1152]
[18,"2018-04-18",{"$f":"13*16","v":208},{"$f":"15*16","v":240},{"$f":"13*16","v":208},0,{"$f":"13*16","v":208},{"$f":"14*16","v":224},null,null,1088]
[19,"2018-04-19",{"$f":"14*16","v":224},{"$f":"12*16","v":192},{"$f":"14*16","v":224},0,{"$f":"14*16","v":224},{"$f":"14*16","v":224},null,null,1088]
[20,"2018-04-20",240,{"$f":"14*16","v":224},{"$f":"15*16","v":240},0,240,240,null,null,1184]
[21,"2018-04-21",{"$f":"15*16","v":240},{"$f":"14*16","v":224},{"$f":"13*16","v":208},0,240,240,null,null,1152]
[22,"2018-04-22",{"$f":"22*16","v":352},{"$f":"18*16","v":288},{"$f":"19*16","v":304},0,{"$f":"16*16","v":256},{"$f":"18*16","v":288},null,null,1488]
[23,"2018-04-23",{"$f":"18*16","v":288},{"$f":"18*16","v":288},288,0,288,288,null,null,1440]
[24,"2018-04-24",240,288,240,0,256,208,null,null,1232]
[25,"2018-04-25",{"$f":"15*16","v":240},208,208,0,{"$f":"13*16","v":208},{"$f":"12*16","v":192},null,null,1056]
[26,"2018-04-26",{"$f":"15*16","v":240},0,{"$f":"10*16","v":160},0,160,{"$f":"11*16","v":176},null,null,736]
[27,"2018-04-27",null,null,null,null,null,null,null,null,0]
[28,"2018-04-28",null,null,null,null,null,null,null,null,0]
[29,"2018-04-29",null,null,null,null,null,null,null,null,0]
[30,"2018-04-30",null,null,null,null,null,null,null,null,0]
[31,"",null,null,null,null,null,null,null,null,0]
[null,null,{"$f":"SUM(C3:C33)","v":4560},4096,4560,0,4672,4480,0,0,22368]

{"sheet":"Форма","index":1,"n_rows":7,"n_cols":7,"rows_kept":7,"cut":false,"hidden":false,"merged":[]}
["Отчет №",1,null,null,"Форма 100500"]
[]
["Выполнение на",{"$f":"Данные!B3","v":"2018-04-01"},"по автомобилям"]
["Автомобиль",{"$f":"Данные!C2","v":"Авто № 1"},{"$f":"Данные!D2","v":"Авто №2"},{"$f":"Данные!E2","v":"Авто № 3"},{"$f":"Данные!F2","v":"Авто № 4"},{"$f":"Данные!G2","v":"Авто № 5"},{"$f":"Данные!H2","v":"Авто № 6"}]
["Масса",{"$f":"INDEX(Данные!$C3:$ZZ33,$B1,COLUMN(A1))","v":80},{"$f":"INDEX(Данные!$C3:$ZZ33,$B1,COLUMN(B1))","v":80},{"$f":"INDEX(Данные!$C3:$ZZ33,$B1,COLUMN(C1))","v":96},{"$f":"INDEX(Данные!$C3:$ZZ33,$B1,COLUMN(D1))","v":0},{"$f":"INDEX(Данные!$C3:$ZZ33,$B1,COLUMN(E1))","v":80},{"$f":"INDEX(Данные!$C3:$ZZ33,$B1,COLUMN(F1))","v":32}]
["Объем",{"$f":"B5*1.8","v":144},{"$f":"C5*1.8","v":144},172.8,0,144,57.6]
["Зачесть",{"$f":"IF(B6>100,B6*1.5,B6)","v":216},{"$f":"IF(C6>100,C6*1.5,C6)","v":216},259.20000000000005,0,216,57.6]