{"text_format":"1","workbook":"xlsx","n_sheets":5,"sheets":["Пример АВС","Temp-Z","Keywords match types","Keywords from title","csv"],"not_rendered":{"charts":0,"images":0,"macros":1,"external_links":0,"defined_names":1,"comments":0,"pivot_tables":0},"unopened":[],"bounds":{"document_bytes":16777216,"sheet_cells":100000,"rows_first":2000,"rows_last":500,"rows_between":2000,"halvings":0,"cell_chars":16384,"cell_head_chars":4096},"cells_cut":0,"cells_raw":0,"read":"whole","date_system":"1900"}

{"sheet":"Пример АВС","index":0,"n_rows":102,"n_cols":15,"rows_kept":102,"cut":false,"hidden":true,"merged":[[1,10,3,10],[6,10,8,10]]}
[null,"Продажи","A","B","C",null,"Категория","A","B","C","Занятость ниши",null,null,"Вывод","Рекомендация"]
[1,61599.46,{"$f":"IF(F2<0.5*B$102,1,0)","v":1},{"$f":"IF(AND(F2<(0.75*B$102),F2>0.5*B$102)=FALSE,0,1)","v":0},{"$f":"IF(F2>(0.75*B$102),1,0)","v":0},{"$f":"B2","v":61599.46},"Numeric",{"$f":"COUNTIF(C2:C101,1)/100","v":0.26},{"$f":"COUNTIF(D2:D101,1)/100","v":0.27},{"$f":"COUNTIF(E2:E101,1)/100","v":0.47},{"$f":"1-(SUM(H2:I2)/SUM(H2:J2))/SUM(H3:I3)","v":0.29175492217582588},null,"90-100%","Ниша занята полностью","Не заходить!"]
[2,58717.08,1,0,0,{"$f":"B3+F2","v":120316.54000000001},"Weight",{"$f":"C102/SUM($C102:$E102)","v":0.4948534958822372},{"$f":"D102/SUM($C102:$E102)","v":0.25347503698696772},{"$f":"E102/SUM($C102:$E102)","v":0.25167146713079502},null,null,"75-90%","Ниша занята","Заходить опасно!"]
[3,53726.400000000001,1,0,0,174042.94,"Коефициент разрыва",{"$f":"H3/H2","v":1.9032826764701429},{"$f":"I3/I2","v":0.93879643328506557},{"$f":"J3/J2","v":0.53547120666126602},null,null,"60-75%","Ниша почти занята","Заходить сильно рискованно!"]
[4,43348.89,1,0,0,217391.83000000002,null,null,null,null,null,null,"50-60%","Ниша частично занята","Заходить рискованно"]
[5,37432.589999999997,1,0,0,254824.42,"Категория","A","B","C","Занятость ниши",null,"25-50%","Ниша частично свободна","Заходить можно"]
[6,34145.65,1,0,0,288970.07,"Numeric",{"$f":"H8","v":0.49324368350971698},{"$f":"I8","v":0.25628077436480601},{"$f":"1-SUM(H7:I7)","v":0.25047554212547696},{"$f":"1-(SUM(H7:I7)/SUM(H7:J7))/SUM(H8:I8)","v":0},null,"10-25%","Ниша свободна","Заходить рекомендуется"]
[7,30194.1,1,0,0,319164.17,"Weight",0.49324368350971698,0.25628077436480601,0.25047554212547696,null,null,"0-10%","Ниша полностью свободна","Заходить нужно!"]
[8,28045,1,0,0,347209.17,"Коефициент разрыва",{"$f":"H8/H7","v":1},{"$f":"I8/I7","v":1},{"$f":"J8/J7","v":1}]
[9,27403.35,1,0,0,374612.51999999996]
[10,26241.25,1,0,0,400853.76999999996]
[11,26026.98,1,0,0,426880.74999999994]
[12,25830.09,1,0,0,452710.83999999997]
[13,25204.36,1,0,0,477915.19999999995]
[14,24255.77,1,0,0,502170.97]
[15,24233.94,1,0,0,526404.90999999992]
[16,22715.91,1,0,0,549120.81999999995]
[17,22316.82,1,0,0,571437.6399999999]
[18,22162.61,1,0,0,593600.24999999988]
[19,22155.9,1,0,0,615756.14999999991]
[20,21833.759999999998,1,0,0,637589.90999999992]
[21,21135.29,1,0,0,658725.19999999995]
[22,20746.16,1,0,0,679471.36]
[23,20328.7,1,0,0,699800.05999999994]
[24,20206.52,1,0,0,720006.58]
[25,19823.39,1,0,0,739829.97]
[26,18121.23,1,0,0,757951.2]
[27,17937.240000000002,0,1,0,775888.44]
[28,17635.59,0,1,0,793524.02999999991]
[29,17521.740000000002,0,1,0,811045.7699999999]
[30,16941.05,0,1,0,827986.82]
[31,16354.09,0,1,0,844340.90999999992]
[32,16186.43,0,1,0,860527.34]
[33,16056.39,{"$f":"IF(F34<0.5*B$102,1,0)","v":0},{"$f":"IF(AND(F34<(0.75*B$102),F34>0.5*B$102)=FALSE,0,1)","v":1},{"$f":"IF(F34>(0.75*B$102),1,0)","v":0},876583.73]
[34,16046.79,0,1,0,{"$f":"B35+F34","v":892630.52}]
[35,15190.5,0,1,0,907821.02]
[36,14975.01,0,1,0,922796.03]
[37,14873.55,0,1,0,937669.58000000007]
[38,14760,0,1,0,952429.58000000007]
[39,14745.45,0,1,0,967175.03]
[40,14647.56,0,1,0,981822.59000000008]
[41,13889.55,0,1,0,995712.14000000013]
[42,13850.76,0,1,0,1009562.9000000001]
[43,13820.16,0,1,0,1023383.0600000002]
[44,13790,0,1,0,1037173.0600000002]
[45,13698.29,0,1,0,1050871.3500000001]
[46,13559.52,0,1,0,1064430.8700000001]
[47,12993.83,0,1,0,1077424.7000000002]
[48,12736.36,0,1,0,1090161.0600000003]
[49,12144,0,1,0,1102305.0600000003]
[50,11425.7,0,1,0,1113730.7600000002]
[51,10867.5,0,1,0,1124598.2600000002]
[52,10811.95,0,1,0,1135410.2100000002]
[53,10780.56,0,1,0,1146190.7700000003]
[54,10454.77,0,0,1,1156645.5400000003]
[55,10357.41,0,0,1,1167002.9500000002]
[56,10137.66,0,0,1,1177140.6100000001]
[57,10089.9,0,0,1,1187230.51]
[58,10075.200000000001,0,0,1,1197305.71]
[59,10028.44,0,0,1,1207334.1499999999]
[60,9807.4500000000007,0,0,1,1217141.5999999999]
[61,9803.08,0,0,1,1226944.68]
[62,9718.3700000000008,0,0,1,1236663.05]
[63,9488.2999999999993,0,0,1,1246151.3500000001]
[64,9327.51,0,0,1,1255478.8600000001]
[65,9323.7800000000007,{"$f":"IF(F66<0.5*B$102,1,0)","v":0},{"$f":"IF(AND(F66<(0.75*B$102),F66>0.5*B$102)=FALSE,0,1)","v":0},{"$f":"IF(F66>(0.75*B$102),1,0)","v":1},1264802.6400000001]
[66,9274.86,0,0,1,{"$f":"B67+F66","v":1274077.5000000002}]
[67,8976.09,0,0,1,1283053.5900000003]
[68,8955.52,0,0,1,1292009.1100000003]
[69,8814.6,0,0,1,1300823.7100000004]
[70,8814.6,0,0,1,1309638.3100000005]
[71,8746.5,0,0,1,1318384.8100000005]
[72,8735.4,0,0,1,1327120.2100000004]
[73,8564.49,0,0,1,1335684.7000000004]
[74,8527.26,0,0,1,1344211.9600000004]
[75,8490.69,0,0,1,1352702.6500000004]
[76,8300.61,0,0,1,1361003.2600000005]
[77,8209.68,0,0,1,1369212.9400000004]
[78,8149.47,0,0,1,1377362.4100000004]
[79,8049.63,0,0,1,1385412.0400000003]
[80,8000,0,0,1,1393412.0400000003]
[81,7893.6,0,0,1,1401305.6400000004]
[82,7704.43,0,0,1,1409010.0700000003]
[83,7640.85,0,0,1,1416650.9200000004]
[84,7633.98,0,0,1,1424284.9000000004]
[85,7562.43,0,0,1,1431847.3300000003]
[86,7412,0,0,1,1439259.3300000003]
[87,7364.93,0,0,1,1446624.2600000002]
[88,7226.1,0,0,1,1453850.3600000003]
[89,7198,0,0,1,1461048.3600000003]
[90,7146.75,0,0,1,1468195.1100000003]
[91,6684.48,0,0,1,1474879.5900000003]
[92,6566.35,0,0,1,1481445.9400000004]
[93,6437.2,0,0,1,1487883.1400000004]
[94,6416.79,0,0,1,1494299.9300000004]
[95,6259.98,0,0,1,1500559.9100000004]
[96,6244.35,0,0,1,1506804.2600000005]
[97,6241.77,{"$f":"IF(F98<0.5*B$102,1,0)","v":0},0,{"$f":"IF(F98>(0.75*B$102),1,0)","v":1},1513046.0300000005]
[98,6223.17,{"$f":"IF(F99<0.5*B$102,1,0)","v":0},0,{"$f":"IF(F99>(0.75*B$102),1,0)","v":1},1519269.2000000004]
[99,6211.3,{"$f":"IF(F100<0.5*B$102,1,0)","v":0},0,{"$f":"IF(F100>(0.75*B$102),1,0)","v":1},1525480.5000000005]
[100,6187.37,{"$f":"IF(F101<0.5*B$102,1,0)","v":0},0,{"$f":"IF(F101>(0.75*B$102),1,0)","v":1},1531667.8700000006]
[null,{"$f":"SUM(B2:B101)","v":1531667.8700000006},{"$f":"SUMIFS(B2:B101,C2:C101,1)","v":757951.2},{"$f":"SUMIFS(B2:B101,D2:D101,1)","v":388239.57},{"$f":"SUMIFS(B2:B101,E2:E101,1)","v":385477.0999999998}]

{"sheet":"Temp-Z","index":1,"n_rows":16,"n_cols":2,"rows_kept":16,"cut":false,"hidden":true,"merged":[]}
["Показатели ниши",{"$f":"#REF!","v":{"$error":"#REF!"}}]
["Кол-во SKU с RPR>100 на страницах категории А",{"$f":"SUM(IF(COUNTIF(#REF!,\"A\")=0,SUMIFS(#REF!,#REF!,\"A+B\"),SUMIFS(#REF!,#REF!,\"A\")),IF(COUNTIF(#REF!,\"A\")=0,SUMIFS(#REF!,#REF!,\"A+B\"),SUMIFS(#REF!,#REF!,\"A\")))","v":{"$error":"#REF!"}}]
["Кол-во SKU с BSR < \"порога\" на страницах категории А",{"$f":"SUM(IF(VLOOKUP(#REF!,#REF!,2,0)=\"ND\",\"Н/Д по BSR\",IF(COUNTIF(#REF!,\"A\")=0,SUMIFS(#REF!,#REF!,\"A+B\"),SUMIFS(#REF!,#REF!,\"A\"))),IF(VLOOKUP(#REF!,#REF!,2,0)=\"ND\",\"Н/Д по BSR\",IF(COUNTIF(#REF!,\"A\")=0,SUMIFS(#REF!,#REF!,\"A+B\"),SUMIFS(#REF!,#REF!,\"A\"))))","v":{"$error":"#REF!"}}]
["Кол-во поисковых запросов / в мес.",{"$f":"IF('Temp-Z'!W4=\"Вы не указали кол-во поисковых запросов!!!\",\"Нет данных\",'Temp-Z'!W4)","v":0}]
["Объём продаж ниши (TOP 100) / в мес.",{"$f":"ROUND(SUMIFS(#REF!,#REF!,\"<101\"),0)","v":{"$error":"#REF!"}}]
["Кол-во продаж ниши (TOP 100) / в мес.",{"$f":"SUMIFS(#REF!,#REF!,\"<101\")","v":{"$error":"#REF!"}}]
["Плотность ниши",{"$f":"#REF!","v":{"$error":"#REF!"}}]
["Перспектива развития ниши для FBA",{"$f":"#REF!","v":{"$error":"#REF!"}}]
["Средняя цена товаров категорий А+B",{"$f":"ROUND(AVERAGE('Temp-Z'!W11:X11),2)","v":24.74}]
["Средний объём продаж товаров категорий А+B / в мес.",{"$f":"ROUND(SUM('Temp-Z'!W7:X7)/SUM('Temp-Z'!W9:X9),0)","v":17716}]
["Средний кол-во продаж товаров категорий А+B / в мес.",{"$f":"SUM('Temp-Z'!W8:X8)/SUM('Temp-Z'!W9:X9)","v":1011.5217391304348}]
["Средний вес товаров категорий А+B",{"$f":"ROUND((AVERAGEIFS(#REF!,#REF!,\"A\",#REF!,\">0\")+AVERAGEIFS(#REF!,#REF!,\"B\",#REF!,\">0\"))/2,1)","v":{"$error":"#REF!"}}]
["Сила брендов (по обороту)",{"$f":"#REF!","v":{"$error":"#REF!"}}]
["Сила брендов (по продажам)",{"$f":"#REF!","v":{"$error":"#REF!"}}]
["Кол-во страниц категории А",{"$f":"COUNTIF(#REF!,\"A\")","v":{"$error":"#REF!"}}]
["Кол-во страниц категории B",{"$f":"COUNTIF(#REF!,\"B\")","v":{"$error":"#REF!"}}]

{"sheet":"Keywords match types","index":2,"n_rows":14,"n_cols":5,"rows_kept":14,"cut":false,"hidden":true,"merged":[]}
["Match type","Example keyword","Ads can show on search terms that include","Matches to these customer search terms","Doesn't match these customer search terms"]
["Broad match","boys shoes","related searches, and relevant variations","boys shoes size 10, waterproof boys shoes","Boys pants, mens shoes"]
["Phrase match","boys shoes","the phrase and close variations of the phrase","boys shoes, boys shoes 10","shoes for boys, shoes boys, boys red shoes"]
["Exact match","boys shoes","the exact phrase and close variations of the exact phrase","boys shoes","boys shoes 10"]
["Tips:"]
["Ключевые слова не чувствительны к регистру, поэтому они будут соответствовать прописным или строчным буквам в поисковых терминах."]
["Stemmed words, abbreviations, plurals, common misspellings, and synonyms are not supported.","Строковые слова, аббревиатуры, множественные числа, общие орфографические ошибки и синонимы не поддерживаются."]
[]
["Match type","Example keyword","Ads don't show on search queries that contain","Excludes shopper search queries like these","Doesn't exclude shopper search queries like these"]
["Negative phrase","boys shoes","the complete phrase or close variations","Boys shoes, boys shoes 10","shoes for boys, boys red shoes, shoes boys,"]
["Negative exact","boys shoes","the exact phrase or close variations","boys shoes, boy's shoe","boys shoes 10"]
["Match type","Word limit","Character limit"]
["Negative phrase","4 words","80 characters"]
["Negative exact","10 words","80 characters"]

{"sheet":"Keywords from title","index":3,"n_rows":804,"n_cols":5,"rows_kept":804,"cut":false,"hidden":true,"merged":[]}
[]
["WALNUT",442,null,"Sun",1]
["oz",130,null,"AmishTastes",1]
["Pack",116,null,"American",2]
["Ounce",90,null,"Amoretti",3]
["Nut",78,null,"Amish",2]
["LB",68,null,"Assortit",2]
["Raw",67,null,"Answer",1]
["Organic",66,null,"Butlers",3]
["Black",58,null,"Bakery",4]
["Natural",44,null,"AppleTree",1]
["Halve",42,null,"AseusLtd",1]
["Piece",39,null,"Bar",5]
["BAR",37,null,"Austera",1]
["Almond",35,null,"Azar",2]
["CALIFORNIA",35,null,"Awesome",1]
["Free",31,null,"Bake",2]
["Bag",31,null,"Back",1]
["Pound",31,null,"Bakers",1]
["Chocolate",30,null,"Buggy",2]
["Oatmeal",27,null,"BakeryAnywhere",1]
["Butter",24,null,"Bayside",4]
["Shelled",24,null,"Baking",1]
["g",23,null,"Baklava",1]
["Raisin",23,null,"Barry",1]
["count",22,null,"Brothers",5]
["Gluten",21,null,"Bars",1]
["Cashew",20,null,"Barts",1]
["Maple",20,null,"Bazzini",1]
["Shell",19,null,"Candy",7]
["box",19,null,"Company",4]
["Mix",19,null,"Beanilla",1]
["Pecan",19,null,"Belly",1]
["Snack",19,null,"Bernices",1]
["Tea",18,null,"Best",1]
["Date",17,null,"BetterFoods",1]
["Farm",17,null,"Biscotti",1]
["Diamond",16,null,"Blanca",1]
["Food",16,null,"Blue",1]
["GMO",16,null,"Botanicals",1]
["Non",16,null,"Braga",1]
["LBS",15,null,"Cakes",5]
["Roasted",15,null,"Butter",2]
["Apple",15,null,"Brand",1]
["Healthy",15,null,"Bulk",1]
["Fresh",14,null,"California",3]
["Cookie",14,null,"Buy",1]
["Premium",13,null,"Clif",5]
["All",13,null,"Butters",2]
["Cake",13,null,"CandyMax",2]
["Extract",13,null,"Carleys",1]
["Fudge",12,null,"Fresh",7]
["Banana",12,null,"Candies",3]
["Bulk",12,null,"Duncan",3]
["Oat",12,null,"CHIYGBC",2]
["Brownie",11,null,"Carli",1]
["Cereal",11,null,"Caviar",1]
["Certified",11,null,"Cereal",1]
["Chopped",11,null,"Cheese",1]
["dry",11,null,"Chef",1]
["Instant",11,null,"Chercher",1]
["Kosher",11,null,"China",1]
["Light",10,null,"Chocolate",2]
["Quaker",10,null,"Choice",2]
["Raspberry",10,null,"Cloud",2]
["Brazil",10,null,"Christophers",1]
["Unsalted",10,null,"CoffeeCakescom",1]
["Calorie",9,null,"Fisher",5]
["Red",9,null,"Eats",4]
["Dressing",9,null,"Co",2]
["From",9,null,"Cravings",2]
["Jumbo",9,null,"Community",1]
["No",9,null,"Cookie",1]
["Vinaigrette",9,null,"Cookies",1]
["Signature",8,null,"Dried",8]
["Vegan",8,null,"Emerald",6]
["Kirkland",8,null,"Crazy",2]
["Milk",8,null,"Cream",2]
["Powder",8,null,"DAMTUH",2]
["whole",8,null,"elizabeth",2]
["Creek",8,null,"Cooking",1]
["Crunchy",8,null,"Corona",1]
["Dried",8,null,"COU",1]
["Flavor",8,null,"Country",1]
["Grown",8,null,"Custom",1]
["SYRUP",8,null,"Dance",1]
["House",7,null,"Farms",10]
["Mixed",7,null,"Farm",8]
["Salted",7,null,"Food",6]
["Omega",7,null,"Fee",4]
["Nuts",7,null,"Fields",3]
["Pieces",7,null,"Elmhurst",2]
["Quality",7,null,"Factor",2]
["Chip",7,null,"Debbie",1]
["Cinnamon",7,null,"DeLallo",1]
["fl",7,null,"Delight",1]
["Glazed",7,null,"Delish",1]
["Go",7,null,"DeMedici",1]
["Gourmet",7,null,"Doctors",1]
["Hull",7,null,"Dr",1]
["Jar",7,null,"Edmond",1]
["Packs",7,null,"Elan",1]
["per",7,null,"EmeraldГ‚В®",1]
["Sincerely",7,null,"England",1]
["Super",7,null,"Epic",1]
["вЂ“",7,null,"Erin",1]
["Granola",6,null,"Walnut",10]
["Pickled",6,null,"Creek",8]
["Fruit",6,null,"Fruit",8]
["Trail",6,null,"Kirkland",8]
["Tasty",6,null,"Gourmet",7]
["Pamela",6,null,"Fruits",6]
["Two",6,null,"Harvest",6]
["Opie",6,null,"Got",5]
["Joe",6,null,"lbs",4]
["Large",6,null,"From",3]
["Trader",6,null,"Fudge",3]
["Family",6,null,"Fallot",2]
["Fig",6,null,"Futters",2]
["Cluster",6,null,"Estates",1]
["Cup",6,null,"European",1]
["Daily",6,null,"Evo",1]
["Energy",6,null,"Extracts",1]
["English",6,null,"FastachiВ®",1]
["Green",6,null,"First",1]
["Nature",6,null,"Flavors",1]
["Orchard",6,null,"Formerly",1]
["Presto",6,null,"Formula",1]
["PROTEIN",6,null,"Foxs",1]
["Salad",6,null,"Fratelli",1]
["Source",6,null,"Fredlyn",1]
["Sweet",6,null,"Fu",1]
["We",6,null,"Fusion",1]
["Got",5,null,"Sincerely",7]
["Sahale",5,null,"House",6]
["FISHER",5,null,"Hammons",5]
["Pistachio",5,null,"Kens",5]
["~",5,null,"Georgian",3]
["Boxe",5,null,"GoMacro",3]
["CLIF",5,null,"Healing",3]
["Scott",5,null,"Hines",3]
["Bottle",5,null,"Ghirardelli",2]
["Breakfast",5,null,"Go",2]
["Chef",5,null,"Gorilla",2]
["Eat",5,null,"Grown",2]
["Ken",5,null,"HawaiiPharm",2]
["Sale",5,null,"Healthy",2]
["Seed",5,null,"Hill",2]
["Artisana",5,null,"Gethsemani",1]
["Brand",5,null,"GIP",1]
["Brother",5,null,"Gnu",1]
["Case",5,null,"GOLDING",1]
["Cherrie",5,null,"Good",1]
["Co",5,null,"Grandmas",1]
["Grain",5,null,"Granola",1]
["Great",5,null,"Graze",1]
["Hammon",5,null,"Green",1]
["Hazelnut",5,null,"Guys",1]
["LLC",5,null,"Halls",1]
["Macadamia",5,null,"Hammonds",1]
["Mustard",5,null,"Happy",1]
["Real",5,null,"Heartbar",1]
["Spice",5,null,"heidicom",1]
["Sprouted",5,null,"Hemp",1]
["Sugar",5,null,"Henna",1]
["Superfood",5,null,"Herb",1]
["Honey",4,null,"Quaker",8]
["Bars",4,null,"Joes",6]
["each",4,null,"Nut",6]
["Gift",4,null,"Natures",5]
["Live",4,null,"Linwoods",4]
["Q",4,null,"Live",4]
["Sarah",4,null,"NutsВ®",4]
["Baking",4,null,"Natural",3]
["Bakery",4,null,"Italia",2]
["Covered",4,null,"Keep",2]
["Flour",4,null,"Kii",2]
["Harvest",4,null,"lara",2]
["Linwood",4,null,"Love",2]
["Topping",4,null,"ltd",2]
["Umpqua",4,null,"Lucini",2]
["USDA",4,null,"Main",2]
["Whenever",4,null,"Mark",2]
["Amish",4,null,"Herbals",1]
["Anna",4,null,"Herbs",1]
["Artificial",4,null,"Hider",1]
["bags",4,null,"How",1]
["Blend",4,null,"Hudson",1]
["Candied",4,null,"Inc",1]
["Chinese",4,null,"Is",1]
["Chunk",4,null,"It",1]
["Coconut",4,null,"Its",1]
["Cranberry",4,null,"Jalpur",1]
["Crisp",4,null,"Jar",1]
["Deliciou",4,null,"JoJeВґ",1]
["Emerald",4,null,"JOJOs",1]
["Fee",4,null,"JollyCandy",1]
["Field",4,null,"JSJM",1]
["FLAVORING",4,null,"Juice",1]
["Flaxseed",4,null,"Khodkar",1]
["Ground",4,null,"KIND",1]
["Home",4,null,"Kitchen",1]
["Hot",4,null,"Kroeger",1]
["Jam",4,null,"L",1]
["Jujube",4,null,"Lab",1]
["Leaf",4,null,"Laynees",1]
["Lite",4,null,"lee@bzs",1]
["Mr",4,null,"lee@qq",1]
["Nutrient",4,null,"Libanais",1]
["Oh!",4,null,"Liebers",1]
["Pounds",4,null,"Line",1]
["Product",4,null,"Little",1]
["Resealable",4,null,"Living",1]
["STEAK",4,null,"LorAnn",1]
["Three",4,null,"Luna",1]
["Value",4,null,"Luoliluo",1]
["Variety",4,null,"Maria",1]
["ZIN",4,null,"Market",1]
["Hine",3,null,"Diamond",16]
["Healing",3,null,"PecanShopcom",6]
["SALT",3,null,"Presto",6]
["U",3,null,"Products",6]
["Wellsley",3,null,"sales",6]
["Duncan",3,null,"Opies",5]
["nigra",3,null,"Pamelas",5]
["Povitica",3,null,"Scotts",5]
["Job",3,null,"Oh!",4]
["Macrobar",3,null,"Sarah",4]
["Diced",3,null,"Naturals",3]
["Dijon",3,null,"NOW",3]
["Glas",3,null,"Oats",3]
["Ltd",3,null,"OliveNation",3]
["Made",3,null,"Shop",3]
["Albanese",3,null,"Members",2]
["Candy",3,null,"Moon",2]
["Coffee",3,null,"Mos",2]
["Cranberrie",3,null,"Nestle",2]
["Fallot",3,null,"Newmans",2]
["Filbert",3,null,"Oasis",2]
["Kernel",3,null,"Own",2]
["One",3,null,"pack",2]
["Pc",3,null,"Peace",2]
["Pumpkin",3,null,"Pizazz",2]
["squirrel",3,null,"Povitica",2]
["Tear",3,null,"purely",2]
["вЂ",3,null,"Recipe",2]
["American",3,null,"Marmara",1]
["Amoretti",3,null,"Marshalls",1]
["Bean",3,null,"Mart",1]
["Bitter",3,null,"Mason",1]
["Blueberry",3,null,"MeadowCroft",1]
["Bundle",3,null,"Mediterra",1]
["Can",3,null,"MegaDeal",1]
["Candie",3,null,"Milked",1]
["Caramelized",3,null,"Mitica",1]
["Cherry",3,null,"Modern",1]
["CHIY",3,null,"Morello",1]
["Container",3,null,"Mountain",1]
["Cream",3,null,"Mr",1]
["Creamy",3,null,"Mrs",1]
["Dark",3,null,"music",1]
["Decadent",3,null,"My",1]
["Delight",3,null,"Nature",1]
["Direct",3,null,"New",1]
["Fancy",3,null,"Next",1]
["Fluid",3,null,"Niederegger",1]
["GBC",3,null,"NuGo",1]
["Handmade",3,null,"Nutrition",1]
["Herb",3,null,"Nutritious",1]
["Herbs",3,null,"Nutty",1]
["Juglan",3,null,"Oat",1]
["Loose",3,null,"Oatmeal",1]
["Love",3,null,"obtained",1]
["Maamoul",3,null,"ONNIT",1]
["Medley",3,null,"Organic",1]
["NOW",3,null,"Organics",1]
["Nutrition",3,null,"Pantry",1]
["Preserve",3,null,"Peanut",1]
["Rich",3,null,"Perfect",1]
["Sauce",3,null,"PersianBazzar",1]
["Size",3,null,"Personalization",1]
["Small",3,null,"PierMall",1]
["Specialty",3,null,"Planters",1]
["taste",3,null,"Poets",1]
["Tate",3,null,"Powder",1]
["Total",3,null,"Premium",1]
["Tropical",3,null,"Product",1]
["Walden",3,null,"Protein",1]
["Wood",3,null,"Q",1]
["Order",2,null,"NUTS",37]
["Low",2,null,"Foods",9]
["!!",2,null,"Signature",8]
["Butler",2,null,"Bella",7]
["ceremony",2,null,"Daily",6]
["Bake",2,null,"Trader",6]
["GoMacro",2,null,"Viva",6]
["Juice",2,null,"Artisana",5]
["Balsamic",2,null,"We",5]
["Main",2,null,"Anna",4]
["bakerie",2,null,"TerraVita",4]
["Futter",2,null,"Treasured",4]
["Good",2,null,"Albanese",3]
["Brown",2,null,"Steak",3]
["Crop",2,null,"Tates",3]
["Formula",2,null,"Walden",3]
["Liquid",2,null,"You",3]
["My",2,null,"Acres",2]
["Additive",2,null,"Sahale",2]
["Almonds",2,null,"Salad",2]
["Azar",2,null,"Silver",2]
["Cello",2,null,"Snacks",2]
["Cocktail",2,null,"Standart",2]
["Crazy",2,null,"Strawberry",2]
["Delish",2,null,"Sunbest",2]
["Elmhurst",2,null,"Tree",2]
["Gorilla",2,null,"Umpqua",2]
["Grandma",2,null,"UNFI",2]
["gx",2,null,"Walnuts",2]
["Lucini",2,null,"Wellnut",2]
["Malt",2,null,"Wheat",2]
["Meal",2,null,"#REF!",2]
["Only",2,null,20,1]
["Sun",2,null,"Ravenz",1]
["**",2,null,"Rawleigh",1]
["Acre",2,null,"Real",1]
["Added",2,null,"Roost",1]
["Adlay",2,null,"Russell",1]
["Alcohol",2,null,"Sahm",1]
["Awesome",2,null,"Sante",1]
["Baked",2,null,"Sarantis",1]
["Baklava",2,null,"Seed",1]
["Based",2,null,"Sees",1]
["Best",2,null,"SH",1]
["Biscotti",2,null,"Shelburne",1]
["Boxes",2,null,"ShopNatural",1]
["Bud",2,null,"Smallflower",1]
["Clear",2,null,"Smuckers",1]
["Clove",2,null,"Song",1]
["Compliant",2,null,"Spices",1]
["Craving",2,null,"Starwest",1]
["Crispy",2,null,"Stonewall",1]
["Dairy",2,null,"Store",1]
["DAMTUH",2,null,"Stover",1]
["Deli",2,null,"Sturdiwheat",1]
["elizabeth",2,null,"Super",1]
["Factor",2,null,"Superfoods",1]
["farmer",2,null,"SuperStrength",1]
["Fiber",2,null,"Supply",1]
["Filled",2,null,"Swanson",1]
["Finely",2,null,"Sweet",1]
["Flake",2,null,"SZSSS",1]
["Flavored",2,null,"Teas",1]
["Four",2,null,"Terrasoul",1]
["Freshest",2,null,"Thunderbird",1]
["Ghirardelli",2,null,"Touch",1]
["Glycerite",2,null,"Turkish",1]
["Gram",2,null,"Unknown",1]
["hand",2,null,"US",1]
["Herbal",2,null,"USA",1]
["highest",2,null,"Valley",1]
["Hill",2,null,"Vanilla",1]
["Hv",2,null,"Varietea",1]
["Item",2,null,"Vermont",1]
["Items",2,null,"Wellsley",1]
["Mark",2,null,"welovejam",1]
["market",2,null,"Wholesale",1]
["Medium",2,null,"Wild",1]
["Member",2,null,"Wilderness",1]
["Milked",2,null,"Wisconsin",1]
["Milled",2,null,"WishBone",1]
["Mo",2,null,"WT",1]
["Moon",2,null,"Xpress",1]
["More",2,null,"Xtra",1]
["Morning",2,null,"Yook",1]
["Multi",2,null,"Yu",1]
["New",2,null,"Zildek",1]
["Newman",2,null,"иїћеі°",1]
["OliveNation",2]
["Original",2]
["Ounces",2]
["Own",2]
["Package",2]
["Paleo",2]
["Peace",2]
["Pepper",2]
["Perfect",2]
["Pizazz",2]
["pk",2]
["Plastic",2]
["Pouch",2]
["Preservative",2]
["Probiotic",2]
["Pure",2]
["purely",2]
["Quassia",2]
["restaurant",2]
["Rosemary",2]
["Sampler",2]
["Savory",2]
["sesame",2]
{"$rows_left_out":405}
{"sheet":"csv","index":4,"n_rows":0,"n_cols":0,"rows_kept":0,"cut":false,"hidden":false,"merged":[]}