{"text_format":"1","workbook":"xlsx","n_sheets":5,"sheets":["февраль 2018","март 2018  ","апрель 2018 ","май 2018","мой"],"not_rendered":{"charts":0,"images":0,"macros":1,"external_links":0,"defined_names":1,"comments":0,"pivot_tables":0},"unopened":[],"bounds":{"document_bytes":16777216,"sheet_cells":100000,"rows_first":2000,"rows_last":500,"rows_between":2000,"halvings":0,"cell_chars":16384,"cell_head_chars":4096},"cells_cut":0,"cells_raw":0,"read":"whole","date_system":"1900"}

{"sheet":"февраль 2018","index":0,"n_rows":8,"n_cols":49,"rows_kept":8,"cut":false,"hidden":false,"merged":[]}
[]
["2018-02-01"]
["ФИО",1,2,3,4,5,6,7,8,9,10,11,12,13,14,1,2,3,4,5,6,7,8,9,10,11,12,13,14,15,16,17,18,19,20,21,22,23,24,25,26,27,28,29,30,31,"кол-во заказов","Даты заказов","Общая сумма"]
["КЛИЕНТ1",null,null,null,null,null,null,null,null,null,null,null,null,null,null,null,null,null,"   ",null,null,null,null,null,null,null,null,null,null,null,null,null,null,null,null,null,null,null,null,null,null,null,null,null,null,null,{"$f":"COUNT(P4:AT4)","v":0},{"$f":"сцепитьдаты(P4:AT4,A$2)","v":""},{"$f":"SUM(P4:AT4)","v":0}]
["КЛИЕНТ2",null,null,null,null,null,null,null,null,null,null,null,null,null,null,null,null,null,null,null,null,null,null,null,null,null,null,null,null,null,3454,null,null,null,null,6577,null,null,null,null,null,null,null,null,null,null,{"$f":"COUNT(P5:AT5)","v":2},{"$f":"сцепитьдаты(P5:AT5,A$2)","v":"16.2; 21.2; "},{"$f":"SUM(P5:AT5)","v":10031}]
["КЛИЕНТ3",null,null,null,null,null,null,null,null,null,null,null,null,null,null,null,null,null,null,null,null,null,null,null,null,null,null,null,null,null,null,5675,null,null,null,null,null,null,null,null,null,null,null,null,null,null,1,"17.2; ",5675]
["КЛИЕНТ4",null,null,null,null,null,null,null,null,null,null,null,null,null,null,null,null,null,null,null,null,2344,null,null,null,null,null,null,null,null,null,null,null,null,null,null,null,null,null,null,null,null,2456,null,null,null,2,"7.2; 28.2; ",4800]
["ИТОГО",null,null,null,null,null,null,null,null,null,null,null,null,null,null,{"$f":"SUM(P4:P7)","v":0},0,0,0,0,0,2344,0,0,0,0,0,0,0,{"$f":"SUM(AD4:AD7)","v":0},3454,5675,0,0,0,6577,0,null,{"$f":"SUM(AM4:AM7)","v":0},{"$f":"SUM(AN4:AN7)","v":0},{"$f":"SUM(AO4:AO7)","v":0},{"$f":"SUM(AP4:AP7)","v":0},null,null,null,null,null,null,{"$f":"SUM(AW4:AW7)","v":20506}]
{"$rows_left_out":1}
{"sheet":"март 2018  ","index":1,"n_rows":10,"n_cols":49,"rows_kept":10,"cut":false,"hidden":false,"merged":[]}
[]
["2018-03-01"]
["ФИО",1,2,3,4,5,6,7,8,9,10,11,12,13,14,1,2,3,4,5,6,7,8,9,10,11,12,13,14,15,16,17,18,19,20,21,22,23,24,25,26,27,28,29,30,31,"кол-во заказов","Даты заказов","Общая сумма"]
["КЛИЕНТ1",null,null,null,null,null,null,null,null,null,null,null,null,null,null,null,null,null,null,null,null,null,null,null,null,null,null,null,null,null,null,null,null,null,5565,null,null,null,null,null,null,null,null,null,null,null,{"$f":"COUNT(P4:AT4)","v":1},{"$f":"сцепитьдаты(P4:AT4,A$2)","v":"20.3; "},{"$f":"SUM(P4:AT4)","v":5565}]
["КЛИЕНТ2",null,null,null,null,null,null,null,null,null,null,null,null,null,null,null,null,null,null,null,null,null,null,null,null,null,null,null,null,null,3454,null,null,null,null,null,null,null,null,null,null,null,null,null,null,null,{"$f":"COUNT(P5:AT5)","v":1},{"$f":"сцепитьдаты(P5:AT5,A$2)","v":"16.3; "},{"$f":"SUM(P5:AT5)","v":3454}]
["КЛИЕНТ3",null,null,null,null,null,null,null,null,null,null,null,null,null,null,null,null,null,null,null,4678,null,null,null,null,2356,null,null,null,null,null,5675,null,null,null,null,null,null,null,null,null,null,null,null,null,null,{"$f":"COUNT(P6:AT6)","v":3},{"$f":"сцепитьдаты(P6:AT6,A$2)","v":"6.3; 11.3; 17.3; "},{"$f":"SUM(P6:AT6)","v":12709}]
["КЛИЕНТ4",null,null,null,null,null,null,null,null,null,null,null,null,null,null,null,null,null,null,null,null,null,null,null,null,null,null,null,null,null,null,null,null,null,null,null,null,null,null,null,null,null,null,null,null,null,{"$f":"COUNT(P7:AT7)","v":0},{"$f":"сцепитьдаты(P7:AT7,A$2)","v":""},{"$f":"SUM(P7:AT7)","v":0}]
["КЛИЕНТ5",null,null,null,null,null,null,null,null,null,null,null,null,null,null,null,null,null,null,null,null,null,null,null,null,null,null,null,null,null,null,null,null,null,null,null,2345,null,null,null,null,null,null,null,null,null,{"$f":"COUNT(P8:AT8)","v":1},{"$f":"сцепитьдаты(P8:AT8,A$2)","v":"22.3; "},{"$f":"SUM(P8:AT8)","v":2345}]
{"$rows_left_out":3}
{"sheet":"апрель 2018 ","index":2,"n_rows":12,"n_cols":49,"rows_kept":12,"cut":false,"hidden":false,"merged":[]}
[]
["2018-04-01"]
["ФИО",1,2,3,4,5,6,7,8,9,10,11,12,13,14,1,2,3,4,5,6,7,8,9,10,11,12,13,14,15,16,17,18,19,20,21,22,23,24,25,26,27,28,29,30,31,"кол-во заказов","Даты заказов","Общая сумма"]
["КЛИЕНТ1",null,null,null,null,null,null,null,null,null,null,null,null,null,null,null,null,null,null,5675,null,null,null,null,null,null,null,null,null,null,null,null,null,null,null,null,null,null,null,null,null,null,null,null,null,null,{"$f":"COUNT(P4:AT4)","v":1},{"$f":"сцепитьдаты(P4:AT4,A$2)","v":"5.4; "},{"$f":"SUM(P4:AT4)","v":5675}]
["КЛИЕНТ2",null,null,null,null,null,null,null,null,null,null,null,null,null,null,null,null,null,null,null,null,null,null,null,null,null,null,null,null,null,3454,null,null,null,null,null,null,null,null,null,null,null,null,null,null,null,{"$f":"COUNT(P5:AT5)","v":1},{"$f":"сцепитьдаты(P5:AT5,A$2)","v":"16.4; "},{"$f":"SUM(P5:AT5)","v":3454}]
["КЛИЕНТ3",null,null,null,null,null,null,null,null,null,null,null,null,null,null,null,null,null,null,null,null,null,null,null,2345,null,null,null,null,null,null,5675,null,null,null,null,null,null,null,null,null,null,null,null,null,null,{"$f":"COUNT(P6:AT6)","v":2},{"$f":"сцепитьдаты(P6:AT6,A$2)","v":"10.4; 17.4; "},{"$f":"SUM(P6:AT6)","v":8020}]
["КЛИЕНТ4",null,null,null,null,null,null,null,null,null,null,null,null,null,null,null,null,null,null,null,null,4565,null,null,null,null,null,null,null,null,null,null,null,null,null,null,null,null,null,null,null,null,null,null,null,null,{"$f":"COUNT(P7:AT7)","v":1},{"$f":"сцепитьдаты(P7:AT7,A$2)","v":"7.4; "},{"$f":"SUM(P7:AT7)","v":4565}]
["КЛИЕНТ5",null,null,null,null,null,null,null,null,null,null,null,null,null,null,null,null,null,null,null,null,null,null,null,null,null,null,null,2345,null,null,null,null,null,null,null,2345,null,null,null,null,null,null,null,null,null,{"$f":"COUNT(P8:AT8)","v":2},{"$f":"сцепитьдаты(P8:AT8,A$2)","v":"14.4; 22.4; "},{"$f":"SUM(P8:AT8)","v":4690}]
{"$rows_left_out":5}
{"sheet":"май 2018","index":3,"n_rows":14,"n_cols":49,"rows_kept":14,"cut":false,"hidden":false,"merged":[]}
[]
["2018-05-01"]
["ФИО",1,2,3,4,5,6,7,8,9,10,11,12,13,14,1,2,3,4,5,6,7,8,9,10,11,12,13,14,15,16,17,18,19,20,21,22,23,24,25,26,27,28,29,30,31,"кол-во заказов","Даты заказов","Общая сумма"]
["КЛИЕНТ1",null,null,null,null,null,null,null,null,null,null,null,null,null,null,null,null,2144,null,null,null,null,null,null,null,null,null,null,null,null,null,null,2144,null,null,null,null,null,null,null,null,null,4354,null,null,null,{"$f":"COUNT(P4:AT4)","v":3},{"$f":"сцепитьдаты(P4:AT4,A$2)","v":"3.5; 18.5; 28.5; "},{"$f":"SUM(P4:AT4)","v":8642}]
["КЛИЕНТ2",null,null,null,null,null,null,null,null,null,null,null,null,null,null,null,null,null,null,null,null,null,null,null,null,2144,null,null,null,null,null,null,null,null,null,null,null,null,null,null,4467,null,null,null,null,null,{"$f":"COUNT(P5:AT5)","v":2},{"$f":"сцепитьдаты(P5:AT5,A$2)","v":"11.5; 26.5; "},{"$f":"SUM(P5:AT5)","v":6611}]
["КЛИЕНТ3",null,null,null,null,null,null,null,null,null,null,null,null,null,null,1234,null,null,null,null,2315,null,null,null,null,null,null,null,null,null,null,null,null,4467,null,2315,null,null,null,null,null,null,null,null,null,null,{"$f":"COUNT(P6:AT6)","v":4},{"$f":"сцепитьдаты(P6:AT6,A$2)","v":"1.5; 6.5; 19.5; 21.5; "},{"$f":"SUM(P6:AT6)","v":10331}]
["КЛИЕНТ4",null,null,null,null,null,null,null,null,null,null,null,null,null,null,null,null,null,null,null,null,null,2132,null,null,null,null,null,2315,null,null,null,null,null,null,null,null,2132,null,null,null,null,null,null,null,null,{"$f":"COUNT(P7:AT7)","v":3},{"$f":"сцепитьдаты(P7:AT7,A$2)","v":"8.5; 14.5; 23.5; "},{"$f":"SUM(P7:AT7)","v":6579}]
["КЛИЕНТ5",null,null,null,null,null,null,null,null,null,null,null,null,null,null,null,null,null,null,null,null,null,null,null,null,null,null,null,null,null,2132,null,null,null,null,null,null,null,null,null,null,null,null,null,null,null,{"$f":"COUNT(P8:AT8)","v":1},{"$f":"сцепитьдаты(P8:AT8,A$2)","v":"16.5; "},{"$f":"SUM(P8:AT8)","v":2132}]
{"$rows_left_out":7}
{"sheet":"мой","index":4,"n_rows":20,"n_cols":15,"rows_kept":20,"cut":false,"hidden":false,"merged":[[0,1,0,3],[0,4,0,6],[0,7,0,9],[0,10,0,12]]}
[null,"ФЕВРАЛЬ",null,null,"МАРТ",null,null,"АПРЕЛЬ",null,null,"МАЙ"]
["Фамилия","кол-во заказов ","Суммы ??? заказов ","Общая сумма ","Количество заказов ","Суммы заказов ","Общая сумма ","Количество заказов ","Суммы заказов ","Общая сумма ","Количество заказов ","Суммы заказов ","Общая сумма ","Даты заказов","Общая сумма заказов"]
["КЛИЕНТ1",{"$f":"IFERROR(INDEX(INDIRECT(\"'\"&LOOKUP(\"яяя\",$B$1:B$1)&\"*'!Au:Au\"),MATCH($A3,INDIRECT(\"'\"&LOOKUP(\"яяя\",$B$1:B$1)&\"*'!A1:A99\"),)),)","v":0},{"$f":"IFERROR(INDEX(INDIRECT(\"'\"&LOOKUP(\"яяя\",$B$1:C$1)&\"*'!Av:Av\"),MATCH($A3,INDIRECT(\"'\"&LOOKUP(\"яяя\",$B$1:B$1)&\"*'!A1:A99\"),)),)","v":""},{"$f":"IFERROR(INDEX(INDIRECT(\"'\"&LOOKUP(\"яяя\",$B$1:D$1)&\"*'!Aw:Aw\"),MATCH($A3,INDIRECT(\"'\"&LOOKUP(\"яяя\",$B$1:B$1)&\"*'!A1:A99\"),)),)","v":0},{"$f":"IFERROR(INDEX(INDIRECT(\"'\"&LOOKUP(\"яяя\",$B$1:E$1)&\"*'!Au:Au\"),MATCH($A3,INDIRECT(\"'\"&LOOKUP(\"яяя\",$B$1:E$1)&\"*'!A1:A99\"),)),)","v":1},{"$f":"IFERROR(INDEX(INDIRECT(\"'\"&LOOKUP(\"яяя\",$B$1:F$1)&\"*'!Av:Av\"),MATCH($A3,INDIRECT(\"'\"&LOOKUP(\"яяя\",$B$1:E$1)&\"*'!A1:A99\"),)),)","v":"20.3; "},{"$f":"IFERROR(INDEX(INDIRECT(\"'\"&LOOKUP(\"яяя\",$B$1:G$1)&\"*'!Aw:Aw\"),MATCH($A3,INDIRECT(\"'\"&LOOKUP(\"яяя\",$B$1:E$1)&\"*'!A1:A99\"),)),)","v":5565},{"$f":"IFERROR(INDEX(INDIRECT(\"'\"&LOOKUP(\"яяя\",$B$1:H$1)&\"*'!Au:Au\"),MATCH($A3,INDIRECT(\"'\"&LOOKUP(\"яяя\",$B$1:H$1)&\"*'!A1:A99\"),)),)","v":1},{"$f":"IFERROR(INDEX(INDIRECT(\"'\"&LOOKUP(\"яяя\",$B$1:I$1)&\"*'!Av:Av\"),MATCH($A3,INDIRECT(\"'\"&LOOKUP(\"яяя\",$B$1:H$1)&\"*'!A1:A99\"),)),)","v":"5.4; "},{"$f":"IFERROR(INDEX(INDIRECT(\"'\"&LOOKUP(\"яяя\",$B$1:J$1)&\"*'!Aw:Aw\"),MATCH($A3,INDIRECT(\"'\"&LOOKUP(\"яяя\",$B$1:H$1)&\"*'!A1:A99\"),)),)","v":5675},{"$f":"IFERROR(INDEX(INDIRECT(\"'\"&LOOKUP(\"яяя\",$B$1:K$1)&\"*'!Au:Au\"),MATCH($A3,INDIRECT(\"'\"&LOOKUP(\"яяя\",$B$1:K$1)&\"*'!A1:A99\"),)),)","v":3},{"$f":"IFERROR(INDEX(INDIRECT(\"'\"&LOOKUP(\"яяя\",$B$1:L$1)&\"*'!Av:Av\"),MATCH($A3,INDIRECT(\"'\"&LOOKUP(\"яяя\",$B$1:K$1)&\"*'!A1:A99\"),)),)","v":"3.5; 18.5; 28.5; "},{"$f":"IFERROR(INDEX(INDIRECT(\"'\"&LOOKUP(\"яяя\",$B$1:M$1)&\"*'!Aw:Aw\"),MATCH($A3,INDIRECT(\"'\"&LOOKUP(\"яяя\",$B$1:K$1)&\"*'!A1:A99\"),)),)","v":8642},{"$f":"CONCATENATE(C3, F3, I3,  L3)","v":"20.3; 5.4; 3.5; 18.5; 28.5; "},{"$f":"SUMIF(A$2:N$2,\"Общая сумма \",A3:N3)","v":19882}]
["КЛИЕНТ2",{"$f":"IFERROR(INDEX(INDIRECT(\"'\"&LOOKUP(\"яяя\",$B$1:B$1)&\"*'!Au:Au\"),MATCH($A4,INDIRECT(\"'\"&LOOKUP(\"яяя\",$B$1:B$1)&\"*'!A1:A99\"),)),)","v":2},{"$f":"IFERROR(INDEX(INDIRECT(\"'\"&LOOKUP(\"яяя\",$B$1:C$1)&\"*'!Av:Av\"),MATCH($A4,INDIRECT(\"'\"&LOOKUP(\"яяя\",$B$1:B$1)&\"*'!A1:A99\"),)),)","v":"16.2; 21.2; "},{"$f":"IFERROR(INDEX(INDIRECT(\"'\"&LOOKUP(\"яяя\",$B$1:D$1)&\"*'!Aw:Aw\"),MATCH($A4,INDIRECT(\"'\"&LOOKUP(\"яяя\",$B$1:B$1)&\"*'!A1:A99\"),)),)","v":10031},{"$f":"IFERROR(INDEX(INDIRECT(\"'\"&LOOKUP(\"яяя\",$B$1:E$1)&\"*'!Au:Au\"),MATCH($A4,INDIRECT(\"'\"&LOOKUP(\"яяя\",$B$1:E$1)&\"*'!A1:A99\"),)),)","v":1},{"$f":"IFERROR(INDEX(INDIRECT(\"'\"&LOOKUP(\"яяя\",$B$1:F$1)&\"*'!Av:Av\"),MATCH($A4,INDIRECT(\"'\"&LOOKUP(\"яяя\",$B$1:E$1)&\"*'!A1:A99\"),)),)","v":"16.3; "},{"$f":"IFERROR(INDEX(INDIRECT(\"'\"&LOOKUP(\"яяя\",$B$1:G$1)&\"*'!Aw:Aw\"),MATCH($A4,INDIRECT(\"'\"&LOOKUP(\"яяя\",$B$1:E$1)&\"*'!A1:A99\"),)),)","v":3454},{"$f":"IFERROR(INDEX(INDIRECT(\"'\"&LOOKUP(\"яяя\",$B$1:H$1)&\"*'!Au:Au\"),MATCH($A4,INDIRECT(\"'\"&LOOKUP(\"яяя\",$B$1:H$1)&\"*'!A1:A99\"),)),)","v":1},{"$f":"IFERROR(INDEX(INDIRECT(\"'\"&LOOKUP(\"яяя\",$B$1:I$1)&\"*'!Av:Av\"),MATCH($A4,INDIRECT(\"'\"&LOOKUP(\"яяя\",$B$1:H$1)&\"*'!A1:A99\"),)),)","v":"16.4; "},{"$f":"IFERROR(INDEX(INDIRECT(\"'\"&LOOKUP(\"яяя\",$B$1:J$1)&\"*'!Aw:Aw\"),MATCH($A4,INDIRECT(\"'\"&LOOKUP(\"яяя\",$B$1:H$1)&\"*'!A1:A99\"),)),)","v":3454},{"$f":"IFERROR(INDEX(INDIRECT(\"'\"&LOOKUP(\"яяя\",$B$1:K$1)&\"*'!Au:Au\"),MATCH($A4,INDIRECT(\"'\"&LOOKUP(\"яяя\",$B$1:K$1)&\"*'!A1:A99\"),)),)","v":2},{"$f":"IFERROR(INDEX(INDIRECT(\"'\"&LOOKUP(\"яяя\",$B$1:L$1)&\"*'!Av:Av\"),MATCH($A4,INDIRECT(\"'\"&LOOKUP(\"яяя\",$B$1:K$1)&\"*'!A1:A99\"),)),)","v":"11.5; 26.5; "},{"$f":"IFERROR(INDEX(INDIRECT(\"'\"&LOOKUP(\"яяя\",$B$1:M$1)&\"*'!Aw:Aw\"),MATCH($A4,INDIRECT(\"'\"&LOOKUP(\"яяя\",$B$1:K$1)&\"*'!A1:A99\"),)),)","v":6611},{"$f":"CONCATENATE(C4, F4, I4,  L4)","v":"16.2; 21.2; 16.3; 16.4; 11.5; 26.5; "},{"$f":"SUMIF(A$2:N$2,\"Общая сумма \",A4:N4)","v":23550}]
["КЛИЕНТ3",{"$f":"IFERROR(INDEX(INDIRECT(\"'\"&LOOKUP(\"яяя\",$B$1:B$1)&\"*'!Au:Au\"),MATCH($A5,INDIRECT(\"'\"&LOOKUP(\"яяя\",$B$1:B$1)&\"*'!A1:A99\"),)),)","v":1},{"$f":"IFERROR(INDEX(INDIRECT(\"'\"&LOOKUP(\"яяя\",$B$1:C$1)&\"*'!Av:Av\"),MATCH($A5,INDIRECT(\"'\"&LOOKUP(\"яяя\",$B$1:B$1)&\"*'!A1:A99\"),)),)","v":"17.2; "},{"$f":"IFERROR(INDEX(INDIRECT(\"'\"&LOOKUP(\"яяя\",$B$1:D$1)&\"*'!Aw:Aw\"),MATCH($A5,INDIRECT(\"'\"&LOOKUP(\"яяя\",$B$1:B$1)&\"*'!A1:A99\"),)),)","v":5675},{"$f":"IFERROR(INDEX(INDIRECT(\"'\"&LOOKUP(\"яяя\",$B$1:E$1)&\"*'!Au:Au\"),MATCH($A5,INDIRECT(\"'\"&LOOKUP(\"яяя\",$B$1:E$1)&\"*'!A1:A99\"),)),)","v":3},{"$f":"IFERROR(INDEX(INDIRECT(\"'\"&LOOKUP(\"яяя\",$B$1:F$1)&\"*'!Av:Av\"),MATCH($A5,INDIRECT(\"'\"&LOOKUP(\"яяя\",$B$1:E$1)&\"*'!A1:A99\"),)),)","v":"6.3; 11.3; 17.3; "},{"$f":"IFERROR(INDEX(INDIRECT(\"'\"&LOOKUP(\"яяя\",$B$1:G$1)&\"*'!Aw:Aw\"),MATCH($A5,INDIRECT(\"'\"&LOOKUP(\"яяя\",$B$1:E$1)&\"*'!A1:A99\"),)),)","v":12709},{"$f":"IFERROR(INDEX(INDIRECT(\"'\"&LOOKUP(\"яяя\",$B$1:H$1)&\"*'!Au:Au\"),MATCH($A5,INDIRECT(\"'\"&LOOKUP(\"яяя\",$B$1:H$1)&\"*'!A1:A99\"),)),)","v":2},{"$f":"IFERROR(INDEX(INDIRECT(\"'\"&LOOKUP(\"яяя\",$B$1:I$1)&\"*'!Av:Av\"),MATCH($A5,INDIRECT(\"'\"&LOOKUP(\"яяя\",$B$1:H$1)&\"*'!A1:A99\"),)),)","v":"10.4; 17.4; "},{"$f":"IFERROR(INDEX(INDIRECT(\"'\"&LOOKUP(\"яяя\",$B$1:J$1)&\"*'!Aw:Aw\"),MATCH($A5,INDIRECT(\"'\"&LOOKUP(\"яяя\",$B$1:H$1)&\"*'!A1:A99\"),)),)","v":8020},{"$f":"IFERROR(INDEX(INDIRECT(\"'\"&LOOKUP(\"яяя\",$B$1:K$1)&\"*'!Au:Au\"),MATCH($A5,INDIRECT(\"'\"&LOOKUP(\"яяя\",$B$1:K$1)&\"*'!A1:A99\"),)),)","v":4},{"$f":"IFERROR(INDEX(INDIRECT(\"'\"&LOOKUP(\"яяя\",$B$1:L$1)&\"*'!Av:Av\"),MATCH($A5,INDIRECT(\"'\"&LOOKUP(\"яяя\",$B$1:K$1)&\"*'!A1:A99\"),)),)","v":"1.5; 6.5; 19.5; 21.5; "},{"$f":"IFERROR(INDEX(INDIRECT(\"'\"&LOOKUP(\"яяя\",$B$1:M$1)&\"*'!Aw:Aw\"),MATCH($A5,INDIRECT(\"'\"&LOOKUP(\"яяя\",$B$1:K$1)&\"*'!A1:A99\"),)),)","v":10331},"17.2; 6.3; 11.3; 17.3; 10.4; 17.4; 1.5; 6.5; 19.5; 21.5; ",36735]
["КЛИЕНТ4",{"$f":"IFERROR(INDEX(INDIRECT(\"'\"&LOOKUP(\"яяя\",$B$1:B$1)&\"*'!Au:Au\"),MATCH($A6,INDIRECT(\"'\"&LOOKUP(\"яяя\",$B$1:B$1)&\"*'!A1:A99\"),)),)","v":2},{"$f":"IFERROR(INDEX(INDIRECT(\"'\"&LOOKUP(\"яяя\",$B$1:C$1)&\"*'!Av:Av\"),MATCH($A6,INDIRECT(\"'\"&LOOKUP(\"яяя\",$B$1:B$1)&\"*'!A1:A99\"),)),)","v":"7.2; 28.2; "},{"$f":"IFERROR(INDEX(INDIRECT(\"'\"&LOOKUP(\"яяя\",$B$1:D$1)&\"*'!Aw:Aw\"),MATCH($A6,INDIRECT(\"'\"&LOOKUP(\"яяя\",$B$1:B$1)&\"*'!A1:A99\"),)),)","v":4800},{"$f":"IFERROR(INDEX(INDIRECT(\"'\"&LOOKUP(\"яяя\",$B$1:E$1)&\"*'!Au:Au\"),MATCH($A6,INDIRECT(\"'\"&LOOKUP(\"яяя\",$B$1:E$1)&\"*'!A1:A99\"),)),)","v":0},{"$f":"IFERROR(INDEX(INDIRECT(\"'\"&LOOKUP(\"яяя\",$B$1:F$1)&\"*'!Av:Av\"),MATCH($A6,INDIRECT(\"'\"&LOOKUP(\"яяя\",$B$1:E$1)&\"*'!A1:A99\"),)),)","v":""},{"$f":"IFERROR(INDEX(INDIRECT(\"'\"&LOOKUP(\"яяя\",$B$1:G$1)&\"*'!Aw:Aw\"),MATCH($A6,INDIRECT(\"'\"&LOOKUP(\"яяя\",$B$1:E$1)&\"*'!A1:A99\"),)),)","v":0},{"$f":"IFERROR(INDEX(INDIRECT(\"'\"&LOOKUP(\"яяя\",$B$1:H$1)&\"*'!Au:Au\"),MATCH($A6,INDIRECT(\"'\"&LOOKUP(\"яяя\",$B$1:H$1)&\"*'!A1:A99\"),)),)","v":1},{"$f":"IFERROR(INDEX(INDIRECT(\"'\"&LOOKUP(\"яяя\",$B$1:I$1)&\"*'!Av:Av\"),MATCH($A6,INDIRECT(\"'\"&LOOKUP(\"яяя\",$B$1:H$1)&\"*'!A1:A99\"),)),)","v":"7.4; "},{"$f":"IFERROR(INDEX(INDIRECT(\"'\"&LOOKUP(\"яяя\",$B$1:J$1)&\"*'!Aw:Aw\"),MATCH($A6,INDIRECT(\"'\"&LOOKUP(\"яяя\",$B$1:H$1)&\"*'!A1:A99\"),)),)","v":4565},{"$f":"IFERROR(INDEX(INDIRECT(\"'\"&LOOKUP(\"яяя\",$B$1:K$1)&\"*'!Au:Au\"),MATCH($A6,INDIRECT(\"'\"&LOOKUP(\"яяя\",$B$1:K$1)&\"*'!A1:A99\"),)),)","v":3},{"$f":"IFERROR(INDEX(INDIRECT(\"'\"&LOOKUP(\"яяя\",$B$1:L$1)&\"*'!Av:Av\"),MATCH($A6,INDIRECT(\"'\"&LOOKUP(\"яяя\",$B$1:K$1)&\"*'!A1:A99\"),)),)","v":"8.5; 14.5; 23.5; "},{"$f":"IFERROR(INDEX(INDIRECT(\"'\"&LOOKUP(\"яяя\",$B$1:M$1)&\"*'!Aw:Aw\"),MATCH($A6,INDIRECT(\"'\"&LOOKUP(\"яяя\",$B$1:K$1)&\"*'!A1:A99\"),)),)","v":6579},"7.2; 28.2; 7.4; 8.5; 14.5; 23.5; ",15944]
["КЛИЕНТ5",{"$f":"IFERROR(INDEX(INDIRECT(\"'\"&LOOKUP(\"яяя\",$B$1:B$1)&\"*'!Au:Au\"),MATCH($A7,INDIRECT(\"'\"&LOOKUP(\"яяя\",$B$1:B$1)&\"*'!A1:A99\"),)),)","v":0},{"$f":"IFERROR(INDEX(INDIRECT(\"'\"&LOOKUP(\"яяя\",$B$1:C$1)&\"*'!Av:Av\"),MATCH($A7,INDIRECT(\"'\"&LOOKUP(\"яяя\",$B$1:B$1)&\"*'!A1:A99\"),)),)","v":0},{"$f":"IFERROR(INDEX(INDIRECT(\"'\"&LOOKUP(\"яяя\",$B$1:D$1)&\"*'!Aw:Aw\"),MATCH($A7,INDIRECT(\"'\"&LOOKUP(\"яяя\",$B$1:B$1)&\"*'!A1:A99\"),)),)","v":0},{"$f":"IFERROR(INDEX(INDIRECT(\"'\"&LOOKUP(\"яяя\",$B$1:E$1)&\"*'!Au:Au\"),MATCH($A7,INDIRECT(\"'\"&LOOKUP(\"яяя\",$B$1:E$1)&\"*'!A1:A99\"),)),)","v":1},{"$f":"IFERROR(INDEX(INDIRECT(\"'\"&LOOKUP(\"яяя\",$B$1:F$1)&\"*'!Av:Av\"),MATCH($A7,INDIRECT(\"'\"&LOOKUP(\"яяя\",$B$1:E$1)&\"*'!A1:A99\"),)),)","v":"22.3; "},{"$f":"IFERROR(INDEX(INDIRECT(\"'\"&LOOKUP(\"яяя\",$B$1:G$1)&\"*'!Aw:Aw\"),MATCH($A7,INDIRECT(\"'\"&LOOKUP(\"яяя\",$B$1:E$1)&\"*'!A1:A99\"),)),)","v":2345},{"$f":"IFERROR(INDEX(INDIRECT(\"'\"&LOOKUP(\"яяя\",$B$1:H$1)&\"*'!Au:Au\"),MATCH($A7,INDIRECT(\"'\"&LOOKUP(\"яяя\",$B$1:H$1)&\"*'!A1:A99\"),)),)","v":2},{"$f":"IFERROR(INDEX(INDIRECT(\"'\"&LOOKUP(\"яяя\",$B$1:I$1)&\"*'!Av:Av\"),MATCH($A7,INDIRECT(\"'\"&LOOKUP(\"яяя\",$B$1:H$1)&\"*'!A1:A99\"),)),)","v":"14.4; 22.4; "},{"$f":"IFERROR(INDEX(INDIRECT(\"'\"&LOOKUP(\"яяя\",$B$1:J$1)&\"*'!Aw:Aw\"),MATCH($A7,INDIRECT(\"'\"&LOOKUP(\"яяя\",$B$1:H$1)&\"*'!A1:A99\"),)),)","v":4690},{"$f":"IFERROR(INDEX(INDIRECT(\"'\"&LOOKUP(\"яяя\",$B$1:K$1)&\"*'!Au:Au\"),MATCH($A7,INDIRECT(\"'\"&LOOKUP(\"яяя\",$B$1:K$1)&\"*'!A1:A99\"),)),)","v":1},{"$f":"IFERROR(INDEX(INDIRECT(\"'\"&LOOKUP(\"яяя\",$B$1:L$1)&\"*'!Av:Av\"),MATCH($A7,INDIRECT(\"'\"&LOOKUP(\"яяя\",$B$1:K$1)&\"*'!A1:A99\"),)),)","v":"16.5; "},{"$f":"IFERROR(INDEX(INDIRECT(\"'\"&LOOKUP(\"яяя\",$B$1:M$1)&\"*'!Aw:Aw\"),MATCH($A7,INDIRECT(\"'\"&LOOKUP(\"яяя\",$B$1:K$1)&\"*'!A1:A99\"),)),)","v":2132},"022.3; 14.4; 22.4; 16.5; ",9167]
["КЛИЕНТ6",{"$f":"IFERROR(INDEX(INDIRECT(\"'\"&LOOKUP(\"яяя\",$B$1:B$1)&\"*'!Au:Au\"),MATCH($A8,INDIRECT(\"'\"&LOOKUP(\"яяя\",$B$1:B$1)&\"*'!A1:A99\"),)),)","v":0},{"$f":"IFERROR(INDEX(INDIRECT(\"'\"&LOOKUP(\"яяя\",$B$1:C$1)&\"*'!Av:Av\"),MATCH($A8,INDIRECT(\"'\"&LOOKUP(\"яяя\",$B$1:B$1)&\"*'!A1:A99\"),)),)","v":0},{"$f":"IFERROR(INDEX(INDIRECT(\"'\"&LOOKUP(\"яяя\",$B$1:D$1)&\"*'!Aw:Aw\"),MATCH($A8,INDIRECT(\"'\"&LOOKUP(\"яяя\",$B$1:B$1)&\"*'!A1:A99\"),)),)","v":0},{"$f":"IFERROR(INDEX(INDIRECT(\"'\"&LOOKUP(\"яяя\",$B$1:E$1)&\"*'!Au:Au\"),MATCH($A8,INDIRECT(\"'\"&LOOKUP(\"яяя\",$B$1:E$1)&\"*'!A1:A99\"),)),)","v":2},{"$f":"IFERROR(INDEX(INDIRECT(\"'\"&LOOKUP(\"яяя\",$B$1:F$1)&\"*'!Av:Av\"),MATCH($A8,INDIRECT(\"'\"&LOOKUP(\"яяя\",$B$1:E$1)&\"*'!A1:A99\"),)),)","v":"4.3; 19.3; "},{"$f":"IFERROR(INDEX(INDIRECT(\"'\"&LOOKUP(\"яяя\",$B$1:G$1)&\"*'!Aw:Aw\"),MATCH($A8,INDIRECT(\"'\"&LOOKUP(\"яяя\",$B$1:E$1)&\"*'!A1:A99\"),)),)","v":5778},{"$f":"IFERROR(INDEX(INDIRECT(\"'\"&LOOKUP(\"яяя\",$B$1:H$1)&\"*'!Au:Au\"),MATCH($A8,INDIRECT(\"'\"&LOOKUP(\"яяя\",$B$1:H$1)&\"*'!A1:A99\"),)),)","v":3},{"$f":"IFERROR(INDEX(INDIRECT(\"'\"&LOOKUP(\"яяя\",$B$1:I$1)&\"*'!Av:Av\"),MATCH($A8,INDIRECT(\"'\"&LOOKUP(\"яяя\",$B$1:H$1)&\"*'!A1:A99\"),)),)","v":"9.4; 11.4; 19.4; "},{"$f":"IFERROR(INDEX(INDIRECT(\"'\"&LOOKUP(\"яяя\",$B$1:J$1)&\"*'!Aw:Aw\"),MATCH($A8,INDIRECT(\"'\"&LOOKUP(\"яяя\",$B$1:H$1)&\"*'!A1:A99\"),)),)","v":11364},{"$f":"IFERROR(INDEX(INDIRECT(\"'\"&LOOKUP(\"яяя\",$B$1:K$1)&\"*'!Au:Au\"),MATCH($A8,INDIRECT(\"'\"&LOOKUP(\"яяя\",$B$1:K$1)&\"*'!A1:A99\"),)),)","v":1},{"$f":"IFERROR(INDEX(INDIRECT(\"'\"&LOOKUP(\"яяя\",$B$1:L$1)&\"*'!Av:Av\"),MATCH($A8,INDIRECT(\"'\"&LOOKUP(\"яяя\",$B$1:K$1)&\"*'!A1:A99\"),)),)","v":"14.5; "},{"$f":"IFERROR(INDEX(INDIRECT(\"'\"&LOOKUP(\"яяя\",$B$1:M$1)&\"*'!Aw:Aw\"),MATCH($A8,INDIRECT(\"'\"&LOOKUP(\"яяя\",$B$1:K$1)&\"*'!A1:A99\"),)),)","v":3245},"04.3; 19.3; 9.4; 11.4; 19.4; 14.5; ",20387]
{"$rows_left_out":12}